{"text_format":"1","workbook":"xlsx","n_sheets":11,"sheets":["IRR Model","IRR PILOT Summary by Region","3. Calculator-raw","1. Overview","2. User Instructions","3. Calculator One","4. Calculator Two","4. Calculator Two (Old)","Sheet2","4. Heat Map - IRR","5. Heat Map - PILOT"],"not_rendered":{"charts":0,"images":1,"macros":1,"external_links":2,"defined_names":444,"comments":1,"pivot_tables":0},"unopened":[],"bounds":{"document_bytes":16777216,"sheet_cells":100000,"rows_first":2000,"rows_last":500,"rows_between":2000,"halvings":0,"cell_chars":16384,"cell_head_chars":4096},"cells_cut":0,"cells_raw":0,"read":"whole","date_system":"1900"}

{"sheet":"IRR Model","index":0,"n_rows":126,"n_cols":41,"rows_kept":126,"cut":false,"hidden":true,"merged":[[7,24,7,25]]}
[]
[null,"NYSERDA - NYS Property Tax Model"]
[null,"Operating Model"]
[]
["x","Project Assumptions - YELLOW REQUIRES INPUT"]
[]
[null,"Region Specific Assumptions",null,null,null,null,null,"PILOT Calculation",null,null,null,null,null,null,null,"PILOT Sensitivity Analysis",null,null,null,null,null,"MW Block Assumption"]
[null,"Active Utility Region",null,null,null,"RG&E",null,"Investor NPV Pre-PILOT",null,null,"[$]",{"$f":"NPV($F$16,F94:AE94)*1000","v":-160908.1236479755},null,null,null,null,null,null,null,null,null,"Block","PBI Rate",null,"Locational Adder Logic Table",null,null,"Pilot Rate"]
[null,"CDG?",null,null,null,"Yes",null,"Investor target Pre-tax IRR",null,null,"[%]",{"$f":"$F$16","v":3.2500000000000001E-2},null,null,null,"PILOT Sensitivity ($/MWh) / (% of Retail Rate)",null,null,null,null,null,"Block 1 ConEd",0.17899999999999999,null,"Yes",1.2,null,0.01]
[null,"Year-1 Solar Net Metering Credit Value",null,null,"[$/kWh]",{"$f":"VLOOKUP($F$8,$H$20:$L$27,COLUMNS($H$21:$I$21),0)","v":9.5000000000000001E-2},null,"Annual PILOT Budget @ Target IRR",null,null,"[$]",{"$f":"-PMT($F$16,$F$106,L8)","v":-13723.62532908174},null,null,null,null,null,null,null,null,null,"Block 2 ConEd",0.17299999999999999,null,"No",1,null,1.4999999999999999E-2]
{"$rows_left_out":117}
{"sheet":"IRR PILOT Summary by Region","index":1,"n_rows":69,"n_cols":17,"rows_kept":69,"cut":false,"hidden":true,"merged":[]}
[]
[null,"NYSERDA - NYS Property Tax Model"]
[null,"PILOT Summary by Region & Key Economic Driver"]
[]
[null,"Tranche 0"," - IRR Based PILOT Amount ($/MWh / % of Retail Rate)"]
[]
[null,"CHG&E",null,null,null,null,"O&R",null,null,null,null,"NGRID"]
[]
[null,"Build Cost","Customer Energy Discount (%)",null,null,null,"Build Cost","Customer Energy Discount (%)",null,null,null,"Build Cost","Customer Energy Discount (%)"]
[null,"Delta ($/W) ",0.2,0.15,0.1,null,"Delta ($/W) ",0.2,0.15,0.1,null,"Delta ($/W) ",0.2,0.15,0.1]
{"$rows_left_out":60}
{"sheet":"3. Calculator-raw","index":2,"n_rows":134,"n_cols":44,"rows_kept":134,"cut":false,"hidden":true,"merged":[[6,10,9,14],[31,27,32,27]]}
[]
[null,"Property Tax Model (DRAFT)"]
[null,"Operating Model"]
[]
["x","Project Assumptions - YELLOW REQUIRES INPUT",null,null,null,null,null,null,null,null,"Model Output - PILOT Estimates"]
[]
[null,"Region Specific Assumptions",null,null,null,null,null,null,null,null,"PILOT Calculation",null,null,null,null,null,null,null,null,"PILOT Sensitivity Analysis",null,null,null,null,"MW Block Assumption"]
[null,"Active Utility Region",null,null,null,{"$f":"LEFT($AB$30,FIND(\"/\",AB30,1)-1)","v":"NGRID"},null,null,null,null,null,null,null,null,null,null,null,null,null,null,null,null,null,null,"Block","PBI Rate",null,"Locational Adder Logic Table",null,null,"Pilot Rate"]
[null,"CDG?",null,null,null,"Yes",null,null,null,null,null,null,null,null,null,null,null,null,null,"PILOT Sensitivity ($/MWh) / (% of Retail Rate)",null,null,null,null,"Block 1 ConEd",0.17899999999999999,null,"Yes",1.2,null,0.01]
[null,"Year-1 Solar Net Metering Credit Value",null,null,"[$/kWh]",{"$f":"VLOOKUP($F$8,$K$38:$O$45,COLUMNS($K$39:$L$39),0)","v":9.3700000000000006E-2},null,null,null,null,null,null,null,null,null,null,null,null,null,null,null,null,null,null,"Block 2 ConEd",0.17299999999999999,null,"No",1,null,1.4999999999999999E-2]
{"$rows_left_out":125}
{"sheet":"1. Overview","index":3,"n_rows":9,"n_cols":4,"rows_kept":9,"cut":false,"hidden":false,"merged":[]}
[]
[null,null,"Title:","Payment-In-Lieu-Of-Taxes (PILOT) Calculator"]
[null,null,"Version:","Version 2.0"]
[null,null,"Update Notice:","Calculator 2 Update: \n• NYSERDA MW Block and NY-Sun Locational Adder replaced with \"Total NYSERDA Incentive\" on Calculator Two\n• Inputs are no longer pre-loaded values\n• User now enters Value of Distributed Energy Resources (VDER) rate from Value Stack Calculator\n• General improvements and streamlining "]
[null,null,"Author:","New York State Energy and Research Development Authority (NYSERDA)"]
[null,null,"For Technical Support, Please Contact:","\ncleanenergyhelp@nyserda.ny.gov\n"]
[]
[null,null,"Introduction:","The Payment-In-Lieu-Of-Taxes (PILOT) Calculator is a tool to assist New York State municipalities considering PILOT agreements for solar energy projects ranging in size from 1 Megawatt (MW) to 5 MW. NYSERDA developed the tool with representatives of New York State municipalities and the solar industry. The tool considers key factors affecting solar project economics and allows for a high degree of customization. The tool includes two calculators. Calculator One provides PILOT rate guidance for solar projects based on the local cost of electricity. Calculator One is most appropriate for setting PILOT rates jurisdiction-wide. Calculator Two provides PILOT rate guidance based on the minimum revenue a project needs to be financially viable. Calculator Two is most appropriate for setting a PILOT rate for an individual project. User instructions for both calculators are found on Sheet 2. "]
[null,null,null," "]

{"sheet":"2. User Instructions","index":4,"n_rows":47,"n_cols":2,"rows_kept":47,"cut":false,"hidden":false,"merged":[]}
[]
[null,"These instructions provide a road map to use Calculator One and Calculator Two. Users must enter information into each calculator. These inputs are described below and are highlighted in yellow. All other cells are calculated automatically and cannot be modified. For Calculator Two, it is important to note that the pre-loaded values are not accurate representations of all project costs and revenues. Every solar project is unique, and these cells are intended to be replaced with your own project-specific information. Once user information has been entered, the calculators produce estimated PILOT rates. User must populate all cells in yellow to produce an estimated PILOT rate."]
[]
[null,"CALCULATOR ONE:"]
[]
[null,"General Project Assumptions"]
[null,"• AC System Size (Alternating Current): Users may enter the size (or capacity) of the system in MW AC."]
[]
[null,"Region Specific Assumptions"]
[null,"• Active Utility Region: Users may select the utility region where a project is located. The compensation a solar project receives in that region is displayed for informational purposes."]
{"$rows_left_out":38}
{"sheet":"3. Calculator One","index":5,"n_rows":49,"n_cols":11,"rows_kept":49,"cut":false,"hidden":false,"merged":[[13,1,13,9],[15,1,15,9],[14,1,14,9]]}
[]
["x","Project Assumptions - YELLOW REQUIRES INPUT",null,null,null,null,null,"Model Output - PILOT Estimates"]
[null,null,null,null,null,null,null,"% of Compensation","PILOT ($/MW)","Total System PILOT"]
[null,"General Project Assumptions",null,null,null,null,null,null,{"$f":"$F$32+100-MOD($F$32,100)","v":5100},null,{"$f":"J5/$F$29","v":0.94549499443826479}]
[null,"AC System Size (Alternating Current)",null,null,"[MWAC]",3,null,0.01,1700,{"$f":"I5*$F$5","v":5100},1.4460511679644048]
[null,null,null,null,null,null,null,1.4999999999999999E-2,2600,{"$f":"I6*$F$5","v":7800},1.8909899888765296]
[null,"Region Specific Assumptions",null,null,null,null,null,0.02,3400,10200,2.3915461624026695]
[null,"Active Utility Region",null,null,null,"NGRID",null,2.5000000000000001E-2,4300,12900,2.836484983314794]
[null,"Year-1 Compensation for Electricity Generation",null,null,"[$/kWh]",{"$f":"VLOOKUP($F$8,$B$42:$D$49,2,FALSE)","v":9.3700000000000006E-2},null,0.03,5100,15300,3.2814238042269186]
[null,null,null,null,null,null,null,3.5000000000000003E-2,5900,17700,3.7819799777530592]
{"$rows_left_out":40}
{"sheet":"4. Calculator Two","index":6,"n_rows":107,"n_cols":31,"rows_kept":107,"cut":false,"hidden":false,"merged":[[3,9,6,13]]}
[]
[null,"Project Assumptions - YELLOW REQUIRES INPUT",null,null,null,null,null,null,null,"Model Output - PILOT Estimates"]
[]
[null,"Region Specific Assumptions",null,null,null,"User Input","Escalator",null,null,"PILOT Calculation",null,null,null,null,null,null,null,"Magnitude of Effect",null,"Primary",null,null,null,null,null,"Secondary",null,null,"Minimal"]
[null,"VDER Rate",null,null,"[$/kWh]",9.1800000000000007E-2,null,null,null,null,null,null,null,null,null,"Inputs",null,"COST SIDE",null,"System Build Cost",null,null,null,null,null,null,null,null,"Lease Cost"]
[null,"System Build Cost",null,null,"[$/WDC]",1.6,null,null,null,null,null,null,null,null,null,"System Build Cost",null,null,null,null,"$/MW",null,null,null,null,null,null,null,null,"$/MW"]
[null,"Site Lease Payment",null,null,"[$/MWDC]",6000,0.02,null,null,null,null,null,null,null,null,"Lease Cost",null,null,null,{"$f":"F6","v":1.6},{"$f":"$N$11","v":3818.9496119405544},null,null,null,null,null,null,null,{"$f":"F7","v":6000},{"$f":"$N$11","v":3818.9496119405544}]
[null,"O&M Cost",null,null,"[$/kW DC], 2% escalator",22,0.02,null,null,"Investor NPV Pre-PILOT",null,null,"[$]",{"$f":"(F78+NPV($F$15,$G$78:$AE$78))*1000","v":223883.99625765486},null,null,null,null,0.9,{"$f":"T$10*$S8","v":2.16},-65435.377109273279,null,null,null,null,null,null,null,{"$f":"AC$10*$S8","v":19800},-32019.853559459472]
[null,"Insurance",null,null,"[$/kW]",2,null,null,null,"Investor Target Pre-tax IRR",null,null,"[%]",{"$f":"F15","v":3.2500000000000001E-2},null,"Target IRR",null,null,0.95,{"$f":"T$10*$S9","v":2.2799999999999998},-80275.589978104763,null,null,null,null,null,null,null,{"$f":"AC$10*$S9","v":20900},-34876.56975428122]
[null,"CDG Annual Administrative and Subscriber Management Costs",null,null,"[$/kW]",10,null,null,null,"Annual PILOT Budget @ Target IRR",null,null,"[$]",{"$f":"IF(G94=0,\"N/A\",-PMT($N$9,$F$86,$N$8))","v":19094.748059702772},null,"VDER Rate",null,null,1,2.4,-95115.802846936363,null,null,null,null,null,null,null,22000,-37733.285949102916]
{"$rows_left_out":98}
{"sheet":"4. Calculator Two (Old)","index":7,"n_rows":124,"n_cols":31,"rows_kept":124,"cut":false,"hidden":true,"merged":[[3,9,6,13]]}
[]
["x","Project Assumptions - YELLOW REQUIRES INPUT",null,null,null,null,null,null,null,"Model Output - PILOT Estimates"]
[]
[null,"Region Specific Assumptions",null,null,null,"Default Value",null,null,null,"PILOT Calculation",null,null,null,null,null,null,null,null,null,"PILOT Sensitivity Analysis",null,null,null,null,"MW Block Assumption"]
[null,"Active Utility Region",null,null,null,"CHG&E",null,null,null,null,null,null,null,null,null,null,null,null,null,null,null,null,null,null,"Block","PBI Rate",null,"Locational Adder Logic Table",null,null,"Pilot Rate"]
[null,"CDG?",null,null,null,"Yes",null,null,null,null,null,null,null,null,null,null,null,null,null,"PILOT Sensitivity ($/MWh) / (% of Retail Rate)",null,null,null,null,"Block 1 ConEd",0.17899999999999999,null,"Yes",1.2,null,0.01]
[null,"Current Retail Rate",null,null,"[$/kWh]",{"$f":"VLOOKUP($F$5,$K$35:$O$42,COLUMNS($K$36:$L$36),0)","v":0.13400000000000001},null,null,null,null,null,null,null,null,null,null,null,null,null,null,null,null,null,null,"Block 2 ConEd",0.17299999999999999,null,"No",1,null,1.4999999999999999E-2]
[null,"System Build Cost",null,null,"[$/WDC]",{"$f":"VLOOKUP($F$5,$K$35:$O$42,COLUMNS($K$36:$O$36),0)+AD23","v":1.9},null,null,null,"Investor NPV Pre-PILOT",null,null,"[$]",{"$f":"(F99+NPV($F$13,$G$99:$AE$99))*1000","v":105562.59485281861},null,null,null,null,null,"Build Cost","Customer Energy Discount",null,null,null,"Block 3 ConEd",0.16800000000000001,null,null,null,null,0.02]
[null,"Site Lease Payment",null,null,"[$/MWDC]",{"$f":"VLOOKUP($F$5,$K$35:$O$42,COLUMNS($K$36:$M$36),0)","v":10000},null,null,null,"Investor Target Pre-tax IRR",null,null,"[%]",{"$f":"F13","v":0.04},null,null,null,null,null,"($/W) Delta","(%)",null,null,null,"Block 4 ConEd",0.16200000000000001,null,null,null,null,2.5000000000000001E-2]
[null,"Year 1 Specific Yield Forecast",null,null,"[kWh/kW]",{"$f":"VLOOKUP($F$5,$K$35:$O$42,COLUMNS($K$36:$N$36),0)","v":1280},null,null,null,"Annual PILOT Budget @ Target IRR",null,null,"[$]",{"$f":"IF(G115=0,\"N/A\",-PMT($N$9,$F$107,$N$8))","v":"N/A"},null,null,null,null,null,{"$f":"N12","v":{"$error":"#VALUE!"}},0.2,0.15,0.1,null,"Block 5 ConEd",0.156,null,null,null,null,0.03]
{"$rows_left_out":115}
{"sheet":"Sheet2","index":8,"n_rows":30,"n_cols":10,"rows_kept":30,"cut":false,"hidden":true,"merged":[]}
["Project Year","Year","Days in Year","Hours in Year","Operational","Degradation Index","Total Production (MWh)","Retail Utility Rate","% of Retail Rate","PILOT"]
[0,2016,{"$f":"IF(MONTH(DATE(B2,2,29))=2,366,365)","v":366},{"$f":"C2*24","v":8784},{"$f":"IF(AND(A2>0,A2<='3. Calculator One'!$F$38),1,0)","v":0},{"$f":"(1-'3. Calculator One'!$F$34)^($A2-1)*$E2","v":0},{"$f":"'3. Calculator One'!$F$28*'3. Calculator One'!#REF!*$F2*$E2","v":{"$error":"#REF!"}},{"$f":"'3. Calculator One'!#REF!","v":{"$error":"#REF!"}},{"$f":"+'3. Calculator One'!$F$30","v":3.0000000000000002E-2},{"$f":"I2*G2*H2*1000","v":{"$error":"#REF!"}}]
[1,2017,{"$f":"IF(MONTH(DATE(B3,2,29))=2,366,365)","v":365},{"$f":"C3*24","v":8760},{"$f":"IF(AND(A3>0,A3<='3. Calculator One'!$F$38),1,0)","v":1},{"$f":"(1-'3. Calculator One'!$F$34)^($A3-1)*$E3","v":1},{"$f":"'3. Calculator One'!$F$28*'3. Calculator One'!#REF!*$F3*$E3","v":{"$error":"#REF!"}},{"$f":"'3. Calculator One'!#REF!","v":{"$error":"#REF!"}},{"$f":"I2","v":3.0000000000000002E-2},{"$f":"I3*G3*H3*1000","v":{"$error":"#REF!"}}]
[2,2018,365,8760,{"$f":"IF(AND(A4>0,A4<='3. Calculator One'!$F$38),1,0)","v":1},{"$f":"(1-'3. Calculator One'!$F$34)^($A4-1)*$E4","v":0.995},{"$f":"'3. Calculator One'!$F$28*'3. Calculator One'!#REF!*$F4*$E4","v":{"$error":"#REF!"}},{"$f":"'3. Calculator One'!#REF!","v":{"$error":"#REF!"}},{"$f":"I3","v":3.0000000000000002E-2},{"$error":"#REF!"}]
[3,2019,365,8760,{"$f":"IF(AND(A5>0,A5<='3. Calculator One'!$F$38),1,0)","v":1},{"$f":"(1-'3. Calculator One'!$F$34)^($A5-1)*$E5","v":0.99002500000000004},{"$f":"'3. Calculator One'!$F$28*'3. Calculator One'!#REF!*$F5*$E5","v":{"$error":"#REF!"}},{"$f":"'3. Calculator One'!#REF!","v":{"$error":"#REF!"}},3.0000000000000002E-2,{"$error":"#REF!"}]
[4,2020,366,8784,{"$f":"IF(AND(A6>0,A6<='3. Calculator One'!$F$38),1,0)","v":1},{"$f":"(1-'3. Calculator One'!$F$34)^($A6-1)*$E6","v":0.98507487500000002},{"$f":"'3. Calculator One'!$F$28*'3. Calculator One'!#REF!*$F6*$E6","v":{"$error":"#REF!"}},{"$f":"'3. Calculator One'!#REF!","v":{"$error":"#REF!"}},3.0000000000000002E-2,{"$error":"#REF!"}]
[5,2021,365,8760,{"$f":"IF(AND(A7>0,A7<='3. Calculator One'!$F$38),1,0)","v":1},{"$f":"(1-'3. Calculator One'!$F$34)^($A7-1)*$E7","v":0.98014950062500006},{"$f":"'3. Calculator One'!$F$28*'3. Calculator One'!#REF!*$F7*$E7","v":{"$error":"#REF!"}},{"$f":"'3. Calculator One'!#REF!","v":{"$error":"#REF!"}},3.0000000000000002E-2,{"$error":"#REF!"}]
[6,2022,365,8760,{"$f":"IF(AND(A8>0,A8<='3. Calculator One'!$F$38),1,0)","v":1},{"$f":"(1-'3. Calculator One'!$F$34)^($A8-1)*$E8","v":0.97524875312187509},{"$f":"'3. Calculator One'!$F$28*'3. Calculator One'!#REF!*$F8*$E8","v":{"$error":"#REF!"}},{"$f":"'3. Calculator One'!#REF!","v":{"$error":"#REF!"}},3.0000000000000002E-2,{"$error":"#REF!"}]
[7,2023,365,8760,{"$f":"IF(AND(A9>0,A9<='3. Calculator One'!$F$38),1,0)","v":1},{"$f":"(1-'3. Calculator One'!$F$34)^($A9-1)*$E9","v":0.97037250935626573},{"$f":"'3. Calculator One'!$F$28*'3. Calculator One'!#REF!*$F9*$E9","v":{"$error":"#REF!"}},{"$f":"'3. Calculator One'!#REF!","v":{"$error":"#REF!"}},3.0000000000000002E-2,{"$error":"#REF!"}]
[8,2024,366,8784,{"$f":"IF(AND(A10>0,A10<='3. Calculator One'!$F$38),1,0)","v":1},{"$f":"(1-'3. Calculator One'!$F$34)^($A10-1)*$E10","v":0.96552064680948435},{"$f":"'3. Calculator One'!$F$28*'3. Calculator One'!#REF!*$F10*$E10","v":{"$error":"#REF!"}},{"$f":"'3. Calculator One'!#REF!","v":{"$error":"#REF!"}},3.0000000000000002E-2,{"$error":"#REF!"}]
{"$rows_left_out":21}
{"sheet":"4. Heat Map - IRR","index":9,"n_rows":28,"n_cols":13,"rows_kept":28,"cut":false,"hidden":true,"merged":[]}
["Heat Map of IRRs based on PILOT as % of Retail Rate"]
[]
[]
["Utility","Tranche",0,5.0000000000000001E-3,{"$f":"D4+0.005","v":0.01},{"$f":"E4+0.005","v":1.4999999999999999E-2},0.02,2.5000000000000001E-2,3.0000000000000002E-2,3.5000000000000003E-2,0.04,4.4999999999999998E-2,4.9999999999999996E-2]
["CHG&E","Tranche 0",5.0101251476854847E-2,4.9426092899273355E-2,4.8750465680631461E-2,4.807437172006801E-2,4.7397812976923026E-2,4.6720791471467571E-2,4.604330928562983E-2,4.5365368563726083E-2,4.46869715103273E-2,4.400812040134694E-2,4.3328817570475797E-2]
["O&R","Tranche 0",5.9519192631695361E-2,5.8830737926732546E-2,5.8141870268777041E-2,5.7452591677880749E-2,5.6762904232175782E-2,5.6072810068543699E-2,5.5382311383286753E-2,5.4691410432795351E-2,5.4000109534219076E-2,5.3308411066131933E-2,5.2616317469200702E-2]
["NGRID","Tranche 0",2.4482361726728241E-2,2.3824869679278882E-2,2.316673857889362E-2,2.2507970079361339E-2,2.1848565906938289E-2,2.1188527861351725E-2,2.0527857816802664E-2,1.9866557722972633E-2,1.9204629606028867E-2,1.8542075569627725E-2,1.7878897799088911E-2]
["NYSEG","Tranche 0",2.2761895913350871E-2,2.2119762467708526E-2,2.1477004952016765E-2,2.0833624869264655E-2,2.0189623789418798E-2,1.9545003350340595E-2,1.8899765258708623E-2,1.8253911290937674E-2,1.7607443297207759E-2,1.6960363191351968E-2,1.6312672966825037E-2]
["ConEd","Tranche 0",5.7857550092260679E-2,5.7161916699987714E-2,5.6465871627198183E-2,5.5769416988899589E-2,5.5072554960492681E-2,5.4375287778468895E-2,5.3677617741102912E-2,5.2979547209146771E-2,5.228107860652198E-2,5.1582214421012518E-2,5.0882957204952506E-2]
["RG&E","Tranche 0",2.4379106631965852E-2,2.3734099438780909E-2,2.3088472503974611E-2,2.2442227357324152E-2,2.1795365595782767E-2,2.1147888884402777E-2,2.04997989572544E-2,1.9851097618350799E-2,1.920178674256956E-2,1.8551868276575956E-2,1.7901344239743322E-2]
{"$rows_left_out":19}
{"sheet":"5. Heat Map - PILOT","index":10,"n_rows":28,"n_cols":13,"rows_kept":28,"cut":false,"hidden":true,"merged":[]}
["Heat Map of PILOTs based on PILOT as % of Retail Rate"]
[]
[]
["Utility","Tranche",0,5.0000000000000001E-3,{"$f":"D4+0.005","v":0.01},{"$f":"E4+0.005","v":1.4999999999999999E-2},0.02,2.5000000000000001E-2,3.0000000000000002E-2,3.5000000000000003E-2,0.04,4.4999999999999998E-2,4.9999999999999996E-2]
["CHG&E","Tranche 0",0,2525.9,5051.8,7577.7,10103.6,12629.5,15155.4,17681.3,20207.2,22733.1,25259]
["O&R","Tranche 0",0,3147.95,6295.9,9443.85,12591.8,15739.75,18887.7,22035.65,25183.599999999999,28331.55,31479.5]
["NGRID","Tranche 0",0,1684.73,3369.45,5054.18,6738.9,8423.6299999999992,10108.36,11793.08,13477.81,15162.53,16847.259999999998]
["NYSEG","Tranche 0",0,1635.6,3271.2,4906.8,6542.4,8178,9813.6,11449.2,13084.8,14720.4,16356]
["ConEd","Tranche 0",0,3679.38,7358.75,11038.13,14717.5,18396.88,22076.25,25755.63,29435,33114.379999999997,36793.75]
["RG&E","Tranche 0",0,1653,3306,4959,6612,8265,9918,11571,13224,14877,16530]
{"$rows_left_out":18}