{"text_format":"1","workbook":"xlsx","n_sheets":25,"sheets":["NYSERDA Reporting","ERMs","GHSF Calculator","Demand Savings Lookup","Lookup","Drop Down","Introduction","Version History","Basic Info","Model Inputs","Reporting Summary","Detailed Measures","Simulation Summary","Results from eQUEST","SG Appx Intro","Windows eQuest","DHW Demand","Water Savings","Appliances","Lighting Schedule","Interior Lighting","In-Unit Lighting","Exterior Lighting","Infiltration&Ventilation","EIR for PTAC and PTHP"],"not_rendered":{"charts":0,"images":0,"macros":1,"external_links":2,"defined_names":61,"comments":5,"pivot_tables":0},"unopened":[],"bounds":{"document_bytes":16777216,"sheet_cells":100000,"rows_first":2000,"rows_last":500,"rows_between":2000,"halvings":0,"cell_chars":16384,"cell_head_chars":4096},"cells_cut":0,"cells_raw":0,"read":"whole","date_system":"1900"}

{"sheet":"NYSERDA Reporting","index":0,"n_rows":52,"n_cols":11,"rows_kept":52,"cut":false,"hidden":true,"merged":[]}
[null,"Project Energy Savings and Financial Summary per Building"]
[]
[null,"Projected Annual Cost Savings ($)",{"$f":"'NYSERDA Reporting'!E14","v":{"$error":"#DIV/0!"}}]
[null,"Projected Annual Cost Savings (%)",{"$f":"'NYSERDA Reporting'!F14","v":{"$error":"#DIV/0!"}}]
[null,"Minimum Performance Target (%)",{"$f":"IF('Basic Info'!C48=1,15%,IF('Basic Info'!C48=2,25%,30%))","v":0.3}]
[null,"Project Exceeds Performance Target By",{"$f":" C4-C5","v":{"$error":"#DIV/0!"}}]
[]
[null,"Total Projected Incremental Costs",{"$f":"'Detailed Measures'!T30","v":0}]
[]
[]
[null,"Simulation Summary"]
[]
[null,null,"Baseline Simulation",{"$f":"'Basic Info'!C49&\" Simulation\"","v":" Simulation"},"Difference","Percent Difference"]
[null,"Total Annual Energy Cost (All Fuels)",{"$f":"'Reporting Summary'!E125","v":{"$error":"#DIV/0!"}},{"$f":"'Reporting Summary'!I125","v":0},{"$f":"C14-D14","v":{"$error":"#DIV/0!"}},{"$f":"E14/C14","v":{"$error":"#DIV/0!"}}]
[null,"Electricity Consumption (kWh/yr)",{"$f":"'Reporting Summary'!D125/3412","v":{"$error":"#DIV/0!"}},{"$f":"'Reporting Summary'!H125/3412","v":0},{"$f":"C15-D15","v":{"$error":"#DIV/0!"}},{"$f":"E15/C15","v":{"$error":"#DIV/0!"}}]
[null,"Fuel Consumption (MMBtu/yr)",{"$f":"'Reporting Summary'!C125/1000000","v":{"$error":"#DIV/0!"}},{"$f":"'Reporting Summary'!G125/1000000","v":0},{"$f":"C16-D16","v":{"$error":"#DIV/0!"}},{"$f":"E16/C16","v":{"$error":"#DIV/0!"}}]
[null,"Total Energy Consumption (MMBtu/yr)",{"$f":"((C15*3412)/1000000)+C16","v":{"$error":"#DIV/0!"}},{"$f":"((D15*3412)/1000000)+D16","v":0},{"$f":"C17-D17","v":{"$error":"#DIV/0!"}},{"$f":"E17/C17","v":{"$error":"#DIV/0!"}}]
[]
[]
[null,"Energy Use by End Use"]
[]
[null,"End use","Predominent Energy Source","Baseline Energy (MMBtu)",{"$f":"'Basic Info'!C49&\" Energy (MMBtu)\"","v":" Energy (MMBtu)"},"Percent Improvement",null,"Baseline Electricity (kWh/yr)","Baseline Fuel (MMBtu/yr)",{"$f":"'Basic Info'!C49&\" Electricity (kWh/yr)\"","v":" Electricity (kWh/yr)"},{"$f":"'Basic Info'!C49&\" Fuel (MMBtu/yr)\"","v":" Fuel (MMBtu/yr)"}]
[null,"Lighting",{"$f":"IF(H23*3412/1000000<I23,\"Natural Gas\",\"Electric\")","v":{"$error":"#DIV/0!"}},{"$f":"I23+H23*3412/1000000","v":{"$error":"#DIV/0!"}},{"$f":"K23+J23*3412/1000000","v":0},{"$f":"IF(AND(H23=0,I23=0,J23=0,K23=0)=TRUE,0%,(H23*3412/1000000+I23-J23*3412/1000000-K23)/(H23*3412/1000000+I23))","v":{"$error":"#DIV/0!"}},null,{"$f":"'Results from eQUEST'!M19+'Results from eQUEST'!N19+'Results from eQUEST'!X19","v":{"$error":"#DIV/0!"}},{"$f":"('Results from eQUEST'!AY19+'Results from eQUEST'!AZ19+'Results from eQUEST'!BJ19)/10","v":{"$error":"#DIV/0!"}},{"$f":"'Results from eQUEST'!M22+'Results from eQUEST'!N22+'Results from eQUEST'!X22","v":0},{"$f":"('Results from eQUEST'!AY22+'Results from eQUEST'!AZ22+'Results from eQUEST'!BJ22)/10","v":0}]
[null,"Space Heating ",{"$f":"IF(H24*3412/1000000<I24,\"Natural Gas\",\"Electric\")","v":{"$error":"#DIV/0!"}},{"$error":"#DIV/0!"},0,{"$error":"#DIV/0!"},null,{"$f":"'Results from eQUEST'!P19+'Results from eQUEST'!V19","v":{"$error":"#DIV/0!"}},{"$f":"('Results from eQUEST'!BB19+'Results from eQUEST'!BH19)/10","v":{"$error":"#DIV/0!"}},{"$f":"'Results from eQUEST'!P22+'Results from eQUEST'!V22","v":0},{"$f":"('Results from eQUEST'!BB22+'Results from eQUEST'!BH22)/10","v":0}]
[null,"Space Cooling",{"$error":"#DIV/0!"},{"$error":"#DIV/0!"},0,{"$error":"#DIV/0!"},null,{"$f":"'Results from eQUEST'!Q19","v":{"$error":"#DIV/0!"}},{"$f":"'Results from eQUEST'!BC19/10","v":{"$error":"#DIV/0!"}},{"$f":"'Results from eQUEST'!Q22","v":0},{"$f":"'Results from eQUEST'!BC22/10","v":0}]
[null,"Pumps",{"$error":"#DIV/0!"},{"$error":"#DIV/0!"},0,{"$error":"#DIV/0!"},null,{"$f":"'Results from eQUEST'!S19","v":{"$error":"#DIV/0!"}},{"$f":"'Results from eQUEST'!BE19/10","v":{"$error":"#DIV/0!"}},{"$f":"'Results from eQUEST'!S22","v":0},{"$f":"'Results from eQUEST'!BE22/10","v":0}]
[null,"Heat rejection",{"$error":"#DIV/0!"},{"$error":"#DIV/0!"},0,{"$error":"#DIV/0!"},null,{"$f":"'Results from eQUEST'!R19","v":{"$error":"#DIV/0!"}},{"$f":"'Results from eQUEST'!BD19/10","v":{"$error":"#DIV/0!"}},{"$f":"'Results from eQUEST'!R22","v":0},{"$f":"'Results from eQUEST'!BD22/10","v":0}]
[null,"Fans - interior",{"$error":"#DIV/0!"},{"$error":"#DIV/0!"},0,{"$error":"#DIV/0!"},null,{"$f":"'Results from eQUEST'!T19","v":{"$error":"#DIV/0!"}},{"$f":"'Results from eQUEST'!BF19/10","v":{"$error":"#DIV/0!"}},{"$f":"'Results from eQUEST'!T22","v":0},{"$f":"'Results from eQUEST'!BF22/10","v":0}]
[null,"Service water heating",{"$error":"#DIV/0!"},{"$error":"#DIV/0!"},0,{"$error":"#DIV/0!"},null,{"$f":"'Results from eQUEST'!W19","v":{"$error":"#DIV/0!"}},{"$f":"'Results from eQUEST'!BI19/10","v":{"$error":"#DIV/0!"}},{"$f":"'Results from eQUEST'!W22","v":0},{"$f":"'Results from eQUEST'!BI22/10","v":0}]
[null,"Other equipment/plug loads",{"$error":"#DIV/0!"},{"$error":"#DIV/0!"},0,{"$error":"#DIV/0!"},null,{"$f":"H31-SUM(H23:H29)","v":{"$error":"#DIV/0!"}},{"$f":"I31-SUM(I23:I29)","v":{"$error":"#DIV/0!"}},{"$f":"J31-SUM(J23:J29)","v":0},{"$f":"K31-SUM(K23:K29)","v":0}]
[null,"Total",null,{"$error":"#DIV/0!"},0,{"$error":"#DIV/0!"},null,{"$f":"'Results from eQUEST'!Y19","v":{"$error":"#DIV/0!"}},{"$f":"'Results from eQUEST'!BK19/10","v":{"$error":"#DIV/0!"}},{"$f":"'Results from eQUEST'!Y22","v":0},{"$f":"'Results from eQUEST'!BK22/10","v":0}]
[]
[]
[]
[null,"Designs"]
[]
[null,"Building Component",{"$f":"'Basic Info'!C49","v":0},"Baseline Design"]
[null,"Wall (above and below grade wall construction and U-value)",{"$f":"\"AGW: \"&ERMs!C19&\"; BGW: \"&ERMs!C18","v":"AGW: , U-; BGW: , C-"},{"$f":"ERMs!E19&\"; \"&ERMs!E18","v":{"$error":"#REF!"}}]
[null,"Doors",{"$f":"ERMs!C28","v":", U-"},{"$f":"ERMs!E28","v":"Exterior doors: , U-"}]
[null,"Windows (window-to-wall-ratio,frame material, U-Value and SHGC)",{"$f":"ERMs!C26&\", \"&'Model Inputs'!F30&\" window to wall ratio\"","v":", , U-, SHGC-,  window to wall ratio"},{"$f":"ERMs!E26&\", \"&'Model Inputs'!E30&\" window to wall ratio\"","v":"Windows: Per ASHRAE, , U-, SHGC-,  window to wall ratio"}]
[null,"Floor (U-Value and construction for exposed floor and slabs)",{"$f":"\"Slab-below-grade: \"&ERMs!C23&\"; Slab-on-grade: \"&ERMs!C24&\"; Floor Perimeter: \"&ERMs!C20&\"; Floor above cond. Space: \"&ERMs!C22","v":"Slab-below-grade: , C-; Slab-on-grade: , F-; Floor Perimeter: , U-; Floor above cond. Space: , U-"},{"$f":"ERMs!E23&\"; \"&ERMs!E24&\"; \"&ERMs!E20&\"; \"&ERMs!E22","v":{"$error":"#REF!"}}]
[null,"Roof (U-Value and construction)",{"$f":"ERMs!C21","v":", U-"},{"$f":"ERMs!E21","v":"Roof Insulation: Per ASHRAE, U-"}]
[null,"Lighting Power Density",{"$f":"\"Common area: \"&ERMs!C51&\"; In-unit: \"&ERMs!C55&\"; Garage Lighting: \"&ERMs!C54&\"; Exit Signs: \"&ERMs!C52","v":"Common area: Corridors: , ; In-unit: In-unit Lighting:  W/SF; Garage Lighting: Garage Lighting:  W/SF; Exit Signs: Exit Signs:  kW"},{"$f":"\"Common Area: \"&ERMs!E51&\"; \"&ERMs!E55&\"; \"&ERMs!E54&\"; \"&ERMs!E52","v":"Common Area: Corridors - 0.66, ; In-unit Lighting: 0.6 W/SF; Garage Lighting:  W/SF; Exit Signs:  kW"}]
[null,"Lighting Controls",{"$f":"ERMs!C50","v":0},{"$f":"ERMs!E50","v":"Lighting Controls: N/A"}]
[null,"Exterior Lighting",{"$f":"ERMs!C53","v":"Exterior Lighting:  kW"},{"$f":"ERMs!E53","v":"Exterior Lighting:  kW"}]
[null,"Appliances",{"$f":"ERMs!C5&\"; \"&ERMs!C6&\"; \"&ERMs!C7&\"; \"&ERMs!C9&\" ;\"&ERMs!C10&\"; \"&ERMs!C11","v":"N/A; N/A; N/A; N/A ;N/A; N/A"},{"$f":"ERMs!E5&\"; \"&ERMs!E6&\"; \"&ERMs!E7&\"; \"&ERMs!E10&\"; \"&ERMs!E10&\"; \"&ERMs!E11","v":"N/A; N/A; N/A; N/A; N/A; N/A"}]
[null,"Misc. Plug Loads",{"$f":"'Model Inputs'!F64","v":""},{"$f":"'Model Inputs'!E64","v":0}]
[null,"Renewable Systems",{"$f":"ERMs!C82","v":{"$error":"#REF!"}},{"$f":"ERMs!E82","v":0}]
[null,"Heating/Cooling system type and efficiency (include all heating systems)",{"$f":"ERMs!C30","v":"Primary system:   ( COP)"},{"$f":"ERMs!E30","v":"  ( COP)"}]
[null,"Mechanical Ventilation (include exhaust/supply CFM and system description)",{"$f":"ERMs!C62&\"; \"&ERMs!C63&\"; \"&ERMs!C64&\"; \"&ERMs!C65","v":"Kitchen: 0 CFM (0)\nBathroom: 0 CFM (0); Non-corridor:  CFM; Corridor: 0 CFM; 0"},{"$f":"ERMs!E62&\"; \"&ERMs!E63&\"; \"&ERMs!E64&\"; \"&ERMs!E65","v":"Kitchen: 0 CFM (0)\nBathroom: 20 CFM (0); Non-corridor Exhaust: N/A CFM; Corridor Supply Ventilation: 0 CFM; Fresh air supplied to apts by: "}]
[null,"Fan and Pump descriptino",{"$f":"\"Heating pump: \"&ERMs!C57&\"; DHW pump: \"&ERMs!C59&\"; \"&ERMs!C35","v":"Heating pump:    NEMA  Motor,  W/GPM; DHW pump:     hp NEMA  efficient motor, 0.0%;  kW/CFM"},{"$f":"\"Heating pump: \"&ERMs!E57&\"; DHW pump: \"&ERMs!E59&\"; \"&ERMs!E35","v":"Heating pump: NEMA Standard Motor, 19 W/GPM; DHW pump:   hp NEMA  efficiency motor, 0.0% efficient; Space heating fan power: 0.0003 kW/CFM"}]
[null,"Domestic Water Heating (include system type, efficiency, and hot water demand)",{"$f":"ERMs!C14&\"; Hot Water Demand: \"&'Model Inputs'!F139","v":"  ( kBtu)\nEt- 0%; Hot Water Demand: "},{"$f":"ERMs!E14&\"; Hot Water Demand: \"&'Model Inputs'!E139","v":" \nEt-0%; Hot Water Demand: "}]

{"sheet":"ERMs","index":1,"n_rows":85,"n_cols":5,"rows_kept":85,"cut":false,"hidden":true,"merged":[[74,0,75,0]]}
[]
[{"$f":"'Basic Info'!C37&\" Building Components\"","v":" Building Components"}]
[null,"Measure #","Proposed Method of Compliance \n(by PM/client)","Values Used in Energy Model  \n(Modeling Submittal Notes)","Baseline"]
["APPLIANCES"]
["Refrigerator",{"$f":"'Model Inputs'!C52","v":0},{"$f":"IF('Model Inputs'!G52=0,\"N/A\",'Model Inputs'!$G$52&\"  \"& 'Model Inputs'!$J$52& \" Refrigerators, \"&'Model Inputs'!$H$52&\" \"&'Model Inputs'!$I$52)","v":"N/A"},{"$f":"IF('Model Inputs'!G52=0,\"N/A\",\"Baseline: \"&'Model Inputs'!$E$52&\" kWh/yr\nProposed: \"&'Model Inputs'!$F$52&\" kWh/yr\")","v":"N/A"},{"$f":"IF(C5=\"N/A\", \"N/A\",'Model Inputs'!G52&\" \"&'Model Inputs'!D52)","v":"N/A"}]
["Dishwasher",{"$f":"'Model Inputs'!C53","v":0},{"$f":"IF('Model Inputs'!G53=0,\"N/A\",'Model Inputs'!$G$53&\"  \"& 'Model Inputs'!$J$53& \" Dishwashers, \"&'Model Inputs'!$H$53&\" \"&'Model Inputs'!$I$53)","v":"N/A"},{"$f":"IF('Model Inputs'!G53=0,\"N/A\",\"Baseline: \"&'Model Inputs'!$E$53&\" kWh/yr\" & \", \"&'Model Inputs'!$E$54&\" gal/yr\nProposed: \"&'Model Inputs'!$F$53&\" kWh/yr\" & \", \"&'Model Inputs'!$F$54&\" gal/yr\")","v":"N/A"},{"$f":"IF(C6=\"N/A\",\"N/A\",'Model Inputs'!G53&\" \"&'Model Inputs'!D53)","v":"N/A"}]
["In-Unit Clothes Washer",{"$f":"'Model Inputs'!C55","v":0},{"$f":"IF('Model Inputs'!G55=0,\"N/A\",'Model Inputs'!$G$55&\" \" & 'Model Inputs'!$J$55& \" In-Unit Clothes Washers, \"&'Model Inputs'!$H$55&\" \"&'Model Inputs'!$I$55)","v":"N/A"},{"$f":"IF('Model Inputs'!G55=0,\"N/A\",\"Baseline: \"&'Model Inputs'!$E$55&\" kWh/yr\" & \", \"&'Model Inputs'!$E$56&\" gal/yr\nProposed: \"&'Model Inputs'!$F$55&\" kWh/yr\" & \", \"&'Model Inputs'!$F$56&\" gal/yr\")","v":"N/A"},{"$f":"IF(C7=\"N/A\",\"N/A\",'Model Inputs'!G55&\" In-Unit \"&'Model Inputs'!D55)","v":"N/A"}]
["Common Area Clothes Washer",{"$f":"'Model Inputs'!C57","v":0},{"$f":"IF('Model Inputs'!G57=0,\"N/A\",'Model Inputs'!$G$57&\" \" & 'Model Inputs'!$J$57& \" Common Area Clothes Washers, \"&'Model Inputs'!$H$57&\" \"&'Model Inputs'!$I$57)","v":"N/A"},{"$f":"IF('Model Inputs'!G57=0,\"N/A\",\"Baseline: \"&'Model Inputs'!$E$57&\" kWh/yr\" & \", \"&'Model Inputs'!$E$58&\" gal/yr\nProposed: \"&'Model Inputs'!$F$57&\" kWh/yr\" & \", \"&'Model Inputs'!$F$58&\" gal/yr\")","v":"N/A"},{"$f":"IF(C8=\"N/A\",\"N/A\",'Model Inputs'!G57&\" Common Area \"&'Model Inputs'!D57)","v":"N/A"}]
["Stove",{"$f":"'Model Inputs'!C62","v":0},{"$f":"IF('Model Inputs'!G62=0,\"N/A\",IF('Model Inputs'!$B$62=\"Electric Stove (kWh/yr)\",'Model Inputs'!$G$62&\" \"&\" Electric Stoves\",'Model Inputs'!$G$62&\" Gas Stoves\"))","v":"N/A"},{"$f":"IF(C9=\"N/A\",\"N/A\",IF('Model Inputs'!$B$62=\"Electric Stoves (kWh/yr)\",\"Baseline: \"&'Model Inputs'!$E$62&\" kWh/yr\nProposed: \"&'Model Inputs'!$F$62&\" kWh/yr\",\"Baseline: \"&'Model Inputs'!$E$62&\" therm/yr\nProposed: \"&'Model Inputs'!$F$62&\" therm/yr\"))","v":"N/A"},{"$f":"IF(C9=\"N/A\",\"N/A\",IF('Model Inputs'!$B$62=\"Electric Stove (kWh/yr)\",'Model Inputs'!$G$62&\" \"&\" Electric Stoves\",'Model Inputs'!$G$62&\" Gas Stoves\"))","v":"N/A"}]
["Dryer",{"$f":"'Model Inputs'!C60","v":0},{"$f":"IF('Model Inputs'!G60=0,\"N/A\",IF('Model Inputs'!$B$60=\"Electric Clothes Dryer (kWh/yr)\",'Model Inputs'!$G$60&\" \"&\" Electric Clothes Dryers\",'Model Inputs'!$G$60&\" Gas Clothes Dryers\"))","v":"N/A"},{"$f":"IF(C10=\"N/A\",\"N/A\",IF('Model Inputs'!E61=\"N/A\",\"Baseline: \"&'Model Inputs'!$E$60&\" kWh/yr\nProposed: \"&'Model Inputs'!$F$60&\" kWh/yr\",\"Baseline: \"&'Model Inputs'!E60&\" kWh/yr, \"&'Model Inputs'!E61&\" therm/yr\nProposed: \"&'Model Inputs'!F60&\" kWh/yr, \"&'Model Inputs'!F61&\" therm/yr\"))","v":"N/A"},{"$f":"IF(C10=\"N/A\",\"N/A\",IF('Model Inputs'!$B$60=\"Electric Clothes Dryer (kWh/yr)\",'Model Inputs'!$G$60&\" \"&\" Electric Clothes Dryers\",'Model Inputs'!$G$60&\" Gas Clothes Dryers\"))","v":"N/A"}]
["Elevator",{"$f":"'Model Inputs'!C59","v":0},{"$f":"IF('Model Inputs'!G59=0,\"N/A\",'Model Inputs'!G59&\" elevators, \"&'Model Inputs'!F59&\" kWh/yr\")","v":"N/A"},{"$f":"IF(C11=\"N/A\",\"N/A\",\"Baseline: \"&'Model Inputs'!E59&\" kWh/yr\nProposed: \"&'Model Inputs'!F59&\" kWh/yr\")","v":"N/A"},{"$f":"IF(C11=\"N/A\",\"N/A\",'Model Inputs'!G59&\" elevators, \"&'Model Inputs'!E59&\" kWh/yr\")","v":"N/A"}]
[{"$f":"'Model Inputs'!B63","v":"<Other Appliance> (kWh/yr)"},{"$f":"'Model Inputs'!C63","v":0},{"$f":"IF('Model Inputs'!G63=0,\"N/A\",'Model Inputs'!G63&\" \"&'Model Inputs'!H63&\" \"&'Model Inputs'!I63&\", \"&'Model Inputs'!F63&\" kWh/yr\")","v":"N/A"},{"$f":"IF(C12=\"N/A\",\"N/A\",\"Baseline: \"&'Model Inputs'!E63&\" kWh/yr\nProposed: \"&'Model Inputs'!F63&\" kWh/yr\")","v":"N/A"},{"$f":"IF(C12=\"N/A\",\"N/A\",'Model Inputs'!E63& \" kWh/yr\")","v":"N/A"}]
["DOMESTIC HOT WATER"]
["Domestic Hot Water-Type & Efficiency",{"$f":"'Model Inputs'!C122","v":0},{"$f":"'Model Inputs'!$F$127&\" \"&'Model Inputs'!$F$122&\" (\"&'Model Inputs'!$F$125&\" kBtu)\nEt- \"&'Model Inputs'!$F$124*100&\"%\"","v":"  ( kBtu)\nEt- 0%"},{"$f":"\"Baseline: Et-\"&'Model Inputs'!$E$124*100&\"%\"&\", \"&'Model Inputs'!$E$125&\" kBtu\nProposed: Et-\"&'Model Inputs'!$F$124*100&\"%\"&\", \"&'Model Inputs'!$F$125&\" kBtu\"","v":"Baseline: Et-0%,  kBtu\nProposed: Et-0%,  kBtu"},{"$f":"'Model Inputs'!E127&\" \"&'Model Inputs'!E122&\"\nEt-\"&'Model Inputs'!E124*100&\"%\"","v":" \nEt-0%"}]
["Domestic Hot Water - Storage Insulation",{"$f":"'Model Inputs'!C128","v":0},{"$f":"'Model Inputs'!$F$126&\" gal Storage Tank, R-\"&'Model Inputs'!$F$128","v":" gal Storage Tank, R-"},{"$f":"\"Baseline: R-\"&'Model Inputs'!$E$128&\", \"&'Model Inputs'!$E$126&\" gal\nProposed: R-\"&'Model Inputs'!$F$128&\", \"&'Model Inputs'!$F$126&\" gal\"","v":"Baseline: R-12.5,  gal\nProposed: R-,  gal"},{"$f":"'Model Inputs'!E126&\" gal storage tank, R-\"&'Model Inputs'!E128","v":" gal storage tank, R-12.5"}]
["Domestic Hot Water - Low Flow Fixtures",{"$f":"'Model Inputs'!C135","v":0},{"$f":"\"Showerheads: \"&'Model Inputs'!$F$135&\" gpm\nKitchen Faucets: \"&'Model Inputs'!$F$136&\" gpm\nLavatory Faucets: \"&'Model Inputs'!$F$137&\" gpm\nToilets: \"&'Model Inputs'!$F$138&\" gpf\"","v":"Showerheads:  gpm\nKitchen Faucets:  gpm\nLavatory Faucets:  gpm\nToilets:  gpf"},{"$f":"\"Baseline: \"&TRUNC('Model Inputs'!$E$139,1)& \" gpm\nProposed: \"&TRUNC('Model Inputs'!$F$139,1)&\" gpm\"","v":"Baseline: 0 gpm\nProposed: 0 gpm"},{"$f":"\"Showerheads: \"&'Model Inputs'!E135&\" gpm\nKitchen Faucets: \"&'Model Inputs'!E136&\" gpm\nLavatory Faucets: \"&'Model Inputs'!E137&\" gpm\nToilets: \"&'Model Inputs'!E138&\" gpf\"","v":"Showerheads: 2.5 gpm\nKitchen Faucets: 2.5 gpm\nLavatory Faucets: 2.5 gpm\nToilets: 1.6 gpf"}]
["ENVELOPE ",null,"The envelope measures listed below must comply with ASHRAE Standard 90.1-2010 Section 5.4 in addition to the listed requirements."]
["Below Grade Wall Insulation",{"$f":"'Model Inputs'!C18","v":0},{"$f":"IF('Model Inputs'!F18=\"N/A\",\"N/A\",'Model Inputs'!F18&\", C-\"&'Model Inputs'!F19)","v":", C-"},{"$f":"IF(C18=\"N/A\",\"N/A\",\"Baseline: C-\"&'Model Inputs'!E19&\" (res) & C-\"&'Model Inputs'!#REF!&\" (non-res)\nProposed: C-\"&'Model Inputs'!F19)","v":{"$error":"#REF!"}},{"$f":"IF(D18=\"N/A\",\"N/A\",\"BGW: \"&'Model Inputs'!E18&\", C-\"&'Model Inputs'!E19&\" (res); C-\"&'Model Inputs'!#REF!&\" (non-res)\")","v":{"$error":"#REF!"}}]
["Above Grade Wall Insulation",{"$f":"'Model Inputs'!C13","v":0},{"$f":"'Model Inputs'!F13&\", U-\"&'Model Inputs'!F14","v":", U-"},{"$f":"\"Baseline: U-\"&'Model Inputs'!E14&\" (res) & U-\"&'Model Inputs'!#REF!&\" (non-res)\nProposed: U-\"&'Model Inputs'!F14","v":{"$error":"#REF!"}},{"$f":"\"AGW: \"&'Model Inputs'!E13&\", U-\"&'Model Inputs'!E14&\" (res) & U-\"&'Model Inputs'!#REF!&\" (non-res)\"","v":{"$error":"#REF!"}}]
["Floor Perimeter/Plank Edge Insulation",{"$f":"'Model Inputs'!C15","v":0},{"$f":"IF('Model Inputs'!F15=\"N/A\",\"N/A\",'Model Inputs'!F15&\", U-\"&'Model Inputs'!F16)","v":", U-"},{"$f":"IF(C20=\"N/A\",\"N/A\",\"Baseline: U-\"&'Model Inputs'!E16&\" (res) & U-\"&'Model Inputs'!#REF!&\" (non-res)\nProposed: U-\"&'Model Inputs'!F16)","v":{"$error":"#REF!"}},{"$f":"IF(D20=\"N/A\",\"N/A\",\"Floor Perimeter: \"&'Model Inputs'!E15&\", U-\"&'Model Inputs'!E16&\" (res) & U-\"&'Model Inputs'!#REF!&\" (non-res)\")","v":{"$error":"#REF!"}}]
["Roof Insulation",{"$f":"'Model Inputs'!C28","v":0},{"$f":"'Model Inputs'!F28&\", U-\"&'Model Inputs'!F29","v":", U-"},{"$f":"\"Baseline: U-\"&'Model Inputs'!E29&\"\nProposed: U-\"&'Model Inputs'!F29","v":"Baseline: U-\nProposed: U-"},{"$f":"\"Roof Insulation: \"&'Model Inputs'!E28&\", U-\"&'Model Inputs'!E29","v":"Roof Insulation: Per ASHRAE, U-"}]
["Floor Insulation Above Unconditioned Space",{"$f":"'Model Inputs'!C20","v":0},{"$f":"IF('Model Inputs'!F20=\"N/A\",\"N/A\",'Model Inputs'!F20&\", U-\"&'Model Inputs'!F21)","v":", U-"},{"$f":"IF(C22=\"N/A\",\"N/A\",\"Baseline: U-\"&'Model Inputs'!E21&\" (res) & U-\"&'Model Inputs'!#REF!&\" (non-res)\nProposed: U-\"&'Model Inputs'!F21)","v":{"$error":"#REF!"}},{"$f":"IF(D22=\"N/A\",\"N/A\",\"Floor above cond. Space: \"&'Model Inputs'!E20&\", U-\"&'Model Inputs'!E21&\" (res) & U-\"&'Model Inputs'!#REF!&\" (non-res)\")","v":{"$error":"#REF!"}}]
["Below Grade Slab Floor Insulation",{"$f":"'Model Inputs'!C26","v":0},{"$f":"IF('Model Inputs'!F26=\"N/A\",\"N/A\",'Model Inputs'!F26&\", C-\"&'Model Inputs'!F27)","v":", C-"},{"$f":"IF(C23=\"N/A\",\"N/A\",\"Baseline: C-\"&'Model Inputs'!E27&\"\nProposed: C-\"&'Model Inputs'!F27)","v":"Baseline: C-\nProposed: C-"},{"$f":"IF(D23=\"N/A\",\"N/A\",\"Slab-below-grade: \"&'Model Inputs'!E26&\", C-\"&'Model Inputs'!E27)","v":"Slab-below-grade: Per ASHRAE, C-"}]
["Slab-on-Grade Insulation (Unheated)",{"$f":"'Model Inputs'!C22","v":0},{"$f":"IF('Model Inputs'!F22=\"N/A\",\"N/A\",'Model Inputs'!F22&\", F-\"&'Model Inputs'!F23)","v":", F-"},{"$f":"IF(C24=\"N/A\",\"N/A\",\"Baseline: F-\"&'Model Inputs'!E23&\" (res) & F-\"&'Model Inputs'!#REF!&\" (non-res)\nProposed: F-\"&'Model Inputs'!F23)","v":{"$error":"#REF!"}},{"$f":"IF(D24=\"N/A\",\"N/A\",\"Slab-on-grade: \"&'Model Inputs'!E22&\", F-\"&'Model Inputs'!E23&\" (res) & F-\"&'Model Inputs'!#REF!&\" (non-res)\")","v":{"$error":"#REF!"}}]
["Slab-on-Grade Insulation (Embedded Heat)",{"$f":"'Model Inputs'!C24","v":0},{"$f":"IF('Model Inputs'!F24=\"N/A\",\"N/A\",'Model Inputs'!F24&\", F-\"&'Model Inputs'!F25)","v":", F-"},{"$f":"IF(C25=\"N/A\",\"N/A\",\"Baseline: F-\"&'Model Inputs'!E25&\" (res) & F-\"&'Model Inputs'!#REF!&\" (non-res)\nProposed: F-\"&'Model Inputs'!F25)","v":{"$error":"#REF!"}},{"$f":"IF(D25=\"N/A\",\"N/A\",\"Slab-on-grade: \"&'Model Inputs'!E24&\", F-\"&'Model Inputs'!E25&\" (res) & F-\"&'Model Inputs'!#REF!&\" (non-res)\")","v":{"$error":"#REF!"}}]
["Windows",{"$f":"'Model Inputs'!C31","v":0},{"$f":"'Model Inputs'!F32&\", \"&'Model Inputs'!F31&\", U-\"&'Model Inputs'!F33&\", SHGC-\"&'Model Inputs'!F34","v":", , U-, SHGC-"},{"$f":"\"Baseline: U-\"&'Model Inputs'!E33&\", SHGC-\"&'Model Inputs'!E34&\"\nProposed: U-\"&'Model Inputs'!F33&\", SHGC-\"&'Model Inputs'!F34","v":"Baseline: U-, SHGC-\nProposed: U-, SHGC-"},{"$f":"\"Windows: \"&'Model Inputs'!E32&\", \"&'Model Inputs'!E31&\", U-\"&'Model Inputs'!E33&\", SHGC-\"&'Model Inputs'!E34","v":"Windows: Per ASHRAE, , U-, SHGC-"}]
["Shading Devices",{"$f":"'Model Inputs'!C35","v":0},{"$f":"'Model Inputs'!F35","v":0},{"$f":"\"Baseline: \"&'Model Inputs'!E35&\"\nProposed: \"&'Model Inputs'!F35","v":"Baseline: \nProposed: "},{"$f":"'Model Inputs'!E35","v":0}]
["Exterior Doors",{"$f":"'Model Inputs'!C37","v":0},{"$f":"'Model Inputs'!F37&\", U-\"&'Model Inputs'!F38","v":", U-"},{"$f":"\"Baseline: U-\"&'Model Inputs'!E38&\"\nProposed: U-\"&'Model Inputs'!F38","v":"Baseline: U-\nProposed: U-"},{"$f":"\"Exterior doors: \"&'Model Inputs'!E37&\", U-\"&'Model Inputs'!E38","v":"Exterior doors: , U-"}]
["HEATING & COOLING",null,"The Heating and Cooling measures listed below must comply with ASHRAE Standard 90.1-2010 Section 6.4 in addition to the listed requirements below."]
["Space Heating - Type & Efficiency","NA",{"$f":"\"Primary system: \"&'Model Inputs'!F70&\" \"&'Model Inputs'!F69&\" (\"&'Model Inputs'!AB71&\")\"&IF(AND('Model Inputs'!F73<>\"N/A\",'Model Inputs'!L73=\"No\"),\"; Secondary system: \"&'Model Inputs'!F74&\" \"&'Model Inputs'!F73&\" (\"&'Model Inputs'!AB75&\")\",\"\")&IF(AND('Model Inputs'!F77<>\"N/A\",'Model Inputs'!L77=\"No\"),\"; Tertiary System: \"&'Model Inputs'!F78&\" \"&'Model Inputs'!F77&\" (\"&'Model Inputs'!AB79&\")\",\"\")","v":"Primary system:   ( COP)"},{"$f":"\"Baseline: \"&'Model Inputs'!AA71&\"\nProposed (Primary): \"&'Model Inputs'!AB71&IF(AND('Model Inputs'!F73<>\"N/A\",'Model Inputs'!L73=\"No\"),\"\nProposed (Secondary): \"&'Model Inputs'!AB75,\"\")&IF(AND('Model Inputs'!L77=\"No\",'Model Inputs'!F77<>\"N/A\"),\"\nProposed (Tertiary): \"&'Model Inputs'!AB79,\"\")","v":"Baseline:  COP\nProposed (Primary):  COP"},{"$f":"'Model Inputs'!E70&\" \"&'Model Inputs'!E69&\" (\"&'Model Inputs'!AA71&\")\"","v":"  ( COP)"}]
["Space Heating - Type & Efficiency (Primary)",{"$f":"'Model Inputs'!C69","v":0},{"$f":"'Model Inputs'!F70&\" \"&'Model Inputs'!F69&\", \"&'Model Inputs'!AB71&\" serving \"&'Model Inputs'!K69","v":" ,  COP serving "},{"$f":"\"Baseline: \"&'Model Inputs'!AA71&\"\nProposed: \"&'Model Inputs'!AB71","v":"Baseline:  COP\nProposed:  COP"},{"$f":"'Model Inputs'!E70&\" \"&'Model Inputs'!E69&\", \"&'Model Inputs'!AA71","v":" ,  COP"}]
["Space Heating - Type & Efficiency (Secondary)",{"$f":"'Model Inputs'!C73","v":0},{"$f":"IF('Model Inputs'!F73=\"N/A\",\"N/A\",'Model Inputs'!F74&\" \"&'Model Inputs'!F73&\", \"&'Model Inputs'!AB75&\" serving \"&'Model Inputs'!K73)","v":" , 0% Et serving "},{"$f":"IF(C32=\"N/A\",\"N/A\",\"Baseline: \"&'Model Inputs'!AA71&\"\nProposed: \"&'Model Inputs'!AB75)","v":"Baseline:  COP\nProposed: 0% Et"},{"$f":"IF(C31=\"N/A\",\"N/A\",E31)","v":" ,  COP"}]
["Space Heating - Type & Efficiency (Tertiary)",{"$f":"'Model Inputs'!C77","v":0},{"$f":"IF('Model Inputs'!F77=\"N/A\",\"N/A\",'Model Inputs'!F78&\" \"&'Model Inputs'!F77&\", \"&'Model Inputs'!AB79&\" serving \"&'Model Inputs'!K77)","v":" , 0% Et serving "},{"$f":"IF(C33=\"N/A\",\"N/A\",\"Baseline: \"&'Model Inputs'!AA71&\"\nProposed: \"&'Model Inputs'!AB79)","v":"Baseline:  COP\nProposed: 0% Et"},{"$f":"IF(D33=\"N/A\",\"N/A\",E32)","v":" ,  COP"}]
["Heating Terminal Units - Electric or Freeze Protection","NA",{"$f":"IF('Model Inputs'!L69=\"Yes\",\"Primary System: \"&'Model Inputs'!F70&\" \"&'Model Inputs'!F69&\" (\"&'Model Inputs'!AB71&\")\",IF('Model Inputs'!L73=\"Yes\",\"Secondary System: \"&'Model Inputs'!F74&\" \"&'Model Inputs'!F73&\" (\"&'Model Inputs'!AB75&\")\",IF('Model Inputs'!L77=\"Yes\",\"Tertiary System: \"&'Model Inputs'!F78&\" \"&'Model Inputs'!F77&\" (\"&'Model Inputs'!AB79&\")\",\"N/A\")))","v":"N/A"},{"$f":"IF(AND(OR('Model Inputs'!L69=\"No\",'Model Inputs'!L69=\"\"),OR('Model Inputs'!L73=\"No\",'Model Inputs'!L73=\"\"),OR('Model Inputs'!L77=\"No\",'Model Inputs'!L77=\"\")),\"N/A\",\"Baseline: 0 kW\nProposed: \"&IF('Model Inputs'!L69=\"Yes\",'Model Inputs'!AB71,IF('Model Inputs'!L73=\"Yes\",'Model Inputs'!AB75,IF('Model Inputs'!L77=\"Yes\",'Model Inputs'!AB79))))","v":"N/A"},"N/A"]
["Space Heating Distribution -Fan Power",{"$f":"'Model Inputs'!C117","v":0},{"$f":"IF('Model Inputs'!F117=\"N/A\",\"N/A\",'Model Inputs'!F117&\" kW/CFM\")","v":" kW/CFM"},{"$f":"IF(C35=\"N/A\",\"N/A\",\"Baseline: \"&'Model Inputs'!E117&\" kW/CFM\nProposed: \"&'Model Inputs'!F117&\" kW/CFM\")","v":"Baseline: 0.0003 kW/CFM\nProposed:  kW/CFM"},{"$f":"IF(D35=\"N/A\",\"N/A\",\"Space heating fan power: \"&'Model Inputs'!E117&\" kW/CFM\")","v":"Space heating fan power: 0.0003 kW/CFM"}]
["Space Heating Distribution - Fan Control",{"$f":"'Model Inputs'!C116","v":0},{"$f":"IF('Model Inputs'!F116=\"N/A\",\"N/A\",\"Space heating fan controls: \"&'Model Inputs'!F116)","v":"Space heating fan controls: "},{"$f":"IF(C36=\"N/A\",\"N/A\",\"Baseline: \"&'Model Inputs'!E116&\"\nProposed: \"&'Model Inputs'!F116)","v":"Baseline: Constant Volume\nProposed: "},{"$f":"IF(D36=\"N/A\",\"N/A\",\"Space heating fan controls: \"&'Model Inputs'!E116)","v":"Space heating fan controls: Constant Volume"}]
["Space Cooling Distribution - Fan Control",{"$f":"'Model Inputs'!C118","v":0},{"$f":"IF('Model Inputs'!F118=\"N/A\",\"N/A\",\"Space cooling fan controls: \"&'Model Inputs'!F118)","v":"Space cooling fan controls: "},{"$f":"IF(C37=\"N/A\",\"N/A\",\"Baseline: \"&'Model Inputs'!E118&\"\nProposed: \"&'Model Inputs'!F118)","v":"Baseline: Constant Volume\nProposed: "},{"$f":"IF(D37=\"N/A\",\"N/A\",\"Space cooling fan controls: \"&'Model Inputs'!E118)","v":"Space cooling fan controls: Constant Volume"}]
["Space Cooling Distribution - Fan Power",{"$f":"'Model Inputs'!C119","v":0},{"$f":"IF('Model Inputs'!F119=\"N/A\",\"N/A\",'Model Inputs'!F119&\" kW/CFM\")","v":" kW/CFM"},{"$f":"IF(C38=\"N/A\",\"N/A\",\"Baseline: \"&'Model Inputs'!E119&\" kW/CFM\nProposed: \"&'Model Inputs'!F119&\" kW/CFM\")","v":"Baseline: 0.0003 kW/CFM\nProposed:  kW/CFM"},{"$f":"IF(D38=\"N/A\",\"N/A\",\"Space cooling fan power: \"&'Model Inputs'!E119&\" kW/CFM\")","v":"Space cooling fan power: 0.0003 kW/CFM"}]
["Space Heating - Sizing","NA",{"$f":"\"Primary System: \"&'Model Inputs'!F72&\" kBtu\"&IF('Model Inputs'!F73<>\"N/A\",\"\nSecondary System: \"&'Model Inputs'!F76&\" kBtu\"&IF('Model Inputs'!F77<>\"N/A\",\"\nTertiary System: \"&'Model Inputs'!F80&\" kBtu\",\"\"),\"\")","v":"Primary System:  kBtu\nSecondary System:  kBtu\nTertiary System:  kBtu"},{"$f":"\"Baseline: \"&'Model Inputs'!E72&\" kBtu\"&\"\nProposed: \"&('Model Inputs'!F72+IF('Model Inputs'!F76<>\"N/A\",'Model Inputs'!F76,0)+IF('Model Inputs'!F80<>\"N/A\",'Model Inputs'!F80,0)&\" kBtu\")","v":"Baseline:  kBtu\nProposed: 0 kBtu"},{"$f":"'Model Inputs'!E72&\" kBtu\"","v":" kBtu"}]
["Space Heating - Design Temperatures",{"$f":"'Model Inputs'!C100","v":0},{"$f":"\"Hot Water Design Supply Temperature: \"&'Model Inputs'!F100&\" °F\nHot Water Design Return Temperature:  \"&'Model Inputs'!F101&\" °F\"","v":"Hot Water Design Supply Temperature:  °F\nHot Water Design Return Temperature:   °F"},{"$f":"\"Baseline: \"&'Model Inputs'!E100&\"°F, DELTA_T: \"&('Model Inputs'!E100-'Model Inputs'!E101)&\"°F\nProposed: \"&'Model Inputs'!F100&\"°F, DELTA_T: \"&('Model Inputs'!F100-'Model Inputs'!F101)&\"°F\"","v":"Baseline: 180°F, DELTA_T: 50°F\nProposed: °F, DELTA_T: 0°F"},{"$f":"\"Hot Water Design Supply Temperature: \"&'Model Inputs'!E100&\" °F\nHot Water Design Return Temperature:  \"&'Model Inputs'!E101&\" °F\"","v":"Hot Water Design Supply Temperature: 180 °F\nHot Water Design Return Temperature:  130 °F"}]
["Space Heating - Controls",{"$f":"'Model Inputs'!C102","v":0},{"$f":"'Model Inputs'!F102&\", \"&'Model Inputs'!F103","v":", "},{"$f":"\"Baseline :\"&'Model Inputs'!E102&\", \"&'Model Inputs'!E103&\"\nProposed: \"&'Model Inputs'!F102&\", \"&'Model Inputs'!F103","v":"Baseline :OA Reset, 180°F at 20°F and below, \n150°F at 50°F and above\nProposed: , "},{"$f":"'Model Inputs'!E102&\", \"&'Model Inputs'!E103","v":"OA Reset, 180°F at 20°F and below, \n150°F at 50°F and above"}]
["Thermostat Setting","NA",{"$f":"\"Heating: \"&'Model Inputs'!F107&\"/\"&'Model Inputs'!F105&\"\nCooling: \"&'Model Inputs'!F108&\"/\"&'Model Inputs'!F110","v":"Heating: 70 °F/72 °F\nCooling: 78 °F/80 °F"},{"$f":"\"Heating: \"&'Model Inputs'!F107&\"/\"&'Model Inputs'!F105&\"\nCooling: \"&'Model Inputs'!F108&\"/\"&'Model Inputs'!F110","v":"Heating: 70 °F/72 °F\nCooling: 78 °F/80 °F"},{"$f":"\"Heating: \"&'Model Inputs'!E107&\"/\"&'Model Inputs'!E105&\"\nCooling: \"&'Model Inputs'!E108&\"/\"&'Model Inputs'!E110","v":"Heating: 70 °F/72 °F\nCooling: 78 °F/80 °F"}]
["Space Cooling - Type and Efficiency","NA",{"$f":"IF('Model Inputs'!F85=\"N/A\",\"N/A\",\"Primary System: \"&'Model Inputs'!F86&\" \"&'Model Inputs'!F85&\" serving \"&'Model Inputs'!J85&\", \"&'Model Inputs'!AB87&\" \"&IF('Model Inputs'!F89<>\"N/A\",\"\nSecondary system: \"&'Model Inputs'!F90&\" \"&'Model Inputs'!F89&\" serving \"&'Model Inputs'!J89&\", \"&'Model Inputs'!AB91,\"\")&IF('Model Inputs'!F93<>\"N/A\",\"\nSecondary system: \"&'Model Inputs'!F94&\" \"&'Model Inputs'!F93&\" serving \"&'Model Inputs'!J93&\", \"&'Model Inputs'!AB95,\"\"))","v":"Primary System:   serving ,  EER \nSecondary system:   serving ,  EER\nSecondary system:   serving ,  EER"},{"$f":"\"Baseline: \"&'Model Inputs'!AA87&\"\nProposed (Primary): \"&'Model Inputs'!AB87&IF('Model Inputs'!F89<>\"N/A\",\"\nProposed (Secondary): \"&'Model Inputs'!AB91)&IF('Model Inputs'!F93<>\"N/A\",\"\nProposed (Secondary): \"&'Model Inputs'!AB95)","v":"Baseline:  EER\nProposed (Primary):  EER\nProposed (Secondary):  EER\nProposed (Secondary):  EER"},{"$f":"\"Primary System: \"& 'Model Inputs'!E86&\" \"&'Model Inputs'!E85&\" serving whole building, \"&'Model Inputs'!AA87&IF('Model Inputs'!E89<>\"N/A\",\"\nSecondary system: \"&'Model Inputs'!E90&\", \"&'Model Inputs'!AA91&\" \"&'Model Inputs'!E89&\" serving \"&'Model Inputs'!I89,\"\")","v":"Primary System:   serving whole building,  EER"}]
["Space Cooling - Type and Efficiency (Primary)",{"$f":"'Model Inputs'!C85","v":0},{"$f":"'Model Inputs'!F86&\" \"&'Model Inputs'!F85&\", \"&'Model Inputs'!AB87&\" serving \"&'Model Inputs'!J85","v":" ,  EER serving "},{"$f":"IF($C$44=\"N/A\",\"N/A\",\"Baseline: \"&'Model Inputs'!$AA$87&\"\nProposed: \"&'Model Inputs'!$AB$87)","v":"Baseline:  EER\nProposed:  EER"},{"$f":"IF(D44=\"N/A\",\"N/A\",'Model Inputs'!$E$86&\" \"&'Model Inputs'!$E$85&\", \"&'Model Inputs'!$AA$87)","v":" ,  EER"}]
["Space Cooling - Type and Efficiency (Secondary)",{"$f":"'Model Inputs'!C89","v":0},{"$f":"IF(OR('Model Inputs'!F89=\"N/A\",'Model Inputs'!F89=\"\"),\"N/A\",'Model Inputs'!F90&\" \"&'Model Inputs'!F89&\", \"&'Model Inputs'!AB91&\" serving \"&'Model Inputs'!J89)","v":"N/A"},{"$f":"IF(C45=\"N/A\",\"N/A\",\"Baseline: \"&'Model Inputs'!AA87&\"\nProposed: \"&'Model Inputs'!AB91)","v":"N/A"},{"$f":"IF(D45=\"N/A\",\"N/A\",'Model Inputs'!$E$86&\" \"&'Model Inputs'!$E$85&\", \"&'Model Inputs'!$AA$87)","v":"N/A"}]
["Space Cooling - Type and Efficiency (Tertiary)",{"$f":"'Model Inputs'!C93","v":0},{"$f":"IF(OR('Model Inputs'!F93=\"N/A\",'Model Inputs'!F93=\"\"),\"N/A\",'Model Inputs'!F94&\" \"&'Model Inputs'!F93&\", \"&'Model Inputs'!AB95&\" serving \"&'Model Inputs'!J93)","v":"N/A"},{"$f":"IF(C46=\"N/A\",\"N/A\",\"Baseline: \"&'Model Inputs'!AA87&\"\nProposed: \"&'Model Inputs'!AB95)","v":"N/A"},{"$f":"IF(D46=\"N/A\",\"N/A\",'Model Inputs'!$E$86&\" \"&'Model Inputs'!$E$85&\", \"&'Model Inputs'!$AA$87)","v":"N/A"}]
["Space Cooling - Sizing","NA",{"$f":"IF('Model Inputs'!F92=\"N/A\",\"N/A\",\"Primary system: \"&'Model Inputs'!F88&\" tons\"&IF('Model Inputs'!F89<>\"N/A\",\"\nSecondary system: \"&'Model Inputs'!F92&\" tons\",\"\"))","v":"Primary system:  tons\nSecondary system:  tons"},{"$f":"IF(C47=\"N/A\",\"N/A\",\"Baseline: \"&'Model Inputs'!E88&\" tons\nProposed (primary): \"&'Model Inputs'!F88&\" tons\"&IF('Model Inputs'!F89<>\"N/A\",\"\nProposed (secondary): \"&'Model Inputs'!F92&\" tons\",\"\"))","v":"Baseline:  tons\nProposed (primary):  tons\nProposed (secondary):  tons"},{"$f":"IF(C47=\"N/A\",\"N/A\",'Model Inputs'!E88&\" tons\")","v":" tons"}]
["Space Cooling - Controls","NA",{"$f":"'Model Inputs'!F104","v":0},{"$f":"\"Baseline: \"&'Model Inputs'!E104&\"\nProposed: \"&'Model Inputs'!F104","v":"Baseline: None\nProposed: "},{"$f":"'Model Inputs'!E104","v":"None"}]
["LIGHTING "]
["Lighting Controls",{"$f":"'Model Inputs'!C45","v":0},{"$f":"'Model Inputs'!$F$45","v":0},{"$f":"\"Baseline: \"&'Model Inputs'!$E$45&\"\nProposed: \"&'Model Inputs'!$F$45","v":"Baseline: N/A\nProposed: "},{"$f":"\"Lighting Controls: \"&'Model Inputs'!$E$45","v":"Lighting Controls: N/A"}]
["Common Area Lighting",{"$f":"'Model Inputs'!C43","v":0},{"$f":"\"Corridors: \"&'Model Inputs'!F43&\", \"&'Model Inputs'!$F$44","v":"Corridors: , "},{"$f":"IF(C51=\"N/A\",\"N/A\",\"Baseline: Corridors - \"&'Model Inputs'!E43&\", \"&'Model Inputs'!$E$44&\"\nProposed: Corridors - \"&'Model Inputs'!F43&\", \"&'Model Inputs'!$F$44)","v":"Baseline: Corridors - 0.66, \nProposed: Corridors - , "},{"$f":"\"Corridors - \"&'Model Inputs'!E43&\", \"&'Model Inputs'!$E$44","v":"Corridors - 0.66, "}]
["Exit Signs",{"$f":"'Model Inputs'!C46","v":0},{"$f":"IF('Model Inputs'!F46=\"N/A\",\"N/A\",\"Exit Signs: \"& 'Model Inputs'!$F$46&\" kW\")","v":"Exit Signs:  kW"},{"$f":"IF(C52=\"N/A\",\"N/A\",\"Baseline: \"&'Model Inputs'!$E$46&\" kW\nProposed: \"&'Model Inputs'!$F$46&\" kW\")","v":"Baseline:  kW\nProposed:  kW"},{"$f":"IF(C52=\"N/A\",\"N/A\",\"Exit Signs: \"&'Model Inputs'!$E$46& \" kW\")","v":"Exit Signs:  kW"}]
["Exterior Lights",{"$f":"'Model Inputs'!C48","v":0},{"$f":"IF('Model Inputs'!F48=\"N/A\",\"N/A\",\"Exterior Lighting: \"&'Model Inputs'!$F$48&\" kW\")","v":"Exterior Lighting:  kW"},{"$f":"IF(C53=\"N/A\",\"N/A\",\"Baseline: \"&'Model Inputs'!$E$48&\" kW, 12 hr/day\nProposed: \"&'Model Inputs'!$F$48&\" kW, 12 hr/day\")","v":"Baseline:  kW, 12 hr/day\nProposed:  kW, 12 hr/day"},{"$f":"IF(C53=\"N/A\",\"N/A\",\"Exterior Lighting: \"&'Model Inputs'!$E$48&\" kW\")","v":"Exterior Lighting:  kW"}]
["Garage Lighting",{"$f":"'Model Inputs'!C47","v":0},{"$f":"IF('Model Inputs'!F47=\"N/A\",\"N/A\",\"Garage Lighting: \"&'Model Inputs'!$F$47&\" W/SF\")","v":"Garage Lighting:  W/SF"},{"$f":"IF(C54=\"N/A\",\"N/A\",\"Baseline: \"&'Model Inputs'!$E$47& \" W/SF, 24 hr/day\nProposed: \"&'Model Inputs'!$F$47&\" W/SF, 24 hr/day\")","v":"Baseline:  W/SF, 24 hr/day\nProposed:  W/SF, 24 hr/day"},{"$f":"IF(D54=\"N/A\",\"N/A\",\"Garage Lighting: \"&'Model Inputs'!$E$47&\" W/SF\")","v":"Garage Lighting:  W/SF"}]
["In-Unit Lighting",{"$f":"'Model Inputs'!C42","v":0},{"$f":"\"In-unit Lighting: \"&'Model Inputs'!$F$42&\" W/SF\"","v":"In-unit Lighting:  W/SF"},{"$f":"\"Baseline: \"&'Model Inputs'!$E$42&\" W/SF, 2.34 hr/day\nProposed: \"&'Model Inputs'!$F$42&\" W/SF, 2.34 hr/day\"","v":"Baseline: 0.6 W/SF, 2.34 hr/day\nProposed:  W/SF, 2.34 hr/day"},{"$f":"\"In-unit Lighting: \"&'Model Inputs'!$E$42&\" W/SF\"","v":"In-unit Lighting: 0.6 W/SF"}]
["MOTORS (3-PHASE , > 1 HP)"]
["Heating Circulating Pumps",{"$f":"'Model Inputs'!C111","v":0},{"$f":"IF('Model Inputs'!F111=\"No\",\"N/A\",'Model Inputs'!G111&\" \"&'Model Inputs'!H111&\" \"&'Model Inputs'!I111&\" NEMA \"&'Model Inputs'!F113&\" Motor, \"&'Model Inputs'!F112&\" W/GPM\")","v":"   NEMA  Motor,  W/GPM"},{"$f":"IF(C57=\"N/A\",\"N/A\",IF('Model Inputs'!$F$111=\"No\",\"Baseline: \"&'Model Inputs'!$E$112&\" W/CFM\nProposed: 0 W/GPM\",\"Baseline: \"&'Model Inputs'!$E$112&\" W/GPM\nProposed: \"&'Model Inputs'!$F$112&\" W/GPM\"))","v":"Baseline: 19 W/GPM\nProposed:  W/GPM"},{"$f":"IF(C57=\"N/A\",\"N/A\",IF('Model Inputs'!$F$111=\"No\",\"Not applicable\",\"NEMA \"&'Model Inputs'!E113&\" Motor, \"&'Model Inputs'!E112&\" W/GPM\"))","v":"NEMA Standard Motor, 19 W/GPM"}]
["Heating Circulating Pumps - Control",{"$f":"'Model Inputs'!C114","v":0},{"$f":"IF('Model Inputs'!F111=\"No\",\"N/A\",\"Heating pump motor: \"&'Model Inputs'!F115&\" hp \"&'Model Inputs'!F114)","v":"Heating pump motor:  hp "},{"$f":"IF(C58=\"N/A\",\"N/A\",\"Baseline: \"&'Model Inputs'!E115&\" hp \"&'Model Inputs'!E114&\" motor\nProposed: \"&'Model Inputs'!F115&\" hp \"&'Model Inputs'!F114&\" motor\")","v":"Baseline:  hp One-Speed motor\nProposed:  hp  motor"},{"$f":"IF(C58=\"N/A\",\"N/A\",IF('Model Inputs'!$F$111=\"No\",\"Not applicable\",\"Heating pump motor: \"&'Model Inputs'!E115&\" hp \"&'Model Inputs'!E114))","v":"Heating pump motor:  hp One-Speed"}]
["DHW Circulating Pumps",{"$f":"'Model Inputs'!C129","v":0},{"$f":"IF('Model Inputs'!F129=\"No\",\"N/A\",IF('Model Inputs'!F129=\"No\",\"Not applicable\",'Model Inputs'!F130&\" \"&'Model Inputs'!H129&\" \"&'Model Inputs'!I129&\" \"&'Model Inputs'!F134&\" hp NEMA \"&'Model Inputs'!F132&\" efficient motor, \"&TEXT('Model Inputs'!F131,\"0.0%\")))","v":"    hp NEMA  efficient motor, 0.0%"},{"$f":"IF(C59=\"N/A\",\"N/A\",IF('Model Inputs'!$F$129=\"No\",\"Not applicable\",\"Baseline: \"&TEXT('Model Inputs'!$E$131,\"0.0%\")&\"\nProposed: \"&TEXT('Model Inputs'!$F$131,\"0.0%\")))","v":"Baseline: 0.0%\nProposed: 0.0%"},{"$f":"IF(C59=\"N/A\",\"N/A\",IF('Model Inputs'!$F$129=\"No\",\"Not applicable\",'Model Inputs'!$E$130&\" \"&'Model Inputs'!$E$134&\" hp NEMA \"&'Model Inputs'!$E$132&\" efficiency motor, \"&TEXT('Model Inputs'!$E$131,\"0.0%\")&\" efficient\"))","v":"  hp NEMA  efficiency motor, 0.0% efficient"}]
["DHW Circulating Pumps - Control",{"$f":"'Model Inputs'!C133","v":0},{"$f":"IF('Model Inputs'!F129=\"No\",\"N/A\",\"DHW pump control: \"&'Model Inputs'!F134&\" hp \"&'Model Inputs'!F133)","v":"DHW pump control:  hp "},{"$f":"IF(C60=\"N/A\",\"N/A\",\"Baseline: \"&'Model Inputs'!E134&\" hp \"&'Model Inputs'!E133&\" control\nProposed: \"&'Model Inputs'!F134&\" hp \"&'Model Inputs'!F133&\" control\")","v":"Baseline:  hp  control\nProposed:  hp  control"},{"$f":"IF(C60=\"N/A\",\"N/A\",IF('Model Inputs'!F128=\"No\",\"Not applicable\",\"DHW pump control: \"&'Model Inputs'!E134&\" hp \"&'Model Inputs'!E133))","v":"DHW pump control:  hp "}]
["VENTILATION"]
["Ventilation: Thermal\n(Apartments)",{"$f":"'Model Inputs'!C142","v":0},{"$f":"\"Kitchen: \"&'Model Inputs'!F143&\" CFM (\"&'Model Inputs'!$K$143&\")\nBathroom: \"&'Model Inputs'!F142&\" CFM (\"&'Model Inputs'!$K$142&\")\"","v":"Kitchen: 0 CFM (0)\nBathroom: 0 CFM (0)"},{"$f":"\"Baseline: \"&('Model Inputs'!E142*'Model Inputs'!G142+'Model Inputs'!E143*'Model Inputs'!G143)&\" CFM\nProposed: \"&('Model Inputs'!F142*'Model Inputs'!G142+'Model Inputs'!F143*'Model Inputs'!G143)&\" CFM\"","v":"Baseline: 0 CFM\nProposed: 0 CFM"},{"$f":"\"Kitchen: \"&'Model Inputs'!E143&\" CFM (\"&'Model Inputs'!$K$143&\")\nBathroom: \"&'Model Inputs'!E142&\" CFM (\"&'Model Inputs'!$K$142&\")\"","v":"Kitchen: 0 CFM (0)\nBathroom: 20 CFM (0)"}]
["Ventilation: Thermal (Non-apt, Non-corridor spaces)",{"$f":"'Model Inputs'!C156","v":0},{"$f":"IF('Model Inputs'!F156=\"N/A\",\"N/A\",(\"Non-corridor: \"&'Model Inputs'!F156&\" CFM\"))","v":"Non-corridor:  CFM"},{"$f":"IF(C63=\"N/A\",\"N/A\",\"Baseline: \"&'Model Inputs'!E156&\" CFM\nProposed: \"&'Model Inputs'!F156&\" CFM\")","v":"Baseline: N/A CFM\nProposed:  CFM"},{"$f":"IF(D63=\"N/A\",\"N/A\",\"Non-corridor Exhaust: \"&'Model Inputs'!E156&\" CFM\")","v":"Non-corridor Exhaust: N/A CFM"}]
["Ventilation: Thermal\nCorridors",{"$f":"'Model Inputs'!C153","v":0},{"$f":"IF('Model Inputs'!F153=\"N/A\",\"N/A\",\"Corridor: \"&'Model Inputs'!F153&\" CFM\")","v":"Corridor: 0 CFM"},{"$f":"IF(C64=\"N/A\",\"N/A\",\"Baseline: \"&'Model Inputs'!E153&\" CFM\nProposed: \"&'Model Inputs'!F153&\" CFM\")","v":"Baseline: 0 CFM\nProposed: 0 CFM"},{"$f":"IF(D64=\"N/A\",\"N/A\",\"Corridor Supply Ventilation: \"&'Model Inputs'!E153&\" CFM\")","v":"Corridor Supply Ventilation: 0 CFM"}]
["Ventilation: Supply to Apartments (Fresh Air)","NA",{"$f":"'Model Inputs'!F151","v":0},{"$f":"\"Baseline: \"&'Model Inputs'!E151&\"\nProposed: \"&'Model Inputs'!F151","v":"Baseline: \nProposed: "},{"$f":"\"Fresh air supplied to apts by: \"&'Model Inputs'!E151","v":"Fresh air supplied to apts by: "}]
["Ventilation: Infiltration",{"$f":"'Model Inputs'!C152","v":0},{"$f":"\"Proposed infiltration rate: \"&'Model Inputs'!F152&\" ACH\"","v":"Proposed infiltration rate: 0 ACH"},{"$f":"\"Baseline: \"&'Model Inputs'!E152&\" ACH\nProposed: \"&'Model Inputs'!F152&\" ACH\"","v":"Baseline: 0 ACH\nProposed: 0 ACH"},{"$f":"\"Baseline infiltration rate: \"&'Model Inputs'!E152 &\"ACH\"","v":"Baseline infiltration rate: 0ACH"}]
["Ventilation: Efficiency Other Fans",{"$f":"'Model Inputs'!C159","v":0},{"$f":"\"Proposed fan efficiency: \"&'Model Inputs'!F159*100&\"%\"","v":"Proposed fan efficiency: 0%"},{"$f":"\"Baseline: Included in baseline allowance\nProposed: \"&'Model Inputs'!F159*100&\"%\"","v":"Baseline: Included in baseline allowance\nProposed: 0%"},"Included in W/CFM baseline allowance per ASHRAE 90.1 Appx G3.1.2.10"]
["Ventilation: Supply Airflow (CFM)\nPrimary System",{"$f":"'Model Inputs'!C161","v":0},{"$f":"\"Proposed supply airflow (primary system): \"&'Model Inputs'!F161&\" CFM\"","v":"Proposed supply airflow (primary system):  CFM"},{"$f":"\"Baseline: \"&'Model Inputs'!E161&\" CFM\nProposed: \"&'Model Inputs'!F161&\" CFM\"","v":"Baseline:  CFM\nProposed:  CFM"},{"$f":"\"Baseline supply airflow (primary system): \"&'Model Inputs'!E161&\" CFM\"","v":"Baseline supply airflow (primary system):  CFM"}]
["Ventilation: Supply Airflow (CFM)\nSecondary System",{"$f":"'Model Inputs'!C162","v":0},{"$f":"\"Proposed supply airflow (secondary system): \"&'Model Inputs'!F162&\" CFM\"","v":"Proposed supply airflow (secondary system):  CFM"},{"$f":"\"Baseline: \"&'Model Inputs'!E162&\" CFM\nProposed: \"&'Model Inputs'!F162&\" CFM\"","v":"Baseline:  CFM\nProposed:  CFM"},{"$f":"\"Baseline supply airflow (secondary system): \"&'Model Inputs'!E162&\" CFM\"","v":"Baseline supply airflow (secondary system):  CFM"}]
["Ventilation: Supply Airflow (CFM)\nTertiary System",{"$f":"'Model Inputs'!C163","v":0},{"$f":"\"Proposed supply airflow (tertiary system): \"&'Model Inputs'!F163&\" CFM\"","v":"Proposed supply airflow (tertiary system):  CFM"},{"$f":"\"Baseline: \"&'Model Inputs'!E163&\" CFM\nProposed: \"&'Model Inputs'!F163&\" CFM\"","v":"Baseline:  CFM\nProposed:  CFM"},{"$f":"\"Baseline supply airflow (tertiary system): \"&'Model Inputs'!E163&\" CFM\"","v":"Baseline supply airflow (tertiary system):  CFM"}]
["Ventilation: Thermal\n(Heat Recovery)",{"$f":"'Model Inputs'!C164","v":0},{"$f":"IF('Model Inputs'!F164=\"N/A\",\"N/A\",\"HRV/ERV: \"&'Model Inputs'!F164&\", \"&'Model Inputs'!F166*100&\"%\")","v":"HRV/ERV: , 0%"},{"$f":"IF(C71=\"N/A\",\"N/A\",IF('Model Inputs'!F164=\"N/A\",\"N/A\",\"Baseline: \"&'Model Inputs'!E164&\"\nProposed: \"&('Model Inputs'!F166*100)&\"%\"))","v":"Baseline: N/A\nProposed: 0%"},{"$f":"IF(D71=\"N/A\",\"N/A\",\"HRV/ERV: \"&'Model Inputs'!E164)","v":"HRV/ERV: N/A"}]
["Ventilation: Thermal\n(Duct Sealing - Apts)",{"$f":"'Model Inputs'!C144","v":0},{"$f":"IF('Model Inputs'!E144=0,\"N/A\",\"Apt Duct Sealing: \"&'Model Inputs'!F144&\" CFM\")","v":"N/A"},{"$f":"IF(C72=\"N/A\",\"N/A\",\"Baseline: \"&'Model Inputs'!E144&\" CFM\nProposed: \"&'Model Inputs'!F144&\" CFM\")","v":"N/A"},{"$f":"IF('Model Inputs'!E144=0,\"N/A\",\"Baseline Apt Duct Sealing: \"&'Model Inputs'!E144&\" CFM\")","v":"N/A"}]
["Ventilation Thermal \n(Duct Sealing - Corridors)",{"$f":"'Model Inputs'!C154","v":0},{"$f":"IF('Model Inputs'!E154=0,\"N/A\",\"Corridor Duct Sealing: \"&'Model Inputs'!F154&\" CFM\")","v":"N/A"},{"$f":"IF(C73=\"N/A\",\"N/A\",\"Baseline: \"&'Model Inputs'!E154&\" CFM\nProposed: \"&'Model Inputs'!F154&\" CFM\")","v":"N/A"},{"$f":"IF('Model Inputs'!E154=0,\"N/A\",\"Baseline Corridor Duct Sealing: \"&'Model Inputs'!E154&\" CFM\")","v":"N/A"}]
["Ventilation Thermal \n(Duct Sealing - Other)",{"$f":"'Model Inputs'!C157","v":0},{"$f":"IF('Model Inputs'!E157=0,\"N/A\",\"Other Duct Sealing: \"&'Model Inputs'!F157&\" CFM\")","v":"N/A"},{"$f":"IF(C74=\"N/A\",\"N/A\",\"Baseline: \"&'Model Inputs'!E157&\" CFM\nProposed: \"&'Model Inputs'!F157&\" CFM\")","v":"N/A"},{"$f":"IF('Model Inputs'!E157=0,\"N/A\",\"Baseline Other Duct Sealing :\"&'Model Inputs'!E157&\" CFM\")","v":"N/A"}]
["Ventilation: Electric\n(Apartments)",{"$f":"'Model Inputs'!C146","v":0},{"$f":"IF('Model Inputs'!F148=0,\"No intermittent fan power\",\"Intermittent Fan Power: \"&'Model Inputs'!F148 & \" kW\")","v":"No intermittent fan power"},{"$f":"IF('Model Inputs'!F148=0,\"No intermittent exhaust fans\",\"Baseline: \" &'Model Inputs'!E148&\" kW\nProposed: \"&'Model Inputs'!F148&\" kW\")","v":"No intermittent exhaust fans"},{"$f":"IF('Model Inputs'!F148=0,\"No intermittent fans\",\"Intermittent fan power: \"&'Model Inputs'!E148&\" kW\")","v":"No intermittent fans"}]
[null,{"$f":"'Model Inputs'!C145","v":0},{"$f":"IF('Model Inputs'!F146=0,\"No continuous fan power\",\"Continuous Fan Power: \"&'Model Inputs'!F146& \" kW\")","v":"No continuous fan power"},{"$f":"IF(C76=\"N/A\",\"N/A\",\"Baseline: \"&'Model Inputs'!E146&\" kW\nProposed: \"&'Model Inputs'!F146&\" kW\")","v":"Baseline: 0 kW\nProposed: 0 kW"},{"$f":"'Model Inputs'!D146","v":"Included in 0.3 W/CFM baseline PTAC/PTHP fan power allowance"}]
["Ventilation: Electric\n(Non-Apartment)",{"$f":"'Model Inputs'!C156","v":0},{"$f":"IF('Model Inputs'!F156=\"N/A\",\"N/A\",'Model Inputs'!G156&\" non-apt ventilation fans, \"&'Model Inputs'!F156&\" CFM, \"&'Model Inputs'!F158&\" hp, \"&'Model Inputs'!F159*100&\"%\")","v":" non-apt ventilation fans,  CFM,  hp, 0%"},{"$f":"IF(C77=\"N/A\",\"N/A\",\"Baseline: \"&'Model Inputs'!E160&\" kW\nProposed: \"&'Model Inputs'!F160&\" kW\")","v":"Baseline: N/A kW\nProposed:  kW"},{"$f":"'Model Inputs'!D158","v":"Included in W/CFM baseline allowance per ASHRAE 90.1 Appx G3.1.2.10"}]
["Ventilation: Demand  Control",{"$f":"'Model Inputs'!C175","v":0},{"$f":"\"Demand control ventilation: \"&'Model Inputs'!F175","v":"Demand control ventilation: "},{"$f":"IF('Model Inputs'!F175=\"N/A\",\"N/A\",\"Baseline: \"&'Model Inputs'!E177&\" kW, \"&'Model Inputs'!E176&\" hr/day\nProposed: \"&'Model Inputs'!F177&\" kW, \"&'Model Inputs'!F176&\" hr/day\")","v":"Baseline:  kW,  hr/day\nProposed:  kW,  hr/day"},{"$f":"\"Demand Control Ventilation: \"&'Model Inputs'!E175","v":"Demand Control Ventilation: N/A"}]
["Ventilation: Garage Demand Control",{"$f":"'Model Inputs'!C173","v":0},{"$f":"\"Garage Demand Ventilation: \"&'Model Inputs'!F174&\" hr/day\"","v":"Garage Demand Ventilation:  hr/day"},{"$f":"\"Baseline: \"&'Model Inputs'!E174&\" hr/day\nProposed: \"&'Model Inputs'!F174&\" hr/day\"","v":"Baseline: N/A hr/day\nProposed:  hr/day"},{"$f":"\"Baseline Garage Demand Ventilation: \"&'Model Inputs'!E174&\" hr/day\"","v":"Baseline Garage Demand Ventilation: N/A hr/day"}]
["Ventilation: Thermal & Electric\n(Garage Exhaust fan)",{"$f":"'Model Inputs'!C169","v":0},{"$f":"IF(OR('Model Inputs'!G169=0,'Model Inputs'!F169=\"N/A\"),\"N/A\",'Model Inputs'!G169&\" \"&'Model Inputs'!F170&\" hp garage exhaust fans, \"&'Model Inputs'!F171*100&\"% (\"&'Model Inputs'!F169&\" CFM each)\")","v":"N/A"},{"$f":"IF(C80=\"N/A\",\"N/A\",\"Baseline: \"&'Model Inputs'!E172&\" kW\nProposed: \"&'Model Inputs'!F172&\" kW\")","v":"N/A"},{"$f":"IF(D80=\"N/A\",\"N/A\",'Model Inputs'!G169&\" \"&'Model Inputs'!E170&\" hp garage exhaust fans, \"&'Model Inputs'!E171*100&\"% (\"&'Model Inputs'!E169&\" CFM each)\")","v":"N/A"}]
["MISC."]
["Renewables","N/A",{"$f":"IF('Model Inputs'!F180=\"N/A\",\"N/A\",'Model Inputs'!#REF!&\", \"&'Model Inputs'!#REF!)","v":{"$error":"#REF!"}},{"$f":"IF('Model Inputs'!F180=\"N/A\",\"N/A\",\"Baseline: None\nProposed: \"&'Model Inputs'!#REF!)","v":{"$error":"#REF!"}},{"$f":"'Model Inputs'!E180","v":0}]
["Motors",{"$f":"'Model Inputs'!C180","v":0},{"$f":"IF('Model Inputs'!F180=\"N/A\",\"N/A\",'Model Inputs'!F180)","v":0},{"$f":"IF('Model Inputs'!F180=\"N/A\",\"N/A\",\"Baseline: \"&'Model Inputs'!E180&\"\nProposed: \"&'Model Inputs'!F180)","v":"Baseline: \nProposed: "},{"$f":"IF('Model Inputs'!F180=\"N/A\",\"N/A\",'Model Inputs'!E180)","v":0}]
["Motors",{"$f":"'Model Inputs'!C181","v":0},{"$f":"IF('Model Inputs'!F181=\"N/A\",\"N/A\",'Model Inputs'!F181)","v":0},{"$f":"IF('Model Inputs'!F181=\"N/A\",\"N/A\",\"Baseline: \"&'Model Inputs'!E181&\"\nProposed: \"&'Model Inputs'!F181)","v":"Baseline: \nProposed: "},{"$f":"IF('Model Inputs'!F181=\"N/A\",\"N/A\",'Model Inputs'!E181)","v":0}]
["Motors",{"$f":"'Model Inputs'!C182","v":0},{"$f":"IF('Model Inputs'!F182=\"N/A\",\"N/A\",'Model Inputs'!F182)","v":0},{"$f":"IF('Model Inputs'!F182=\"N/A\",\"N/A\",\"Baseline: \"&'Model Inputs'!E182&\"\nProposed: \"&'Model Inputs'!F182)","v":"Baseline: \nProposed: "},{"$f":"IF('Model Inputs'!F182=\"N/A\",\"N/A\",'Model Inputs'!E182)","v":0}]

{"sheet":"GHSF Calculator","index":2,"n_rows":18,"n_cols":5,"rows_kept":18,"cut":false,"hidden":true,"merged":[]}
[]
[null,"Building Area","Total Square Ft","Conditioned?","GHSF"]
[null,"Apartment",{"$f":"'Basic Info'!C16","v":0},{"$f":"'Basic Info'!D16","v":"N/A"},{"$f":"IF(OR(D3=\"Heated & Cooled\",D3=\"Heated-Only\")=TRUE,C3,0)","v":0}]
[null,"Storage, active",{"$f":"'Basic Info'!C17","v":0},{"$f":"'Basic Info'!D17","v":"N/A"},{"$f":"IF(OR(D4=\"Heated & Cooled\",D4=\"Heated-Only\")=TRUE,C4,0)","v":0}]
[null,"Storage, inactive",{"$f":"'Basic Info'!C18","v":0},{"$f":"'Basic Info'!D18","v":"N/A"},{"$f":"IF(OR(D5=\"Heated & Cooled\",D5=\"Heated-Only\")=TRUE,C5,0)","v":0}]
[null,"Lobby",{"$f":"'Basic Info'!C19","v":0},{"$f":"'Basic Info'!D19","v":"N/A"},0]
[null,"Corridor/Transition",{"$f":"'Basic Info'!C20","v":0},{"$f":"'Basic Info'!D20","v":"N/A"},0]
[null,"Stairs - Active",{"$f":"'Basic Info'!C21","v":0},{"$f":"'Basic Info'!D21","v":"N/A"},0]
[null,"Restroom",{"$f":"'Basic Info'!C22","v":0},{"$f":"'Basic Info'!D22","v":"N/A"},0]
[null,"Office",{"$f":"'Basic Info'!C23","v":0},{"$f":"'Basic Info'!D23","v":"N/A"},0]
[null,"Conference/meeting/multipurpose",{"$f":"'Basic Info'!C24","v":0},{"$f":"'Basic Info'!D24","v":"N/A"},0]
[null,"Electrical/Mechanical",{"$f":"'Basic Info'!C25","v":0},{"$f":"'Basic Info'!D25","v":"N/A"},0]
[null,"Workshop",{"$f":"'Basic Info'!C26","v":0},{"$f":"'Basic Info'!D26","v":"N/A"},0]
[null,"Lounge/Recreation",{"$f":"'Basic Info'!C27","v":0},{"$f":"'Basic Info'!D27","v":"N/A"},{"$f":"IF(OR(D14=\"Heated & Cooled\",D14=\"Heated-Only\")=TRUE,C14,0)","v":0}]
[null,"Exercise Area",{"$f":"'Basic Info'!C28","v":0},{"$f":"'Basic Info'!D28","v":"N/A"},0]
[null,"Parking garage",{"$f":"'Basic Info'!C29","v":0},{"$f":"'Basic Info'!D29","v":"N/A"},0]
[null,"Non-Residential Associated Spaces",{"$f":"'Basic Info'!C30","v":0},{"$f":"'Basic Info'!D30","v":"N/A"},0]
[null,null,null,"TOTAL GHSF",{"$f":"SUM(E3:E15)","v":0}]

{"sheet":"Demand Savings Lookup","index":3,"n_rows":52,"n_cols":7,"rows_kept":52,"cut":false,"hidden":true,"merged":[]}
["Measure","Upstate (non-cooling)","Upstate (cooling)","Downstate (non-cooling)","Downstate (cooling)","Measure Lifetime","Units"]
["Appliances - Clothes washers",1.1400000000000001E-4,1.8500000000000001E-3,1.1400000000000001E-4,1.1299999999999999E-3,14,"each"]
["Appliances - Dishwashers",1.1400000000000001E-4,1.8500000000000001E-3,1.1400000000000001E-4,1.1299999999999999E-3,13,"each"]
["Appliances - Refrigerator",1.1400000000000001E-4,1.8500000000000001E-3,1.1400000000000001E-4,1.1299999999999999E-3,15,"each"]
["DHW - Condensing boiler",1.1400000000000001E-4,1.8500000000000001E-3,1.1400000000000001E-4,1.1299999999999999E-3,13,"1000 Btu/hr"]
["DHW - Direct",1.1400000000000001E-4,1.8500000000000001E-3,1.1400000000000001E-4,1.1299999999999999E-3,13,"1000 Btu/hr"]
["DHW - Indirect",1.1400000000000001E-4,1.8500000000000001E-3,1.1400000000000001E-4,1.1299999999999999E-3,15,"1000 Btu/hr"]
["DHW - Low-flow Devices",1.1400000000000001E-4,1.8500000000000001E-3,1.1400000000000001E-4,1.1299999999999999E-3,7,"each"]
["Envelope - AGW Insulation",0,1.8500000000000001E-3,0,1.1299999999999999E-3,25,"SqFt"]
["Envelope - BGW Insulation",0,1.8500000000000001E-3,0,1.1299999999999999E-3,25,"SqFt"]
["Envelope - Exterior Doors",0,1.8500000000000001E-3,0,1.1299999999999999E-3,20,"each"]
["Envelope - Floor Insulation",0,1.8500000000000001E-3,0,1.1299999999999999E-3,25,"SqFt"]
["Envelope - Roof Insulation",0,1.8500000000000001E-3,0,1.1299999999999999E-3,25,"SqFt"]
["Envelope - Slab Insulation",0,1.8500000000000001E-3,0,1.1299999999999999E-3,25,"SqFt"]
["Envelope - Windows",0,1.8500000000000001E-3,0,1.1299999999999999E-3,25,"each"]
["HVAC - Boiler",1.1400000000000001E-4,1.8500000000000001E-3,1.1400000000000001E-4,1.1299999999999999E-3,25,"1000 Btu/hr"]
["HVAC - Chiller",0,1.8500000000000001E-3,0,1.1299999999999999E-3,24,"tons"]
["HVAC - Controls",1.1400000000000001E-4,1.8500000000000001E-3,1.1400000000000001E-4,1.1299999999999999E-3,10,"each"]
["HVAC - Distribution System",0,1.8500000000000001E-3,0,1.1299999999999999E-3,25,"each"]
["HVAC - Duct Sealing",1.1400000000000001E-4,1.8500000000000001E-3,1.1400000000000001E-4,1.1299999999999999E-3,25,"SqFt"]
["HVAC - ERV",1.1400000000000001E-4,1.8500000000000001E-3,1.1400000000000001E-4,1.1299999999999999E-3,15,"1000 Btu/hr"]
["HVAC - Fan/air handlers",1.1400000000000001E-4,1.8500000000000001E-3,1.1400000000000001E-4,1.1299999999999999E-3,20,"1000 Btu/hr"]
["HVAC - Furnace",1.1400000000000001E-4,1.8500000000000001E-3,1.1400000000000001E-4,1.1299999999999999E-3,20,"1000 Btu/hr"]
["HVAC - Ground Source HP (cooling side)",0,1.8500000000000001E-3,0,1.1299999999999999E-3,15,"1000 Btu/hr"]
["HVAC - Ground Source HP (heating side)",1.1400000000000001E-4,0,1.1400000000000001E-4,0,15,"1000 Btu/hr"]
["HVAC - HRV",1.1400000000000001E-4,1.8500000000000001E-3,1.1400000000000001E-4,1.1299999999999999E-3,15,"1000 Btu/hr"]
["HVAC - PTAC",1.1400000000000001E-4,1.8500000000000001E-3,1.1400000000000001E-4,1.1299999999999999E-3,15,"1000 Btu/hr"]
["HVAC - Split System AC/HP",1.1400000000000001E-4,1.8500000000000001E-3,1.1400000000000001E-4,1.1299999999999999E-3,15,"1000 Btu/hr"]
["HVAC - VRF, air-source (cooling only)",0,1.8500000000000001E-3,0,1.1299999999999999E-3,15,"1000 Btu/hr"]
["HVAC - VRF, air-source (heating & cooling)",1.1400000000000001E-4,1.8500000000000001E-3,1.1400000000000001E-4,1.1299999999999999E-3,15,"1000 Btu/hr"]
["HVAC - VRF, air-source (heating only)",1.1400000000000001E-4,0,1.1400000000000001E-4,0,15,"1000 Btu/hr"]
["HVAC - VRF, water-source (cooling only)",0,1.8500000000000001E-3,0,1.1299999999999999E-3,15,"1000 Btu/hr"]
["HVAC - VRF, water-source (heating & cooling)",1.1400000000000001E-4,1.8500000000000001E-3,1.1400000000000001E-4,1.1299999999999999E-3,15,"1000 Btu/hr"]
["HVAC - VRF, water-source (heating only)",1.1400000000000001E-4,0,1.1400000000000001E-4,0,15,"1000 Btu/hr"]
["HVAC - Water Source HP (cooling side)",0,1.8500000000000001E-3,0,1.1299999999999999E-3,15,"1000 Btu/hr"]
["HVAC - Water Source HP (heating side)",1.1400000000000001E-4,0,1.1400000000000001E-4,0,15,"1000 Btu/hr"]
["HVAC - Window AC",0,1.8500000000000001E-3,0,1.1299999999999999E-3,13,"each"]
["Lighting - Common Fixtures, LED",2.1000000000000001E-4,1.8500000000000001E-3,2.1000000000000001E-4,1.1299999999999999E-3,12,"each"]
["Lighting - Common Fixtures, non-LED",2.1000000000000001E-4,1.8500000000000001E-3,2.1000000000000001E-4,1.1299999999999999E-3,12,"each"]
["Lighting - Common Timers/Sensors",0,1.8500000000000001E-3,0,1.1299999999999999E-3,10,"each"]
["Lighting - Exterior Fixtures",0,1.8500000000000001E-3,0,1.1299999999999999E-3,15,"each"]
["Lighting - In-unit Fixtures, LED",2.1000000000000001E-4,1.8500000000000001E-3,2.1000000000000001E-4,1.1299999999999999E-3,15,"each"]
["Lighting - In-unit Fixtures, non-LED",2.1000000000000001E-4,1.8500000000000001E-3,2.1000000000000001E-4,1.1299999999999999E-3,15,"each"]
["Lighting - LED Exit Signs",1.1400000000000001E-4,1.8500000000000001E-3,1.1400000000000001E-4,1.1299999999999999E-3,15,"each"]
["Other - EC Motors",1.1400000000000001E-4,1.8500000000000001E-3,1.1400000000000001E-4,1.1299999999999999E-3,20,"CFM"]
["Other - Elevators",1.1400000000000001E-4,1.8500000000000001E-3,1.1400000000000001E-4,1.1299999999999999E-3,20,"each"]
["Other - Exhaust fans (ENERGY STAR)",1.1400000000000001E-4,1.8500000000000001E-3,1.1400000000000001E-4,1.1299999999999999E-3,10,"CFM"]
["Other - Motors",1.1400000000000001E-4,1.8500000000000001E-3,1.1400000000000001E-4,1.1299999999999999E-3,20,"each"]
["Other - Variable Speed Drive",1.1400000000000001E-4,1.8500000000000001E-3,1.1400000000000001E-4,1.1299999999999999E-3,15,"each"]
["Other - Ventilation demand control",1.1400000000000001E-4,1.8500000000000001E-3,1.1400000000000001E-4,1.1299999999999999E-3,10,"CFM"]
["Other - Ventilation Fans",1.1400000000000001E-4,1.8500000000000001E-3,1.1400000000000001E-4,1.1299999999999999E-3,10,"CFM"]
["Other"]

{"sheet":"Lookup","index":4,"n_rows":24,"n_cols":17,"rows_kept":24,"cut":false,"hidden":true,"merged":[]}
[]
["Only use 'Unconditioned' for spaces that have no active heating or cooling AND are not indirectly conditioned by adjacent conditioned spaces."]
["As per Minimum Performance Standards, garages shall not be heated for comfort or to prevent pipes from freezing."]
["You must fill in the conditioned column."]
["You must fill in the mechanical ventilation column."]
[]
[]
[null,null,null,"Space 2007","Space 2010","Building 2007","Building 2010","Base Min FC","RCR",null,"Light Source & Distribution ","CU at RCR=A","CU at RCR=B","CU at RCR=C","LLF","LE","IESNA fixture code"]
["Storage, active","Apartment","Community or Computer Room",1.2,1.1100000000000001,0.7,0.6,30,"B",null,"CF: Downlight Open",0.63400000000000001,0.45900000000000002,0.38100000000000001,0.66,58.8,521]
["Storage, inactive","Common Space","Conference/meeting/multipurpose",1.3,1.23,0.7,0.6,30,"B",null,"CF: Indirect Pendant",0.54500000000000004,0.32500000000000001,0.26,0.61,58.8,523]
["Lobby","Exterior","Corridor/Transition",0.5,0.66,0.7,0.6,10,"C",null,"CF: Indirect Wall Sconce",0.53,0.315,0.255,0.62,58.8,524]
["Corridor/Transition",null,"Electrical/Mechanical",1.5,0.95,0.7,0.6,30,"C",null,"FL: Direct/Indirect-Non-VDT",0.82,0.51,0.41,0.78,81.75,535]
["Stairs - Active",null,"Exercise Area",0.9,0.72,0.7,0.6,30,"B",null,"FL: Fluorescent Industrial",0.88,0.49,0.39,0.65,81.8,538]
["Restroom",null,"Exit Signs","5 W/face","5 W/face","5 W/face","5 W/face","NA",null,null,"FL: Linear Direct lensed",0.77,0.5,0.4,0.79,81.75,530]
["Office",null,"Lobby",1.3,0.9,0.7,0.6,16,"B",null,"FL: Linear Indirect w/louver",0.72,0.48,0.4,0.79,81.75,531]
["Conference/meeting/multipurpose",null,"Lounge/Recreation",1.2,0.73,0.7,0.6,21,"B",null,"FL: Linear Wall Cove",0.26,0.19,0.16,0.79,81.75,"534-2"]
["Electrical/Mechanical",null,"Office",1.1000000000000001,1.1100000000000001,0.7,0.6,35,"B",null,"FL: Linear WW Open 1 wall",0.33,0.25,0.23,0.79,81.75,"537-1"]
["Workshop",null,"Parking garage",0.2,0.19,0.7,0.25,7,"A",null,"FL: Linear WW open - 2 walls",0.47,0.26,0.23,0.79,81.75,"537-2"]
["Parking Garage",null,"Restroom",0.9,0.98,0.7,0.6,12,"C",null,"FL:Task",0.64,0.64,0.64,0.79,81.75,539]
["Exit Signs",null,"Stairs - Active",0.6,0.69,0.7,0.6,15,"C",null,"INC: Indirect Pendant",0.50600000000000001,0.28799999999999998,0.223,0.69,16,503]
["Unlit Chases/Shafts",null,"Storage, active",0.8,0.63,0.7,0.6,20,"C",null,"LED:",0.89,0.86,0.83,0.9,70,"n/a"]
["Lounge/Recreation",null,"Storage, inactive",0.3,0.63,0.7,0.6,8,"C",null,"MH: Indirect Pendant",0.45,0.26,0.2,0.53,94.17,553]
["Exercise Area",null,"Unlit Chases/Shafts",0,0,0,0,"NA",null,null,"MH: Low Bay Lensed",0.72,0.41,0.31,0.55000000000000004,94.17,"559-1"]
["Community or Computer Room",null,"Workshop",1.9,1.59,0.7,0.6,50,"B",null,"PAR: Downlight open - flood",1,0.85899999999999999,0.81,0.75,18.78,511]

{"sheet":"Drop Down","index":5,"n_rows":32,"n_cols":38,"rows_kept":32,"cut":false,"hidden":true,"merged":[[14,0,14,1],[24,0,25,0],[24,1,24,3],[23,0,23,4]]}
["Garage","Condition","YN","Milestone","Rev","Standard","Income","Construction","Fuel","DHW Method","Units","Energy Star","Water Sense","Pump Type","Pump Class","Fan Control","Heating Control","Fan","FanRate","Climate Zone","Windows","SpaceType","LightCalcMethod","LightingSpaceType","LPD2010SS","LPD2010WB","Footcandles","YesNo","Utility","UtilityLookup","Fuel","Funding","GasUtility",null,"Split type","BaseSite","ExtLightZone","PHStatus"]
["N/A","N/A","N/A","Please Select",0,"Please select","Please Select","Please Select","Please Select","Please Select",null,"Please Select","Please Select","Please Select","Please Select","Please Select","Please Select","Please Select","NA",1,"Wood Frame","Storage, active","Space-By-Space (90.1-2010)","Conference/meeting/multipurpose",1.23,0.6,30,"Please Select","Central Hudson",1,"N/A","Please select","Con Ed",2,"<Select one>","Tradable","Zone 2","Pre-Certified"]
["Under Ground Garage","Heated & Cooled","Yes","Proposed Design",1,"ASHRAE 90.1-2004 & Simulation Guidelines V4.0","Market Rate","New Construction","natural gas","Apartment Method","kBtu/hr","Not Applicable","Not Applicable","One-Speed","Standard","Variable Speed","Fixed","Ceiling ( 10-80 CFM)",1.2,2,"Other","Storage, inactive","Building Area (90.1-2010)","Corridor/Transition",0.66,0.6,10,"Yes","Con Ed",2,"gas - firm","EEPS-Gas","National Grid",5,"Measure cost","Non-Tradable","Zone 3","Certified"]
["Above Ground Garage","Heated-Only","No","As-Built",2,"RESNET HERS Technical Guidelines Standard","Low-to-Moderate Income","Gut-rehab","oil","Occupancy Method","cubic feet","None Installed","None Installed","Two-Speed","High Efficiency","Inlet","OA Reset","Ceiling (90-500 CFM)",2.2999999999999998,3,null,"Lobby",null,"Electrical/Mechanical",0.95,0.6,30,"No","NatGrid",3,"gas - non firm","EEPS-Electric","O & R",7,"Measure savings",null,"Zone 4"]
["Parking Lot","Cooled-Only",null,null,3,null,"Blended",null,"propane",null,"degrees","Non-Energy Star","Non-WaterSense","Variable Speed","Premium","Discharge","Scheduled","Inline or Range Hood",2.2999999999999998,4,null,"Corridor/Transition",null,"Exercise Area",0.72,0.6,30,null,"NYSEG",4,"oil","RGGI","KEDLI",6]
[null,"Unconditioned",null,null,4,null,null,null,"steam",null,"each","Energy Star","WaterSense","Cycle",null,"Cycling","Load Reset","Rooftop/Other","NA",5,null,"Stairs - Active",null,"Exit Signs","5 W/face","5 W/face","NA",null,"O & R",5,"propane","OHGAH","Other"]
[null,null,null,null,5,null,null,null,"electric",null,"gallons",null,null,null,null,"Two Speed","N/A",null,null,6,null,"Restroom",null,"Lobby",0.9,0.6,16,null,"RG & E",6,"steam","SBC - NC"]
[null,null,null,null,6,null,null,null,null,null,"linear feet",null,null,null,null,"Constant Volume",null,null,null,7,null,"Office",null,"Lounge/Recreation",0.73,0.6,20,null,null,null,null,"Owner"]
[null,null,null,null,null,null,null,null,null,null,"square feet",null,null,null,null,null,null,null,null,8,null,"Conference/meeting/multipurpose",null,"Office",1.1100000000000001,0.6,35]
[null,null,null,null,null,null,null,null,null,null,"tons",null,null,null,null,null,null,null,null,null,null,"Electrical/Mechanical",null,"Parking garage",0.19,0.6,7]
[null,null,null,null,null,null,null,null,null,null,null,null,null,null,null,null,null,null,null,null,null,"Workshop",null,"Restroom",0.98,0.6,12]
[null,null,null,null,null,null,null,null,null,null,null,null,null,null,null,null,null,null,null,null,null,"Parking Garage",null,"Stairs - Active",0.69,0.6,15]
[null,null,null,null,null,null,null,null,null,null,null,null,null,null,null,null,null,null,null,null,null,"Exit Signs",null,"Storage, active",0.63,0.6,20]
[null,null,null,null,null,null,null,null,null,null,null,null,null,null,null,null,null,null,null,null,null,"Unlit Chases/Shafts",null,"Storage, inactive",0.63,0.6,8]
["Baseline Fixtures, per EPAct 1992",null,null,null,null,null,null,null,null,null,null,null,null,null,null,null,null,null,null,null,null,"Lounge/Recreation",null,"Unlit Chases/Shafts",0,0,"NA"]
["Fixture","Flow Rate",null,null,null,null,null,null,null,null,null,null,null,null,null,null,null,null,null,null,null,"Exercise Area",null,"Workshop",1.59,0.6,50]
["Baseline Toilets (GPF)",1.6]
["Baseline Urinals (GPF)",1]
["Baseline Showerheads (GPM)",{"$f":"'Water Savings'!D18","v":2.5}]
["Baseline Bathroom Faucets (GPM)",{"$f":"'Water Savings'!D19","v":2.5}]
["Baseline Kitchen Faucets (GPM)",{"$f":"'Water Savings'!D20","v":2.5}]
[]
[]
["Fixture Use"]
["Fixture Type","Duration (sec)",null,null,"Uses/Day/Occupant"]
[null,"Low","Medium","High"]
["Toilets","-",null,null,5]
["Urinals","-",null,null,"-"]
["HW gallons/day/occupant",12,25,44]
["Showerheads",150,300,600,1]
["Bathroom Faucets",8,15,30,5]
["Kitchen Faucets",30,60,80,4]

{"sheet":"Introduction","index":6,"n_rows":25,"n_cols":3,"rows_kept":25,"cut":false,"hidden":false,"merged":[[4,1,4,2],[6,1,6,2],[24,1,24,2]]}
[null,"Multifamily New Construction Program (MF NCP) "]
[null,"Building Performance Plan"]
[null,"Version 1.2 - ASHRAE 2010 - March 2017"]
[]
[null,"The following worksheets detail the information regarding the recommended scope of work and document the achievement of the project's Performance Target. Some cells are protected to prevent accidental over-writing of formulas. "]
[]
[null,"Note that throughout these worksheets, common information from cells are linked and should automatically update.  Only cells shaded in blue need to be entered manually. Entering values into white cells will override pre-determined formulas.  However, depending on the project, there may be reason to write over the pre-determined formulas."]
[]
[null,"Basic Info"]
[null,null,"In blue cells only, enter the basic information about the building."]
[]
[null,"Model Inputs"]
[null,null,"In blue cells only, enter information about how the baseline and proposed buildings were modeled.  Follow the formatting guidelines presented as comments (red corners) where available."]
[]
[null,"Reporting Summary"]
[null,null,"In blue cells only, enter general information about the project.  If the Basic Info and Model Inputs tabs are completed first, the majority of this tab will autofill."]
[]
[null,"Detailed Measures"]
[null,null,"This worksheet should be a summary of all energy-saving measures, along with their associated energy savings. If the Results from eQUEST and Model Inputs tabs are completed first, much of this tab will autofill."]
[]
[null,"Results from eQuest"]
[null,null,"For eQuest users only, this worksheet is based upon the Parms.csv file that is generated upon simulation of your building. If those results are pasted into this worksheet, according to the directions, a significant amount of this workbook will autofill."]
[]
[]
[null,"Project using modeling software other than eQUEST will need to manually enter information in many white cells that would otherwise calculated based on inputs from the Results from eQUEST tab."]

{"sheet":"Version History","index":7,"n_rows":100,"n_cols":2,"rows_kept":100,"cut":false,"hidden":false,"merged":[]}
["BPP Version 1.2 - Bug fixes"]
["Exterior Lighting","Fixed error in calculations"]
["Water Savings","Fixed error in calculations"]
[]
[]
["BPP Version 1.1 - ASHRAE 2010 Updates"]
[]
["Basic Info","Added compliance path drop-down - Choosing a PH pathway causes tabs and columns throughout workbook to hide"]
[null,"Added TFA and iCFA for appropriate PH pathways"]
[null,"Added Total Square Footage within Thermal Boundary for PH pathways"]
[null,"Added Passive House Certification Status"]
[null,"Added PHIUS Project #"]
[null,"Added \"blended\" option to Housing Income Classification drop down"]
[null,"Added \"Other Software\" for Partners to note other Passive House software used on project (WUFI Plus, THERM, etc.)"]
[null,"Added comment to Weather File Location: If project is located in NYC and following the PHIUS path, enter ASHRAE 2013 & Global Solar Radiation Location from PHIUS climate map"]
[null,"Added fields for Passive House Consultant, Field Verification, and Certifier"]
[]
["Model Inputs","Envelope: Added location field for certain envelope components."]
[null,"Envelope: Added shading reduction factor field."]
[null,"Envleope: Expanded comments"]
[null,"Heating: Added location field, and added comment on quantity field."]
[null,"Cooling: Added location field, and added comment on quantity field."]
[null,"DHW: Added quantity and location field, with comment.  Added WaterSense option for fixtures."]
[null,"Ventilation: Added model and make for corridor supply ventilation and garage exhaust fan."]
[null,"Added Renewable and Distributed Generation section."]
[null,"Added Passive House Modeling Results section."]
[]
[]
["BPP Version 1.0 - ASHRAE 2010 Updates","Release Date 8/2016"]
[]
["Basic Info","Added Performance Tier drow-down."]
[null,"Updated energy rates per MF NCP Guidelines."]
["Model Inputs","Added field in Envelope section, requiring a description of all penetrations through the continuous insulation."]
["Detailed Measures","Removed all measure cost fields and cost effectiveness calculations."]
[null,"Clarified instructions."]
[null,"Added some additional measures to pull-down menu."]
["Water Savings/DHW Demand","Shifted around some fields so that DHW Demand tab could be completed prior to any inputs into Water Savings tab."]
[null,"Updated water rates to reflect higher NYC water costs.  Non-NYC water costs remained the same."]
["Interior Lighting","Updated parking garage LPD for Whole Building calculation method."]
[null,"Updated to allow increase to Baseline LPD per 9.6.3 and remove credit for spaces with mandatory occupancy sensors."]
["Infiltration and Ventilation tab","Updated to allow for air sealing/infiltration credit."]
["EIR for PTAC and PTHP","Updated Efficiency Conversion Calculators per ASHRAE 90.1-2013, G3.1.2.1"]
[]
["Version 6.1 - ASHRAE 2010 Updates","Release Date 1/2015"]
[]
["Model Inputs","Updated baseline guidance to match updated code (ASHRAE 90.1-2010, 62.1-2010 and 62.2-2010)."]
[null,"Updated baseline ventilation guidelines to require baseline ventilation rates meet ASHRAE 62.1 or 62.2, as the baseline is no longer allowed to be up to 50% higher than code."]
[null,"Added linking from Model Input tab to Infiltration and Ventilation tab to reduce amount of data entry necessary.  Altered fields to reflect these changes."]
[null,"Added allowance to claim infiltration improvement for As-Built building, based on blower door results."]
[null,"Updated garage demand control requirements from ASHRAE 90.1-2010."]
["Exterior Lighting","Updated to incorporate ASHRAE 90.1-2010 exterior lighting requirements.  Includes differing lighting allowances based on exterior lighting zone, and added base site allowance."]
["Infiltration/Ventilation","Updated baseline to require baseline ventilation rates meet ASHRAE 62.1 or 62.2, as the baseline is no longer allowed to be up to 50% higher than code."]
[null,"Added option for which infiltration baseline to use - either 0.3 CFM/sqft at 50 Pa or 0.4 CFM/sqft at 75 Pa."]
[null,"Added allowance to claim infiltration improvement for As-Built building, based on blower door results."]
[null,"Separated duct sealing credit by spaces (apt, corridor and other)"]
[]
["2015-02-04","Corrections made to cell references in Infiltration & Ventilation tab to reference the correct cells in the DHW Demand tab. Corrections made on the Appliance tab so the elevator calculation matches the table in the Simulation Guidelines (page 26.)"]
[]
["Version 6.1  - ASHRAE 2007 Updates","Release Date 11/2014"]
[]
["General Updates","Added \"General Notes\" section to the bottom of most tabs.  These notes fields are intended to allow the Partners to make comments in addition to what it easily input into the templated tables.  Adding notes are NOT mandatory, but instead should only be used when the Partners feel it is needed."]
["Basic Info","Added two ASHRAE space types (Lounge/Recreation and Exercise Area). "]
[null,"Deleted the “Mechanically Ventilated?” column for each space type.  "]
[null,"Removed “Non-Residential Spaces” from “Total Project Square Footage”."]
[null,"Added \"Project county\""]
[null,"Added \"MPP Program Version\" to assign correct incentives based on which phase of Version 6 the project is subject to."]
[null,"Added \"Revision Notes\" section to the bottom of the sheet.  This section is to be used with every revision, including As-Built Rev0, to help the reviewers understand what changes have occured in the model (and/or design) since the last review."]
["Model Inputs","Updated ventilation section to correspond with updated Simulation Guidelines."]
[null,"Corrected maximum bathroom and kitchen intermittent exhaust rates (CFM) in baseline description.  (Should be 50% above ASHRAE 62.2.)"]
["Reporting Summary","Comment added that appears only if common area lighting exceed prerequisite (20% over ASHRAE).  "]
[null,"Separated out the Annual Other end use to Annual Fans and Annual Pumps."]
[null,"Added \"County\" to Table 1 to facilitate confirmation of Climate Zone."]
[null,"Updated Table 4 to get inputs necessary for Portfolio Manager."]
[null,"Automated the plug load value in Table 6."]
[null,"Added calculation determining the contribution of each end use to overall savings (% and points)."]
["Detailed Measures","Automated the heating fuel column."]
["Water Savings","Incorporated Low/Medium/High Usage into the proposed and baseline water usage. Incorporated PSI for fixture types in baseline and proposed fixtures. "]
["DHW Demand","Comment added that GPM flowrates entered must be the GPM rated at 80 psi."]
[null,"Incorporated PSI into avg faucet gpm. Based baseline & proposed avg faucet gpm and showerhead gpm on PSI for fixture types.  "]
["Interior Lighting","Updated to allow Prescriptive Path users to compare to 90.1-2010. "]
[null,"Added to note in lumen/fixture column that screw-in LEDs should use 70 lumen/Watt."]
[null,"Added two ASHRAE space types (Lounge/Recreation and Exercise Area)"]
[null,"Provided functionality to reduce W/sf for spaces if using automatic controls. "]
[null,"Note provided to caution users to only insert rows at the end of tables. "]
[null,"Food prep and family dining areas removed from ASHRAE space type drop-down. If these areas exist in common spaces, use \"Multipurpose\". "]
[null,"Drop-down added to indicate Space-by-Space or Building Area method for both 2007 and 2010."]
[null,"Changed the “24/7?” column to “Notes”, as any fixture type may be used in both 24/7 and non-24/7 spaces.  "]
[null,"Added note in instructions section clarifying requirement that total proposed wattage cannot exceed the total baseline wattage by more than 20%, as well as the similar comment for Prescriptive projects."]
[null,"Updated footcandle calculations to be based on light source & distribution. Incorporated room type into this equation.   "]
[null,"Added ASHRAE space types."]
[null,"Updated foot candle warning."]
[null,"Added instructional comment to remind users to add ballast power to \"Watts/Fixture\" entry in schedule"]
["In-unit lighting","Added lookup for illumination. It is based on the Interior Lighting worksheet. "]
[null,"Modified error check to check for appropriate calculations of lit area and to calculate average footcandles and room-by-room lighting power densities."]
["Exterior Lighting","Added ASHRAE 90.1-2010 Zones 2-3 into the table. Added warning for proposed building façade lighting exceeding baseline. Added Base site allowance dropdown to add into tradable or non-tradable equations. "]
[null,"Revised instruction #4 & #6 to assign exterior lighting to the \"exterior\" end-use category. Separated apartment balcony lighting to facilitate reporting."]
["Infiltration/Ventilation","Major overhaul of this tab that cannot be adequately captured by narrative.  Check it out."]
[null,"Range hood included as an option in the drop-down menu for Exhaust Fan type; Rooftop expanded to include \"other\".  "]
[null,"Updated exhaust fan calculations so that they are functional now."]
["EIR for PTAC and PTHP","Added Efficiency Conversion Calculator (SEER to EER; HSPF to COP)"]

{"sheet":"Basic Info","index":8,"n_rows":96,"n_cols":7,"rows_kept":96,"cut":false,"hidden":false,"merged":[[88,1,88,6],[95,1,95,6],[44,2,44,3],[36,2,36,3],[37,2,37,3],[38,2,38,3],[42,2,42,3],[39,2,39,3],[40,2,40,3],[43,2,43,3]]}
[null,"Basic Project Information"]
[]
[null,"Compliance Pathway","Performance Path"]
[null,{"$f":"IF(Path=\"Performance Path\",\"\",\"Passive House Certification Status\")","v":""}]
[null,{"$f":"IF(Path=\"PHIUS\",\"PHIUS Project #\",\"\")","v":""}]
[]
[null,null,"Number of Units"]
[null,"Studio"]
[null,"1 - Bedroom"]
[null,"2 - Bedroom"]
[null,"3 - Bedroom"]
[null,"4 - Bedroom"]
[null,"Total Units",{"$f":"SUM(C8:C12)","v":0}]
[null,null," "]
[null,"Building Area","Total Square Ft","Conditioned?",{"$f":"IF(Path=\"Performance Path\",\"\",\"Total Square Ft within Thermal Boundary\")","v":""}]
[null,"Apartment",null,"N/A",null,{"$f":"IF(AND(C16<>0,D16=\"N/A\"),Lookup!$A$4,\"\")","v":""},{"$f":"IF(D16=\"Unconditioned\",Lookup!$A$2, \"\")","v":""}]
[null,"Storage, active",null,"N/A",null,{"$f":"IF(AND(C17<>0,D17=\"N/A\"),Lookup!$A$4,\"\")","v":""},{"$f":"IF(D17=\"Unconditioned\",Lookup!$A$2, \"\")","v":""}]
[null,"Storage, inactive",null,"N/A",null,{"$f":"IF(AND(C18<>0,D18=\"N/A\"),Lookup!$A$4,\"\")","v":""},{"$f":"IF(D18=\"Unconditioned\",Lookup!$A$2, \"\")","v":""}]
[null,"Lobby",null,"N/A",null,{"$f":"IF(AND(C19<>0,D19=\"N/A\"),Lookup!$A$4,\"\")","v":""},{"$f":"IF(D19=\"Unconditioned\",Lookup!$A$2, \"\")","v":""}]
[null,"Corridor/Transition",null,"N/A",null,{"$f":"IF(AND(C20<>0,D20=\"N/A\"),Lookup!$A$4,\"\")","v":""},{"$f":"IF(D20=\"Unconditioned\",Lookup!$A$2, \"\")","v":""}]
[null,"Stairs - Active",null,"N/A",null,{"$f":"IF(AND(C21<>0,D21=\"N/A\"),Lookup!$A$4,\"\")","v":""},{"$f":"IF(D21=\"Unconditioned\",Lookup!$A$2, \"\")","v":""}]
[null,"Restroom",null,"N/A",null,{"$f":"IF(AND(C22<>0,D22=\"N/A\"),Lookup!$A$4,\"\")","v":""},{"$f":"IF(D22=\"Unconditioned\",Lookup!$A$2, \"\")","v":""}]
[null,"Office",null,"N/A",null,{"$f":"IF(AND(C23<>0,D23=\"N/A\"),Lookup!$A$4,\"\")","v":""},{"$f":"IF(D23=\"Unconditioned\",Lookup!$A$2, \"\")","v":""}]
[null,"Conference/meeting/multipurpose",null,"N/A",null,{"$f":"IF(AND(C24<>0,D24=\"N/A\"),Lookup!$A$4,\"\")","v":""},{"$f":"IF(D24=\"Unconditioned\",Lookup!$A$2, \"\")","v":""}]
[null,"Electrical/Mechanical",null,"N/A",null,{"$f":"IF(AND(C25<>0,D25=\"N/A\"),Lookup!$A$4,\"\")","v":""},{"$f":"IF(D25=\"Unconditioned\",Lookup!$A$2, \"\")","v":""}]
[null,"Workshop",null,"N/A",null,{"$f":"IF(AND(C26<>0,D26=\"N/A\"),Lookup!$A$4,\"\")","v":""},{"$f":"IF(D26=\"Unconditioned\",Lookup!$A$2, \"\")","v":""}]
[null,"Lounge/Recreation",null,"N/A",null,{"$f":"IF(AND(C27<>0,D27=\"N/A\"),Lookup!$A$4,\"\")","v":""},{"$f":"IF(D27=\"Unconditioned\",Lookup!$A$2, \"\")","v":""}]
[null,"Exercise Area",null,"N/A",null,{"$f":"IF(AND(C28<>0,D28=\"N/A\"),Lookup!$A$4,\"\")","v":""},{"$f":"IF(D28=\"Unconditioned\",Lookup!$A$2, \"\")","v":""}]
[null,"Parking garage",null,"N/A",null,{"$f":"IF(AND(C29<>0,D29=\"N/A\"),Lookup!$A$4,\"\")","v":""},{"$f":"IF(OR(D29=\"Heated-Only\",D29=\"Heated & Cooled\")=TRUE,Lookup!A3,\"\")","v":""}]
[null,"Non-Residential Associated Spaces",null,"N/A",null,{"$f":"IF(AND(C30<>0,D30=\"N/A\"),Lookup!$A$4,\"\")","v":""},{"$f":"IF(D30=\"Unconditioned\",Lookup!$A$2, \"\")","v":""}]
[null,"Total Project Square Footage",{"$f":"SUM(C16:C29)","v":0}]
[null,"Total Project Occupiable Space",{"$f":"'GHSF Calculator'!E18","v":0}]
[null,{"$f":"IF(Path=\"Performance Path\",\"N/A\",IF(Path=\"PHIUS\",\"PHIUS Interior Conditioned Floor Area (iCFA)\",IF(Path=\"PHI\",\"PHI Treated Floor Area (TFA)\",\"N/A\")))","v":"N/A"},{"$f":"IF(Path=\"Performance Path\",\"N/A\",\"\")","v":"N/A"}]
[]
[null,"Type of Garage","N/A"]
[]
[null,"Project Name"]
[null,"Project Address"]
[null,"Project City and State"]
[null,"Project Zip Code"]
[null,"Project County"]
[]
[null,"Simulation Program & Version #"]
[null,"Other Software Used"]
[null,"Weather File Location (City, ST):"]
[]
[null,"MF NCP Program Version","V1.0"]
[null,"Performance Tier",3]
[null,"Milestone"]
[null,"Revision"]
[null,"Report Date"]
[null,"Housing Income Classification"]
[null,"Building Type"]
[null,"# of stories above grade"]
[null,"# of stories below grade"]
[null,"# of building occupants"]
[null,"Space Heating Fuel Type"]
[null,"DHW Fuel Type"]
[null,"DHW system"]
[null,"Heating system"]
[null,"Cooling system"]
[null,"Ventilation system"]
[]
[null,"Climate Zone"]
[null,"Electricity Cost per kWh",0.18579999999999999]
[null,"Fuel Cost per therm",1.3220000000000001]
[null,"Electric Utility"]
[null,"Gas Utility"]
[null,"Project Located in NYC?"]
[]
[null,"Construction Milestone","Planned Date","Actual Date"]
[null,"Schematic Design Completion date"]
[null,"Design Development Completion Date"]
[null,"Construction Documents Completion Date"]
[null,"Project Bid Date"]
[null,"Construction Complete Date"]
[]
[]
[null,"Contact Information","Company Name","Contact Name","Phone","Email","Address"]
[null,"Lead Energy Modeler"]
[null,"Builder/Developer"]
[null,"Architect"]
[null,"General Contractor"]
[null,{"$f":"IF(Path=\"Performance Path\",\"N/A\",IF(Path=\"PHIUS\",\"Certified Passive House Consultant (CPHC)\",IF(Path=\"PHI\",\"Certified PHI Consultant or Designer\",\"\")))","v":"N/A"}]
[null,{"$f":"IF(Path=\"Performance Path\",\"N/A\",IF(Path=\"PHIUS\",\"PHIUS+ Verifier\",IF(Path=\"PHI\",\"VerifPHier or MF NCP Partner Verifier\",\"\")))","v":"N/A"}]
[null,{"$f":"IF(Path=\"Performance Path\",\"N/A\",IF(Path=\"PHIUS\",\"PHIUS+ Certifier\",IF(Path=\"PHI\",\"Accredited PHI Certifier\",\"\")))","v":"N/A"}]
[]
[]
[null,"Revision Notes - Provide a narrative describing any additional changes made to the energy models between this and the last revision not addressed by the responses to the review comments. "]
[]
[]
[]
[]
[]
[]
[null,"Partner Notes - Use this section to include any notes about the information entered above."]

{"sheet":"Model Inputs","index":9,"n_rows":205,"n_cols":28,"rows_kept":205,"cut":false,"hidden":false,"merged":[[65,1,65,8],[101,2,102,2],[81,1,81,8],[92,2,95,2],[113,2,114,2],[68,2,71,2],[72,2,75,2],[76,2,79,2],[184,2,185,2],[188,2,189,2],[128,3,133,3],[84,2,87,2],[88,2,91,2],[121,2,126,2],[110,2,112,2],[132,2,133,2],[128,2,131,2],[99,2,100,2],[59,2,61,2],[25,3,26,3],[27,3,28,3],[30,3,33,3],[36,3,37,3],[25,2,26,2],[27,2,28,2],[30,2,33,2],[52,2,53,2],[36,2,37,2],[54,2,55,2],[56,2,57,2],[34,3,35,3],[34,2,35,2],[42,2,43,2],[21,2,22,2],[12,3,13,3],[23,3,24,3],[23,2,24,2],[21,3,22,3],[9,1,9,6],[12,2,13,2],[14,2,15,2],[17,2,18,2],[19,2,20,2],[14,3,15,3],[17,3,18,3],[19,3,20,3],[204,1,204,6],[137,2,138,2],[134,2,136,2],[174,2,176,2],[163,2,167,2],[141,2,142,2],[154,2,155,2],[172,2,173,2],[168,2,171,2],[190,2,191,2],[192,2,193,2],[197,5,197,6],[198,5,198,6],[200,5,200,6],[196,1,196,6],[199,5,199,6]]}
[null,"Model Inputs Summary"]
[]
[null,"Measure #:  To auto-generate the measure descriptions in the Detailed Measures tab, number the appropriate rows in this column such that it matches the ID number (column A) on the Detailed Measures tab."]
[null,"Baseline Design:  In the blue cells, enter the baseline information used in the model.  If this project has a different baseline than listed in a white cell, you may overwrite that cell."]
[null,"Proposed Design/As-Built:  In the blue cells, enter the proposed design/as-built information used in the model and/or that matches the proposed/as-built building."]
[null,"Notes:  Read the notes, which are indicated by red corners, where appropriate to assist in properly completing this tab."]
[null,"             If the building component does not exist in the building, enter \"N/A\" in the baseline and proposed/as-built columns."]
[null,"             If this tab is filled out correctly, it will autofill significant portions of the Reporting Summary and Detailed Measures tabs."]
[]
[null,"For gut rehabs, do not follow Appx G Baseline listed for envelope components; instead, use existing conditions.  Also, include description for baseline components, instead of \"Per ASHRAE\".  However, follow ASHRAE Baseline for all other building components."]
[]
[null,"Envelope Components","Measure #","ASHRAE 90.1-2010 Appx G Baseline","Baseline Design \n(residential/non-residential)",{"$f":"'Basic Info'!C49","v":0},"Location"]
[null,"Above Grade Wall Construction",null,"Enter value from ASHRAE Table 5.5-4 through 5.5-6 for Residential or Nonresidential Steel-Framed walls","Per ASHRAE"]
[null,"Above Grade Wall U-value"]
[null,"Floor Perimeter/Plank Edge Construction",null,"Enter value from ASHRAE Table 5.5-4 through 5.5-6 for Residential or Nonresidential Steel-Framed walls","Per ASHRAE"]
[null,"Floor Perimeter/Plank Edge U-value"]
[null,"Penetrations through Continuous Insulation",null,"N/A"]
[null,"Below Grade Wall Construction",null,"Enter value from ASHRAE Table 5.5-4 through 5.5-6 for Residential or Nonresidential Below-Grade walls","Per ASHRAE"]
[null,"Below Grade Wall C-value"]
[null,"Floor above Unconditioned Space Construction",null,"Enter value from ASHRAE Table 5.5-4 through 5.5-6 for Residential or Nonresidential Steel-joist floors","Per ASHRAE"]
[null,"Floor above Unconditioned Space U-value"]
[null,"Slab-on-Grade Construction (Unheated)",null,"Enter value from ASHRAE Table 5.5-4 through 5.5-6 for Residential or Nonresidential Slab-on-Grade floors, Unheated","Per ASHRAE"]
[null,"Slab-on Grade F-value (Unheated)"]
[null,"Slab-on-Grade Construction (Embedded Heat)",null,"Enter value from ASHRAE Table 5.5-4 through 5.5-6 for Residential or Nonresidential Slab-on-Grade floors, Embedded heated","Per ASHRAE"]
[null,"Slab-on Grade F-value (Embedded Heat)"]
[null,"Slab-Below-Grade Construction",null,"Uninsulated","Per ASHRAE"]
[null,"Slab-Below Grade C-value"]
[null,"Roof Construction",null,"Enter value from ASHRAE Table 5.5-4 through 5.5-6 for Residential or Nonresidential Insulation Entirely above Deck","Per ASHRAE"]
[null,"Roof U-value"]
[null,"Window to Gross Wall Ratio",null,"If < 40%, the Baseline is the same as the Proposed;\nIf > 40%, the Baseline = 40%"]
[null,"Fenestration Framing",null,"Enter value from ASHRAE Table 5.5-4 through 5.5-6 for Vertical Glazing and Proposed frame material"]
[null,"Fenestration Glazing",null,null,"Per ASHRAE"]
[null,"Fenestration Assembly U-factor"]
[null,"Fenestration Assembly SHGC"]
[null,"Shading Devices",null,"No shading devices"]
[null,"Shading Reduction Factor"]
[null,"Door Description",null,"Enter value from ASHRAE Table 5.5-4 through 5.5-6 for Opaque Doors"]
[null,"Door U-value"]
[]
[]
[null,"Lighting Components",null,"ASHRAE 90.1-2010 Appx G Baseline","Baseline Design",{"$f":"F12","v":0},"Schedule (hr/day)"]
[null,"Apartment LPD (W/SF)",null,"0.60 W/SF",0.6]
[null,"Corridor LPD (W/SF)",null,"0.66 W/SF",0.66]
[null,"Common Area LPD  (W/SF)",null,"ASHRAE 90.1-2010 Table 9.6.1 Baseline LPD's \nLobby: 0.90 W/SF \nStairs: 0.69 W/SF \nStorage: 0.63 W/SF \nRestroom: 0.98 W/SF \nOffice: 1.11 W/SF \nMultipurpose: 1.23 W/SF \nElec/Mech: 0.95 W/SF"]
[null,"Lighting Controls (Spaces)",null,"See Simulation Guidelines\nSection 3.6","N/A"]
[null,"Exit Signs (kW)",null,"5W/face, 24 hr/day"]
[null,"Garage Lighting (W/SF)",null,"0.19 W/SF"]
[null,"Exterior Lighting Power (kW)",null,"Per ASHRAE 90.1-2010 Tables 9.4.3A and 9.4.3B"]
[]
[]
[null,"Appliances and Process Loads","Measure #","ASHRAE 90.1-2010 Appx G/Sim Guidelines Baseline","Baseline Design",{"$f":"F41","v":0},"Quantity","Manufacturer","Model No.","Energy Star?"]
[null,"Refrigerator (kWh/yr)",null,"Fed Min Std Refrigerator",529,{"$f":"IF(Path=\"Performance Path\",423,\"\")","v":423}]
[null,"Dishwasher (kWh/yr)",null,"Fed Min Std Dishwasher",206,{"$f":"IF(Path=\"Performance Path\",164,\"\")","v":164}]
[null,"Dishwasher (gal/yr)",null,"Fed Min Std Dishwasher",1290,{"$f":"IF(Path=\"Performance Path\",860,\"\")","v":860}]
[null,"In-Unit Clothes Washer (kWh/yr)",null,"Fed Min Std Clothes Washer",81,{"$f":"IF(Path=\"Performance Path\",57,\"\")","v":57}]
[null,"In-Unit Clothes Washer (gal/yr)",null,"Fed Min Std Clothes Washer",2436,{"$f":"IF(Path=\"Performance Path\",1127,\"\")","v":1127}]
[null,"Common Area Clothes Washer (kWh/yr)",null,"Fed Min Std Clothes Washer",196,{"$f":"IF(Path=\"Performance Path\",138,\"\")","v":138}]
[null,"Common Area Clothes Washer (gal/yr)",null,"Fed Min Std Clothes Washer",5903,{"$f":"IF(Path=\"Performance Path\",2732,\"\")","v":2732}]
[null,"Elevator (kWh/yr)",null,"See Simulation Guidelines\nSection 3.11"]
[null,"Clothes Dryer - Electric use (kWh/yr)",null,"See Simulation Guidelines\nSection 3.10",null,{"$f":"IF(E60=\"\",\"\",E60)","v":""}]
[null,"Clothes Dryer - Gas use, if applicable (therm/yr)",null,"See Simulation Guidelines\nSection 3.10",null,{"$f":"IF(E61=\"\",\"\",E61)","v":""}]
[null,"Please Select Type of Stove",null,{"$f":"IF(B62=\"Electric Stove (kWh/yr)\",604,45)","v":45},{"$f":"D62","v":45},{"$f":"IF(Path=\"Performance Path\",E62,\"\")","v":45}]
[null,"<Other Appliance> (kWh/yr)",null,"See ASHRAE Table G3.1, Section 12"]
[null,"Miscellaneous Plug Load (W/SF)",null,"See Simulation Guidelines\nSection 3.10",null,{"$f":"IF(E64=\"\",\"\",E64)","v":""}]
[]
[null,"Additional Heating Systems Note:  If there are more than 3 heating systems, copy and paste the table above and paste it below the  Partner Notes table.  For each additional heating system, there should be an additional set of three rows (Type, Efficiency, Capacity).  The words \"Primary,\" \"Secondary,\" etc. should be removed from the heating system type row. "]
[]
[null,"Heating Components","Measure #","ASHRAE 90.1-2010 Appx G Baseline","Baseline Design",{"$f":"F51","v":0},"Location","Manufacturer","Model No.","Energy Star?","Spaces Served?","Electric Resistance Heating?"]
[null,"Primary Heating System Type",null,"See ASHRAE Table G3.1.1A and G3.1.1B"]
[null,"Primary Heating System Quantity",null,"Model 1 boiler for buildings less than 15,000 SF, 2 boilers for buildings over 15,000 SF. "]
[null,"Primary Heating System Efficiency (COP)",null,"Gas: 1 or 2 80% efficient Natural Gas Boilers,\nElectric: PTHP, 2.81 COP, electric resistance back-up at <40 °F",null,null,null,null,null,null,null,null,null,null,null,null,null,null,null,null,null,null,null,null,{"$f":"LEFT(RIGHT(B71,LEN(B71)-SEARCH(\"(\",B71,1)),LEN(RIGHT(B71,LEN(B71)-SEARCH(\"(\",B71,1)))-1)","v":"COP"},{"$f":"IF(OR(Y71=\"Ec\",Y71=\"Et\",Y71=\"AFUE\"),\"% \"&Y71,Y71)","v":"COP"},{"$f":"IF(OR(Y71=\"AFUE\",Y71=\"Et\",Y71=\"Ec\"),100*E71&Z71,E71&\" \"&Z71)","v":" COP"},{"$f":"IF(OR(Y71=\"AFUE\",Y71=\"Et\",Y71=\"Ec\"),100*F71&Z71,F71&\" \"&Z71)","v":" COP"}]
[null,"Primary Heating System Capacity (kBtu)",null,"Enter baseline capacity as calculated by energy modeling software calculations, plus 25% oversized. Per Appendix G, Section G3.1.2.2, unmet load hours shall not exceed 300 hours, and the proposed design shall not exceed the baseline design by more than 50 unmet load hours "]
[null,"Secondary Heating System Type",null,"NA, unless there are service spaces in model that are heated but not cooled, AND/OR >20,000 SF of contiguous non-residential space ","N/A"]
[null,"Secondary Heating System Quantity",null,"N/A","N/A"]
[null,"Secondary Heating System Efficiency (Et)",null,"N/A","N/A",null,null,null,null,null,null,null,null,null,null,null,null,null,null,null,null,null,null,null,{"$f":"LEFT(RIGHT(B75,LEN(B75)-SEARCH(\"(\",B75,1)),LEN(RIGHT(B75,LEN(B75)-SEARCH(\"(\",B75,1)))-1)","v":"Et"},{"$f":"IF(OR(Y75=\"Ec\",Y75=\"Et\",Y75=\"AFUE\"),\"% \"&Y75,Y75)","v":"% Et"},{"$f":"IF(E75=\"N/A\",\"N/A\",IF(OR(Y75=\"AFUE\",Y75=\"Et\",Y75=\"Ec\"),100*E75&Z75,E75&\" \"&Z75))","v":"N/A"},{"$f":"IF(F75=\"N/A\",\"N/A\",IF(OR(Y75=\"AFUE\",Y75=\"Et\",Y75=\"Ec\"),100*F75&Z75,F75&\" \"&Z75))","v":"0% Et"}]
[null,"Seconday Heating System Capacity (kBtu)",null,"N/A","N/A"]
[null,"Tertiary Heating System Type",null,"N/A","N/A"]
[null,"Tertiary Heating System Quantity",null,"N/A","N/A"]
[null,"Tertiary Heating System Efficiency (Et)",null,"N/A","N/A",null,null,null,null,null,null,null,null,null,null,null,null,null,null,null,null,null,null,null,{"$f":"LEFT(RIGHT(B79,LEN(B79)-SEARCH(\"(\",B79,1)),LEN(RIGHT(B79,LEN(B79)-SEARCH(\"(\",B79,1)))-1)","v":"Et"},{"$f":"IF(OR(Y79=\"Ec\",Y79=\"Et\",Y79=\"AFUE\"),\"% \"&Y79,Y79)","v":"% Et"},{"$f":"IF(E79=\"N/A\",\"N/A\",IF(OR(Y79=\"AFUE\",Y79=\"Et\",Y79=\"Ec\"),100*E79&Z79,E79&\" \"&Z79))","v":"N/A"},{"$f":"IF(F79=\"N/A\",\"N/A\",IF(OR(Y79=\"AFUE\",Y79=\"Et\",Y79=\"Ec\"),100*F79&Z79,F79&\" \"&Z79))","v":"0% Et"}]
[null,"Tertiary Heating System Capacity (kBtu)",null,"N/A","N/A"]
[]
[null,"Additional Cooling Systems Note:  If there are more than 3 cooling systems, copy and paste the table above and paste it below the Partner Notes table.  For each additional cooling system,. there should be an additional set of three rows (Type, Efficiency, Capacity).  The words \"Primary,\" \"Secondary,\" etc. should be removed from the cooling system type row. "]
[]
[null,"Cooling Components","Measure #","ASHRAE 90.1-2010 Appx G Baseline","Baseline Design",{"$f":"F99","v":0},"Location","Model No.","Energy Star?","Spaces Served?"]
[null,"Primary Cooling System Type",null,"Gas Heat: PTAC, 9.3 EER, 0.0003 kW/CFM \nElectric Heat: PTHP, 9.5 EER, 0.0003 kW/CFM"]
[null,"Primary Cooling System Quantity",null,"1 per thermal zone"]
[null,"Primary Cooling System Efficiency (EER)",null,"Gas Heat: PTAC, 9.3 EER, 0.0003 kW/CFM \nElectric Heat: PTHP, 9.5 EER, 0.0003 kW/CFM",null,null,null,null,null,null,null,null,null,null,null,null,null,null,null,null,null,null,null,null,null,{"$f":"LEFT(RIGHT(B87,LEN(B87)-SEARCH(\"(\",B87,1)),LEN(RIGHT(B87,LEN(B87)-SEARCH(\"(\",B87,1)))-1)","v":"EER"},{"$f":"IF(OR(Y87=\"AFUE\",Y87=\"Et\",Y87=\"Ec\"),100*E87&Z87,E87&\" \"&Z87)","v":" EER"},{"$f":"IF(OR(Y87=\"AFUE\",Y87=\"Et\",Y87=\"Ec\"),100*F87&Z87,F87&\" \"&Z87)","v":" EER"}]
[null,"Primary Cooling System Capacity (tons)",null,"Enter baseline capacity as calculated by energy modeling software calculations, plus 15% oversized. Per Appendix G, Section G3.1.2.2, unmet load hours shall not exceed 300 hours."]
[null,"Secondary Cooling System Type",null,"N/A","N/A"]
[null,"Secondary Cooling System Quantity",null,"N/A","N/A"]
[null,"Secondary Cooling System Efficiency (EER)",null,"N/A","N/A",null,null,null,null,null,null,null,null,null,null,null,null,null,null,null,null,null,null,null,null,{"$f":"LEFT(RIGHT(B91,LEN(B91)-SEARCH(\"(\",B91,1)),LEN(RIGHT(B91,LEN(B91)-SEARCH(\"(\",B91,1)))-1)","v":"EER"},{"$f":"IF(OR(Y91=\"AFUE\",Y91=\"Et\",Y91=\"Ec\"),100*E91&Z91,E91&\" \"&Z91)","v":"N/A EER"},{"$f":"IF(OR(Y91=\"AFUE\",Y91=\"Et\",Y91=\"Ec\"),100*F91&Z91,F91&\" \"&Z91)","v":" EER"}]
[null,"Secondary Cooling System Capacity (tons)",null,"N/A","N/A"]
[null,"Tertiary Cooling System Type",null,"N/A","N/A"]
[null,"Tertiary Cooling System Quantity",null,"N/A","N/A"]
[null,"Tertiary Cooling System Efficiency (EER)",null,"N/A","N/A",null,null,null,null,null,null,null,null,null,null,null,null,null,null,null,null,null,null,null,null,{"$f":"LEFT(RIGHT(B95,LEN(B95)-SEARCH(\"(\",B95,1)),LEN(RIGHT(B95,LEN(B95)-SEARCH(\"(\",B95,1)))-1)","v":"EER"},{"$f":"IF(OR(Y95=\"AFUE\",Y95=\"Et\",Y95=\"Ec\"),100*E95&Z95,E95&\" \"&Z95)","v":"N/A EER"},{"$f":"IF(OR(Y95=\"AFUE\",Y95=\"Et\",Y95=\"Ec\"),100*F95&Z95,F95&\" \"&Z95)","v":" EER"}]
[null,"Tertiary Cooling System Capacity (tons)",null,"N/A","N/A"]
[]
[]
[null,"Heating/Cooling Controls","Measure #","ASHRAE 90.1-2010 Appx G Baseline","Baseline Design",{"$f":"F68","v":0},"Quantity","Manufacturer","Model No."]
[null,"Heating System Supply Water Temp.",null,"180 °F",180]
[null,"Heating System Return Water Temp.",null,"130 °F",130]
[null,"HW Loop Setpoint Control",null,"OA Reset","OA Reset"]
[null,"HW Loop Setpoint Control Temp.",null,"180°F at 20°F and below, \n150°F at 50°F and above","180°F at 20°F and below, \n150°F at 50°F and above"]
[null,"Cooling Controls",null,"None","None"]
[null,"Heating Setpoint - during occupied hours",null,"72 °F","72 °F",{"$f":"IF(Path=\"Performance Path\", \"72 °F\",\"\")","v":"72 °F"}]
[null,"Heating Setpoint - occupied hours/day",null,"16 hr","16 hr",{"$f":"IF(Path=\"Performance Path\", \"16 hr\",\"\")","v":"16 hr"}]
[null,"Heating Setpoint - during unoccupied hours",null,"70 °F","70 °F",{"$f":"IF(Path=\"Performance Path\", \"70 °F\",\"\")","v":"70 °F"}]
[null,"Cooling Setpoint - during occupied hours",null,"78 °F","78 °F",{"$f":"IF(Path=\"Performance Path\",\"78 °F\",\"\")","v":"78 °F"}]
[null,"Cooling Setpoint - occupied hours/day",null,"18 hr","18 hr",{"$f":"IF(Path=\"Performance Path\",\"18 hr\",\"\")","v":"18 hr"}]
[null,"Cooling Setpoint - during unoccupied hours",null,"80 °F","80 °F",{"$f":"IF(Path=\"Performance Path\",\"80 °F\",\"\")","v":"80 °F"}]
[null,"Heating Pump?",null,"Yes","Yes"]
[null,"Heating Pump Efficacy",null,"19 W/GPM",19]
[null,"Heating Pump Motor Class",null,"Standard","Standard"]
[null,"Heating Pump Capacity Control",null,"One-Speed","One-Speed"]
[null,"Heating Pump Size (HP)",null,"Simulation Guidelines\nSection 3.15"]
[null,"Heating Fan Control",null,"Constant Volume","Constant Volume"]
[null,"Heating Fan kW/CFM",null,2.9999999999999997E-4,2.9999999999999997E-4]
[null,"Cooling Fan Control",null,"Constant Volume","Constant Volume"]
[null,"Cooling Fan kW/CFM",null,2.9999999999999997E-4,2.9999999999999997E-4]
[]
[null,"DHW Components","Measure #","ASHRAE 90.1-2010 Appx G Baseline","Baseline Design",{"$f":"F84","v":0},"Location","Manufacturer","Model No.","Energy Star /Water Sense?","Type?"]
[null,"DHW System Type",null,"Same type as Proposed, unless combined heating/DHW system."]
[null,"DHW System Quantity",null,"Same as Proposed."]
[null,"DHW System Efficiency (Et)",null,"See ASHRAE Table 7.8",null,null,null,null,null,null,null,null,null,null,null,null,null,null,null,null,null,null,null,null,null,null,{"$f":"LEFT(RIGHT(B124,LEN(B124)-SEARCH(\"(\",B124,1)),LEN(RIGHT(B124,LEN(B124)-SEARCH(\"(\",B124,1)))-1)","v":"Et"},{"$f":"IF(OR(AA124=\"Ec\",AA124=\"Et\",AA124=\"AFUE\"),\"% \"&AA124,AA124)","v":"% Et"}]
[null,"DHW System Capacity (kBtu/h)",null,"Same as Proposed."]
[null,"DHW Storage Tank Size (gal)",null,"Same as Proposed."]
[null,"Quantity of Systems",null,"Same as Proposed."]
[null,"DHW Storage Tank Insulation R-value",null,"Unfired Storage tank: R-12.5",12.5]
[null,"DHW Circulating Pump?",null,"Use system parameters (head, efficiency) or Ppump=BHP*746/Pump Motor Efficiency to model pump power. Use ASHRAE Table 10.8 A-C to determine Motor Efficiency",{"$f":"IF(F129=\"\",\"\",F129)","v":""}]
[null,"Quantity of DHW Pumps"]
[null,"DHW Pump Motor Efficiency"]
[null,"DHW Pump Motor Class"]
[null,"DHW Pump Capacity Control"]
[null,"DHW Pump Size (HP)"]
[null,"Showerheads (gpm)",null,"2.5 gpm",2.5]
[null,"Kitchen Faucets (gpm)",null,"2.5 gpm",2.5]
[null,"Lavatory Faucets (gpm)",null,"2.5 gpm",2.5]
[null,"Toilets (gpf)",null,"1.6 gpf",1.6]
[null,"Hot Water Demand (gpm)",null,"See Simulation Guidelines\nSection 3.9.2"]
[]
[null,"Ventilation Components","Measure #","ASHRAE 90.1-2010 Appx G Baseline","Baseline Design",{"$f":"F121","v":0},"Quantity","Manufacturer","Model No.","Energy Star?","Continuous or Intermittent","Fan Type"]
[null,"Apt - Bathroom Exhaust (CFM/bath)",null,"20 CFM/bathroom (continuous) or 50 CFM/bathroom (intermittent - 2hr/day)",{"$f":"TRUNC('Infiltration&Ventilation'!D38,1)","v":20},{"$f":"IF(Path=\"Performance Path\",TRUNC('Infiltration&Ventilation'!D37,1),\"\")","v":0},null,null,null,null,{"$f":"'Infiltration&Ventilation'!D35","v":0},{"$f":"'Infiltration&Ventilation'!D36","v":0}]
[null,"Apt - Kitchen Exhaust (CFM/kitchen)",null,"5 ACH/kitchen (continuous) or 100 CFM/kitchen (intermittent - 2hr/day)",{"$f":"TRUNC('Infiltration&Ventilation'!C38,1)","v":0},{"$f":"IF(Path=\"Performance Path\",TRUNC('Infiltration&Ventilation'!C37,1),\"\")","v":0},null,null,null,null,{"$f":"'Infiltration&Ventilation'!C35","v":0},{"$f":"'Infiltration&Ventilation'!C36","v":0}]
[null,"Apt - Duct Sealing - Total CFM",null,"From Infiltration & Ventilation Tab. Add 10 CFM per floor per shaft to Exhaust CFM to represent ventilation duct leakage",{"$f":"'Infiltration&Ventilation'!C57","v":0},{"$f":"IF(Path=\"Peformance Path\",'Infiltration&Ventilation'!D57,\"\")","v":""}]
[null,"Apt - Total Continuous Exhaust CFM",null,"From Infiltration & Ventilation Tab",{"$f":"TRUNC('Infiltration&Ventilation'!C56,1)","v":0},{"$f":"IF(Path=\"Performance Path\",TRUNC('Infiltration&Ventilation'!D56,1),\"\")","v":0}]
[null,"Apt - Continuous Exhaust Fan Power in Addition to Main HVAC Fans, kW",null,"Included in 0.3 W/CFM baseline PTAC/PTHP fan power allowance",0,{"$f":"IF(Path=\"Performance Path\",TRUNC('Infiltration&Ventilation'!D58,2),\"\")","v":0}]
[null,"Apt - Total Intermittent Exhaust CFM",null,"From Infiltration & Ventilation Tab",{"$f":"TRUNC('Infiltration&Ventilation'!C59,1)","v":0},{"$f":"IF(Path=\"Performance Path\",TRUNC('Infiltration&Ventilation'!D59,1),\"\")","v":0}]
[null,"Apt - Total Power of Intermittent Exhaust Fans, kW",null,"From Infiltration & Ventilation Tab. For intermittent fans: Ceiling Exhaust - 1.2 CFM/W; Inline Exhaust - 2.3 CFM/W, based on SG 3.14.3",{"$f":"'Infiltration&Ventilation'!C60","v":0},{"$f":"IF(Path=\"Performance Path\",'Infiltration&Ventilation'!D60,\"\")","v":0}]
[null,"Apt - Total OA Mechanical Supply CFM",null,"From Infiltration & Ventilation Tab",{"$f":"TRUNC('Infiltration&Ventilation'!C61,1)","v":0},{"$f":"IF(Path=\"Performance Path\",TRUNC('Infiltration&Ventilation'!D61,1),\"\")","v":0}]
[null,"Apt - Dedicated OA Supply Fan Power, kW",null,"Included in 0.3 W/CFM baseline PTAC/PTHP fan power allowance",{"$f":"'Infiltration&Ventilation'!C62","v":0},{"$f":"IF(Path=\"Performance Path\",'Infiltration&Ventilation'!D62,\"\")","v":0}]
[null,"Apt - Fresh Air Supply Type",null,"Same as Proposed or As-Built",{"$f":"IF(F151=\"\",\"\",F151)","v":""}]
[null,"Apt - Infiltration (ACH)",null,"From Infiltration & Ventilation tab.  Credit may only be taken in the As-Built model.",{"$f":"'Infiltration&Ventilation'!C63","v":0},{"$f":"IF(Path=\"Performance Path\",'Infiltration&Ventilation'!D63,\"\")","v":0}]
[null,"Total Corridor Supply Ventilation (CFM)",null,"From Infiltration & Ventilation Tab. Equal to the minimum ventilation rates required by ASHRAE 62.1-2010, unless space qualifies for Exception B of ASHRAE 90.1-2010 section G3.1.2.6.",{"$f":"TRUNC('Infiltration&Ventilation'!E61,1)","v":0},{"$f":"IF(Path=\"Performance Path\",TRUNC('Infiltration&Ventilation'!F61,1),\"\")","v":0}]
[null,"Corridor - Duct Sealing - Total CFM",null,"From Infiltration & Ventilation Tab. Add 10 CFM per floor per shaft to Exhaust CFM to represent ventilation duct leakage",{"$f":"'Infiltration&Ventilation'!E57","v":0},{"$f":"IF(Path=\"Performance Path\",'Infiltration&Ventilation'!F57,\"\")","v":0}]
[null,"Corridor - Dedicated Ventilation Fan Power in Addition to Main HVAC Fans (kW)",null,"From ASHRAE 90.1 Appx G 3.1.2.10: no additional allowance for ventilation fans",{"$f":"'Infiltration&Ventilation'!E62","v":0},{"$f":"IF(Path=\"Performance Path\",'Infiltration&Ventilation'!F62,\"\")","v":0}]
[null,"Other Ventilation Fans (CFM)",null,"Equal to the minimum ventilation rates required by ASHRAE 62.1-2010, unless space qualifies for Exception B of ASHRAE 90.1-2010 section G3.1.2.6.","N/A"]
[null,"Other Ventilation Fans - Duct Sealing - Total CFM",null,"Add 10 CFM per floor per shaft to Exhaust CFM to represent ventilation duct leakage"]
[null,"Other Ventilation Fans (hp)",null,"Included in W/CFM baseline allowance per ASHRAE 90.1 Appx G3.1.2.10","N/A"]
[null,"Other Ventilation Fans (efficiency)",null,"Included in W/CFM baseline allowance per ASHRAE 90.1 Appx G3.1.2.10","N/A"]
[null,"Other Ventilation Fans Power (kW)",null,"Included in W/CFM baseline allowance per ASHRAE 90.1 Appx G3.1.2.10","N/A"]
[null,"Total Supply Airflow (CFM) For Primary System",null,"Auto-sized based on 20 °F ΔT"]
[null,"Total Supply Airflow (CFM) For Secondary System",null,"Auto-sized based on 20 °F ΔT"]
[null,"Total Supply Airflow (CFM) For Tertiary System",null,"Auto-sized based on 20 °F ΔT"]
[null,"Heat/Energy Recovery (Yes/No)",null,"None, unless required by ASHRAE G3.1.2.11","N/A"]
[null,"Heat/Energy Recovery Affected System",null,"N/A","N/A"]
[null,"Heat/Energy Recovery Effectiveness (%)",null,"N/A","N/A"]
[null,"Heat/Energy Recovery Supply Air Flow(CFM)",null,"N/A","N/A"]
[null,"Heat/Energy Recovery Exhaust Air Flow (CFM)",null,"N/A","N/A"]
[null,"Garage Exhaust Fan (CFM)",null,"If Demand Control (DCV) is required by 90.1 2010 6.4.3.4.5, then baseline CFM must be the lesser of the 1.5 CFM/SF or the actual specified flow rate; otherwise same as Proposed or As-Built (SG 3.14.5, Mechanical Code of NYS Section 404)",{"$f":"IF('Basic Info'!$C$29=0,\"N/A\",\"\")","v":"N/A"}]
[null,"Garage Exhaust Fan (hp)",null,"Proposed or As-Built HP multiplied by the ratio of (Baseline Exhaust CFM)/(Proposed Exhaust CFM)",{"$f":"IF('Basic Info'!$C$29=0,\"N/A\",\"\")","v":"N/A"}]
[null,"Garage Exhaust Fan (efficiency)",null,"See ASHRAE Table 10.8 A-C to determine Fan Motor Efficiency",{"$f":"IF('Basic Info'!$C$29=0,\"N/A\",\"\")","v":"N/A"}]
[null,"Garage Exhaust Fan Power (kW)",null,"See Simulation Guidelines\nSection 3.14",{"$f":"IF('Basic Info'!$C$29=0,\"N/A\",\"\")","v":"N/A"}]
[null,"Garage Exhaust Fan - Demand Control",null,"Required, unless exceptions to 90.1 2010 Section 6.4.3.4.5 apply.",{"$f":"IF('Basic Info'!$C$29=0,\"N/A\",\"Yes\")","v":"N/A"}]
[null,"Garage Exhaust Fan -Demand Control (hr/day)",null,"Same as proposed, unless system qualifes for Exceptions A or B of ASHRAE 90.1-2010 Section 6.4.3.4.5.  If qualified, see Simulation Guidelines section 3.14.5.",{"$f":"IF('Basic Info'!C29=0,\"N/A\",\"8.4 hr/day\")","v":"N/A"}]
[null,"Other Demand Control",null,"None, unless required by ASHRAE 6.4.3.9.","N/A"]
[null,"Other Demand Control (hr/day)",null,"See Simulation Guidelines\nSection 3.12"]
[null,"Other Demand Control Fan Power (kW)",null,"Use Pfan=BHP*746/Fan Motor Efficiency to determine ventilation fan power. Use ASHRAE Table 10.8 A-C to determine Fan Motor Efficiency"]
[]
[null,"Building Component","Measure #","ASHRAE 90.1-2010 Appx G Baseline","Baseline Design",{"$f":"F141","v":0}]
[null,"Other motor including Non-HVAC Fans in SG 3.14.3 (1)",null,"N/A"]
[null,"Other motor including Non-HVAC Fans in SG 3.14.3 (2)",null,"N/A"]
[null,"Other motor including Non-HVAC Fans in SG 3.14.3 (3)",null,"N/A"]
[]
[null,"Renewable and Distributed Generation Systems","Measure #","ASHRAE 90.1-2010 Appx G Baseline","Baseline Design",{"$f":"G129","v":0}]
[null,"Solar Thermal System",null,"N/A","N/A"]
[null,"Solar Thermal System Size ",null,"N/A","N/A"]
[null,"Solar Thermal System Contribution to DHW (kBTU/yr)",null,"N/A","N/A"]
[null,"Solar Thermal System Contribution to Space Heating (kBTU/yr)",null,"N/A","N/A"]
[null,"Solar PV System",null,"N/A","N/A"]
[null,"Solar PV System Size ",null,"N/A","N/A"]
[null,"Cogen System ",null,"N/A","N/A"]
[null,"Cogen System Size ",null,"N/A","N/A"]
[null,"Other Renewable System",null,"N/A","N/A"]
[null,"Other Renewable System Size",null,"N/A","N/A"]
[]
[]
[null,"Passive House Modeling Results"]
[null,"Primary Energy Demand excluding renewables and distributed generation"]
[null,"Primary Energy Demand after removing energy use attributed to amentities "]
[null,"List amenties removed from above metric, if applicable"]
[null,"Primary Energy Demand include renewables and distributed generation"]
[]
[]
[]
[null,"Partner Notes - Use this section to include any notes about the information entered above."]

{"sheet":"Reporting Summary","index":10,"n_rows":138,"n_cols":39,"rows_kept":138,"cut":false,"hidden":false,"merged":[[5,8,5,11],[7,1,7,2],[7,3,7,5],[9,1,9,2],[9,3,9,5],[123,10,123,11],[1,1,2,11],[138,1,138,11],[4,1,4,11],[10,1,10,11],[15,1,15,11],[28,1,28,11],[37,1,37,11],[84,1,84,11],[110,1,110,11],[114,1,114,11],[127,1,127,11],[16,6,16,7],[21,6,21,7],[29,5,29,11],[96,6,96,7],[79,4,79,6],[79,1,79,2],[76,1,76,2],[81,1,81,2],[70,7,70,11],[68,1,68,2],[82,4,82,6],[87,6,87,7],[81,4,81,6],[77,1,77,11],[74,7,74,11],[82,1,82,2],[74,4,74,6],[83,1,83,2],[76,4,76,6],[75,7,75,11],[76,7,76,11],[85,10,85,11],[85,1,85,2],[69,4,69,6],[68,4,68,6],[78,1,78,2],[79,7,79,11],[81,7,81,11],[72,7,72,11],[71,1,71,11],[80,1,80,11],[47,7,47,11],[47,4,47,6],[52,1,52,11],[46,4,46,6],[48,7,48,11],[67,4,67,6],[54,1,54,2],[61,1,61,2],[64,1,64,2],[59,1,59,2],[58,1,58,2],[56,1,56,2],[51,7,51,11],[55,4,55,6],[60,4,60,6],[59,4,59,6],[54,4,54,6],[54,7,54,11],[48,4,48,6],[50,4,50,6],[41,4,41,6],[38,4,38,6],[38,1,38,2],[49,7,49,11],[45,7,45,11],[53,7,53,11],[55,7,55,11],[56,4,56,6],[56,7,56,11],[50,7,50,11],[53,4,53,6],[43,7,43,11],[43,4,43,6],[47,1,47,2],[55,1,55,2],[53,1,53,2],[50,1,50,2],[45,4,45,6],[48,1,48,2],[49,4,49,6],[43,1,43,2],[44,4,44,6],[44,1,44,2],[42,1,42,2],[40,1,40,2],[39,1,39,11],[40,4,40,6],[25,1,25,2],[31,1,31,3],[30,1,30,3],[27,1,27,2],[29,1,29,3],[26,1,26,2],[26,8,26,11],[27,8,27,11],[25,8,25,11],[38,7,38,11],[40,7,40,11],[33,1,33,3],[34,1,34,3],[35,1,35,3],[36,1,36,3],[30,5,36,11],[17,6,17,7],[17,1,17,2],[20,6,20,7],[23,1,24,5],[17,8,17,11],[18,8,18,11],[19,8,19,11],[17,3,17,5],[18,6,18,7],[18,1,18,2],[20,1,20,2],[18,3,18,5],[21,1,21,2],[19,1,19,2],[20,3,20,5],[20,8,20,11],[23,8,23,11],[23,6,23,7],[24,6,24,7],[21,8,21,11],[24,8,24,11],[14,8,14,11],[8,6,8,7],[8,3,8,5],[9,6,9,7],[9,8,9,11],[11,8,11,11],[11,6,11,7],[11,3,11,5],[12,3,12,5],[8,1,8,2],[6,6,6,7],[7,6,7,7],[22,3,22,5],[22,6,22,7],[22,8,22,11],[22,1,22,2],[11,1,11,2],[12,1,12,2],[13,1,13,2],[16,1,16,2],[14,1,14,2],[19,6,19,7],[19,3,19,5],[21,3,21,5],[16,3,16,5],[13,6,13,7],[16,8,16,11],[12,6,12,7],[14,6,14,7],[14,3,14,5],[13,3,13,5],[12,8,12,11],[13,8,13,11],[105,10,105,11],[105,1,105,2],[108,6,108,7],[107,4,107,5],[108,1,108,2],[106,1,106,11],[6,8,6,11],[7,8,7,11],[8,8,8,11],[59,7,59,11],[86,1,86,11],[89,4,89,5],[89,6,89,7],[91,4,91,5],[89,1,89,2],[89,8,89,9],[89,10,89,11],[87,8,87,9],[87,10,87,11],[88,8,88,9],[88,10,88,11],[87,1,87,2],[88,1,88,2],[87,4,87,5],[5,3,5,5],[6,3,6,5],[5,1,5,2],[98,4,98,5],[83,7,83,11],[82,7,82,11],[85,4,85,5],[85,6,85,7],[94,6,94,7],[95,4,95,5],[83,4,83,6],[6,1,6,2],[5,6,5,7],[91,1,91,2],[90,6,90,7],[94,1,94,2],[90,8,90,9],[90,4,90,5],[93,4,93,5],[95,8,95,9],[96,1,96,2],[88,6,88,7],[88,4,88,5],[85,8,85,9],[109,1,109,2],[108,4,108,5],[107,6,107,7],[105,4,105,5],[105,6,105,7],[105,8,105,9],[101,4,101,5],[101,6,101,7],[92,6,92,7],[92,4,92,5],[93,1,93,2],[92,1,92,2],[96,4,96,5],[94,4,94,5],[99,6,99,7],[98,1,98,2],[104,4,104,5],[103,6,103,7],[100,4,100,5],[103,4,103,5],[100,1,100,2],[104,6,104,7],[103,1,103,2],[99,1,99,2],[93,6,93,7],[95,6,95,7],[97,1,97,11],[98,6,98,7],[98,10,98,11],[99,4,99,5],[100,6,100,7],[98,8,98,9],[96,8,96,9],[96,10,96,11],[126,10,126,11],[122,10,122,11],[100,8,100,9],[100,10,100,11],[101,8,101,9],[101,10,101,11],[107,8,107,9],[107,10,107,11],[108,8,108,9],[108,10,108,11],[109,8,109,9],[109,10,109,11],[103,8,103,9],[103,10,103,11],[104,8,104,9],[104,10,104,11],[121,10,121,11],[115,9,116,9],[125,10,125,11],[118,10,118,11],[119,10,119,11],[124,10,124,11],[120,10,120,11],[117,10,117,11],[107,1,107,2],[104,1,104,2],[68,7,68,11],[63,1,63,2],[61,7,61,11],[73,1,73,2],[75,1,75,2],[75,4,75,6],[70,1,70,2],[70,4,70,6],[73,4,73,6],[72,4,72,6],[72,1,72,2],[74,1,74,2],[64,4,64,6],[63,4,63,6],[61,4,61,6],[69,7,69,11],[73,7,73,11],[69,1,69,2],[67,7,67,11],[67,1,67,2],[95,10,95,11],[101,1,101,2],[42,4,42,6],[41,7,41,11],[78,7,78,11],[78,4,78,6],[115,10,116,11],[115,6,115,8],[102,1,102,11],[91,6,91,7],[90,1,90,2],[115,2,115,4],[99,8,99,9],[99,10,99,11],[90,10,90,11],[91,8,91,9],[91,10,91,11],[92,8,92,9],[92,10,92,11],[93,8,93,9],[93,10,93,11],[94,8,94,9],[94,10,94,11],[95,1,95,2],[109,6,109,7],[109,4,109,5],[114,13,116,13],[114,14,116,14],[41,1,41,2],[60,7,60,11],[57,1,57,2],[57,7,57,11],[57,4,57,6],[65,1,65,2],[66,1,66,2],[65,4,65,6],[65,7,65,11],[66,4,66,6],[66,7,66,11],[63,7,63,11],[64,7,64,11],[58,7,58,11],[62,1,62,11],[60,1,60,2],[58,4,58,6],[44,7,44,11],[46,7,46,11],[51,4,51,6],[49,1,49,2],[42,7,42,11]]}
[]
[null,"ENERGY STAR Multifamily High Rise\nReporting Summary, Version 1.4"]
[]
[]
[null,"Table 1. General Project Information"]
[null,"Current Project Status:",null,null,null,null,"Project Name:",null,{"$f":"'Basic Info'!C37","v":0}]
[null,"Estimated Construction Completion Date (mo/yr):",null,{"$f":"IF('Basic Info'!C76=\"\",\"\",'Basic Info'!C76)","v":""},null,null,"Builder / Developer:",null,{"$f":"'Basic Info'!C81","v":0}]
[null,"Project Address:",null,{"$f":"'Basic Info'!C38","v":0},null,null,"Name of contact:",null,{"$f":"'Basic Info'!D81","v":0}]
[null,"Project City, State, County:",null,{"$f":"'Basic Info'!C39 & \", \" & 'Basic Info'!C41","v":", "},null,null,"Phone:",null,{"$f":"'Basic Info'!E81","v":0}]
[null,"Project Zip Code:",null,{"$f":"'Basic Info'!C40","v":0},null,null,"E-mail:",null,{"$f":"'Basic Info'!F81","v":0}]
[null,"Table 2. Modeling Information"]
[null,"Lead Modeler:",null,{"$f":"'Basic Info'!D80","v":0},null,null,"Simulation Program & Version #:",null,{"$f":"'Basic Info'!C43","v":0}]
[null,"Company:",null,{"$f":"'Basic Info'!C80","v":0},null,null,"Baseline:",null,"ASHRAE 90.1-2010"]
[null,"Phone:",null,{"$f":"'Basic Info'!E80","v":0},null,null,"Weather File Location (City, ST):",null,{"$f":"'Basic Info'!C45","v":0}]
[null,"E-mail:",null,{"$f":"'Basic Info'!F80","v":0},null,null,"Climate Zone:",null,{"$f":"'Basic Info'!C64","v":0}]
[null,"Table 3. Building Information"]
[null,"# of stories",null,{"$f":"'Basic Info'!C54","v":0},null,null,"Total bldg ft2:",null,{"$f":"'Basic Info'!C31","v":0}]
[null,"Space heating fuel:",null,{"$f":"'Basic Info'!C57","v":0},null,null,"Residential",null,{"$f":"'Basic Info'!C16","v":0}]
[null,"DHW fuel:",null,{"$f":"'Basic Info'!C59","v":0},null,null,"Common space",null,{"$f":"SUM('Basic Info'!C17:C26)","v":0}]
[null,"Heating system:",null,{"$f":"'Basic Info'!C60","v":0},null,null,"Commercial",null,{"$f":"'Basic Info'!C30","v":0}]
[null,"Cooling system:",null,{"$f":"'Basic Info'!C61","v":0},null,null,"Garage",null,{"$f":"'Basic Info'!C29","v":0}]
[null,"Ventilation system:",null,{"$f":"'Basic Info'!C62","v":0},null,null,"Conditioned ft2:",null,{"$f":"'Basic Info'!C32","v":0}]
[null,"DHW system:",null,{"$f":"'Basic Info'!C59","v":0},null,null,"Heated & cooled",null,{"$f":"SUMIF('Basic Info'!D16:D30, \"Heated & Cooled\", 'Basic Info'!C16:C30)","v":0}]
[null,null,null,null,null,null,"Heated-only",null,{"$f":"SUMIF('Basic Info'!D16:D30, \"Heated-Only\", 'Basic Info'!C16:C30)","v":0}]
[null,null,null,null,null,null,"Cooled-only",null,{"$f":"SUMIF('Basic Info'!D16:D30, \"Cooled-Only\", 'Basic Info'!C16:C30)","v":0}]
[null,"Apartment type",null,"Studio","1-BR","2-BR","3-BR","4-BR","Total"]
[null,"# of apartments",null,{"$f":"'Basic Info'!C8","v":0},{"$f":"'Basic Info'!C9","v":0},{"$f":"'Basic Info'!C10","v":0},{"$f":"'Basic Info'!C11","v":0},{"$f":"'Basic Info'!C12","v":0},{"$f":"SUM(D27:H27)","v":0}]
[null,"Average ft2",null,null,null,null,null,null,{"$f":"(D28*D27+E28*E27+F28*F27+G28*G27+H28*H27)/I27","v":{"$error":"#DIV/0!"}}]
[null,"Table 4. ENERGY STAR Portfolio Manager Input"]
[null,"Gross Floor Area (Select \"Multifamily Housing\" as Primary Function)",null,null,{"$f":"I17-I21","v":0},"Notes"]
[null,"Number of bedrooms ",null,null,{"$f":"'Basic Info'!C8+'Basic Info'!C9+2*'Basic Info'!C10+3*'Basic Info'!C11+4*'Basic Info'!C12","v":0},"<Please use this space to describe features/systems of the building as needed>"]
[null,"Number of Stories (1-4 \"Low-rise\": 5-9 \"Mid-rise\": 10+ \"High-rise\")",null,null,{"$f":"D17","v":0}]
[null,"Number of Residential Living Units (must exceed 20 per \"property\")",null,null,{"$f":"I27","v":0}]
[null,"Number of Laundry Hookups in All Units"]
[null,"Number of Laundry Hookups in Common Area (s)"]
[null,"Estimated Total Annual Energy Use, kWh (thousand Watt-hours)",null,null,{"$f":"G108","v":0}]
[null,"Estimated Total Annual Energy Use, MBtu (million Btu)",null,null,{"$f":"G109+G110","v":0}]
[null,"Table 5. Comparison of Inputs"]
[null,"Model Input Parameter",null,"Example Unit","Baseline Design\n(provide description and specification)",null,null,"Proposed Final Design\n(provide description and specification)",null,null,null,null,null,null,null,null,null,null,null,null,null,null,null,null,null,null,null,null,null,{"$f":"E41","v":"Per ASHRAE, "},{"$f":"H41","v":" , "},null,null,null,null,null,null,"% AFUE","SEER"]
[null,"Building envelope",null,null,null,null,null,null,null,null,null,null,null,null,null,null,null,null,null,null,null,null,null,null,null,null,null,null,null,"Per ASHRAE, ",{"$f":"H42","v":" , "},null,null,null,null,null,null,"HSPF","EER"]
[null,"Ext. wall construction (above grade)",null,"U-factor",{"$f":"CONCATENATE('Model Inputs'!E13,\", \",'Model Inputs'!E14)","v":"Per ASHRAE, "},null,null,{"$f":"CONCATENATE('Model Inputs'!F13,\" , \",'Model Inputs'!F14)","v":" , "},null,null,null,null,null,null,null,null,null,null,null,null,null,null,null,null,null,null,null,null,null,"Per ASHRAE, "," , "]
[null,"Ext. wall construction (below grade)",null,"C-factor",{"$f":"IF('Model Inputs'!F18=\"N/A\",\"N/A\",CONCATENATE('Model Inputs'!E18,\", \",'Model Inputs'!E19))","v":"Per ASHRAE, "},null,null,{"$f":"IF('Model Inputs'!F18=\"N/A\",\"N/A\",CONCATENATE('Model Inputs'!F18,\" , \",'Model Inputs'!F19))","v":" , "},null,null,null,null,null,null,null,null,null,null,null,null,null,null,null,null,null,null,null,null,null,"Per ASHRAE, "," , ",null,null,null,null,null,null,"% Et","COP"]
[null,"Floor construction",null,"U-factor",{"$f":"IF('Model Inputs'!F20=\"N/A\",\"N/A\",CONCATENATE('Model Inputs'!E20,\", \",'Model Inputs'!E21))","v":"Per ASHRAE, "},null,null,{"$f":"IF('Model Inputs'!F20=\"N/A\",\"N/A\",CONCATENATE('Model Inputs'!F20,\" , \",'Model Inputs'!F21))","v":" , "}]
[null,"Slab-on-grade construction (unheated)",null,"F-factor",{"$f":"IF('Model Inputs'!F22=\"N/A\",\"N/A\",CONCATENATE('Model Inputs'!E22,\", \",'Model Inputs'!E23))","v":"Per ASHRAE, "},null,null,{"$f":"IF('Model Inputs'!F22=\"N/A\",\"N/A\",CONCATENATE('Model Inputs'!F22,\" , \",'Model Inputs'!F23))","v":" , "},null,null,null,null,null,null,null,null,null,null,null,null,null,null,null,null,null,null,null,null,null,"Per ASHRAE, "," , ",null,null,null,null,null,null,"COP"]
[null,"Slab-on-grade construction (embedded heat)",null,"F-factor",{"$f":"IF('Model Inputs'!F24=\"N/A\",\"N/A\",CONCATENATE('Model Inputs'!E24,\", \",'Model Inputs'!E25))","v":"Per ASHRAE, "},null,null,{"$f":"IF('Model Inputs'!F24=\"N/A\",\"N/A\",CONCATENATE('Model Inputs'!F24,\" , \",'Model Inputs'!F25))","v":" , "},null,null,null,null,null,null,null,null,null,null,null,null,null,null,null,null,null,null,null,null,null,"Per ASHRAE, "," , "]
[null,"Slab-below grade construction",null,"C-factor",{"$f":"IF('Model Inputs'!F26=\"N/A\",\"N/A\",CONCATENATE('Model Inputs'!E26,\", \",'Model Inputs'!E27))","v":"Per ASHRAE, "},null,null,{"$f":"IF('Model Inputs'!F26=\"N/A\",\"N/A\",CONCATENATE('Model Inputs'!F26,\" , \",'Model Inputs'!F27))","v":" , "},null,null,null,null,null,null,null,null,null,null,null,null,null,null,null,null,null,null,null,null,null,0,0]
[null,"Roof Construction",null,"U-factor",{"$f":"CONCATENATE('Model Inputs'!E28,\", \",'Model Inputs'!E29)","v":"Per ASHRAE, "},null,null,{"$f":"CONCATENATE('Model Inputs'!F28,\" , \",'Model Inputs'!F29)","v":" , "},null,null,null,null,null,null,null,null,null,null,null,null,null,null,null,null,null,null,null,null,null,", Per ASHRAE, "," ,  , "]
[null,"Window/wall area ratio",null,"%",{"$f":"'Model Inputs'!E30","v":0},null,null,{"$f":"'Model Inputs'!F30","v":0},null,null,null,null,null,null,null,null,null,null,null,null,null,null,null,null,null,null,null,null,null,0,0]
[null,"Window type and U-factor",null,"U-factor",{"$f":"CONCATENATE('Model Inputs'!E31,\", \", 'Model Inputs'!E32,\", \",'Model Inputs'!E33)","v":", Per ASHRAE, "},null,null,{"$f":"CONCATENATE('Model Inputs'!F31,\" , \", 'Model Inputs'!F32,\" , \",'Model Inputs'!F33)","v":" ,  , "},null,null,null,null,null,null,null,null,null,null,null,null,null,null,null,null,null,null,null,null,null,0,0]
[null,"Window SHGC",null,"SHGC",{"$f":"'Model Inputs'!E34","v":0},null,null,{"$f":"'Model Inputs'!F34","v":0},null,null,null,null,null,null,null,null,null,null,null,null,null,null,null,null,null,null,null,null,null,", "," , "]
[null,"Shading devices",null,null,{"$f":"'Model Inputs'!E35","v":0},null,null,{"$f":"'Model Inputs'!F35","v":0},null,null,null,null,null,null,null,null,null,null,null,null,null,null,null,null,null,null,null,null,null,0,0]
[null,"Doors",null,"U-factor",{"$f":"CONCATENATE('Model Inputs'!E37,\", \",'Model Inputs'!E38)","v":", "},null,null,{"$f":"CONCATENATE('Model Inputs'!F37,\" , \",'Model Inputs'!F38)","v":" , "},null,null,null,null,null,null,null,null,null,null,null,null,null,null,null,null,null,null,null,null,null,0.6,0]
[null,"Lighting & appliances"]
[null,"In-unit lighting power density",null,"W/ft2",{"$f":"'Model Inputs'!E42","v":0.6},null,null,{"$f":"'Model Inputs'!F42","v":0},null,null,null,null,null,null,null,null,null,null,null,null,null,null,null,null,null,null,null,null,null,{"$error":"#DIV/0!"},{"$error":"#DIV/0!"}]
[null,"Corridor lighting power density",null,"W/ft2",{"$f":"'Model Inputs'!E43","v":0.66},null,null,{"$f":"'Model Inputs'!F43","v":0},null,null,null,null,null,null,null,null,null,null,null,null,null,null,null,null,null,null,null,null,null,0,0]
[null,"Common space lighting power density",null,"W/ft2",{"$f":"'Interior Lighting'!N28/'Interior Lighting'!S28","v":{"$error":"#DIV/0!"}},null,null,{"$f":"'Interior Lighting'!J28/'Interior Lighting'!S28","v":{"$error":"#DIV/0!"}},null,null,null,null,{"$f":"IF('Interior Lighting'!S28=0,\"\",IF(H56>1.2*E56, \"Total specified lighting power for the combined common spaces is exceeding ASHRAE allowances by more than 20%. This is not permitted.\", \"\"))","v":""},null,null,null,null,null,null,null,null,null,null,null,null,null,null,null,null,{"$f":"E59","v":"N/A"},{"$f":"H59","v":0}]
[null,"Exterior lighting power (Total)",null,"W",{"$f":"'Model Inputs'!E48*1000","v":0},null,null,{"$f":"'Model Inputs'!F48*1000","v":0},null,null,null,null,null,null,null,null,null,null,null,null,null,null,null,null,null,null,null,null,null,{"$f":"E60","v":"N/A"},{"$f":"H60","v":"N/A"}]
[null,"Exterior lighting power (Apt Balconies)",null,"W",{"$f":"'Exterior Lighting'!G27","v":0},null,null,{"$f":"'Exterior Lighting'!H27","v":0}]
[null,"Lighting controls",null,null,{"$f":"'Model Inputs'!E45","v":"N/A"},null,null,{"$f":"'Model Inputs'!F45","v":0},null,null,null,null,null,null,null,null,null,null,null,null,null,null,null,null,null,null,null,null,null,"N/A","N/A"]
[null,"Refrigerator",null,"ENERGY STAR?",{"$f":"IF('Model Inputs'!G52=0,\"N/A\",\"Non-ENERGY STAR\")","v":"N/A"},null,null,{"$f":"IF('Model Inputs'!G52=0,\"N/A\",'Model Inputs'!J52)","v":"N/A"},null,null,null,null,null,null,null,null,null,null,null,null,null,null,null,null,null,null,null,null,null,"N/A","N/A"]
[null,"Dishwasher",null,"ENERGY STAR?",{"$f":"IF('Model Inputs'!G53=0,\"N/A\",\"Non-ENERGY STAR\")","v":"N/A"},null,null,{"$f":"IF('Model Inputs'!G53=0,\"N/A\",'Model Inputs'!J53)","v":"N/A"},null,null,null,null,null,null,null,null,null,null,null,null,null,null,null,null,null,null,null,null,null,0,0]
[null,"Clothes Washer",null,"ENERGY STAR?",{"$f":"IF('Model Inputs'!G57=0,\"N/A\",\"Non-ENERGY STAR\")","v":"N/A"},null,null,{"$f":"IF('Model Inputs'!G57=0,\"N/A\",'Model Inputs'!J57)","v":"N/A"},null,null,null,null,null,null,null,null,null,null,null,null,null,null,null,null,null,null,null,null,null,0,0]
[null,"HVAC System",null,null,null,null,null,null,null,null,null,null,null,null,null,null,null,null,null,null,null,null,null,null,null,null,null,null,null,"Supply, 0 CFM","Supply, 0 CFM"]
[null,"Primary HVAC system type",null,null,{"$f":"'Model Inputs'!E69","v":0},null,null,{"$f":"'Model Inputs'!F69","v":0}]
[null,"Apartment Whole-House Ventilation System",null,"Type, CFM & Watt",{"$f":"\"Supply, \"&('Model Inputs'!E153)&\" CFM\"","v":"Supply, 0 CFM"},null,null,{"$f":"\"Supply, \"&('Model Inputs'!F153+'Model Inputs'!F156)&\" CFM\"","v":"Supply, 0 CFM"},null,null,null,null,null,null,null,null,null,null,null,null,null,null,null,null,null,null,null,null,null,{"$f":"E69","v":" COP"},{"$f":"H69","v":" COP"}]
[null,"Apartment Bathroom Local Exhaust Ventilation",null,"Intermittent/cont",{"$f":"IF('Model Inputs'!K142=\"\",\"\",'Model Inputs'!K142&\", \"&'Model Inputs'!E142&\" CFM, \"&'Model Inputs'!E145&\" CFM/W\")","v":"0, 20 CFM, 0 CFM/W"},null,null,{"$f":"IF('Model Inputs'!K143=\"\",\"\",'Model Inputs'!K143&\", \"&'Model Inputs'!F142&\" CFM, \"&'Model Inputs'!F145&\" CFM/W\")","v":"0, 0 CFM, 0 CFM/W"}]
[null,"Apartment Kitchen Local Exhaust Ventilation",null,"Intermittent/cont",{"$f":"IF('Model Inputs'!K143=\"\",\"\",'Model Inputs'!K143&\", \"&'Model Inputs'!E143&\" CFM, \"&'Model Inputs'!E145&\" CFM/W\")","v":"0, 0 CFM, 0 CFM/W"},null,null,{"$f":"IF('Model Inputs'!K143=\"\",\"\",'Model Inputs'!K143&\", \"&'Model Inputs'!F143&\" CFM, \"&'Model Inputs'!F145&\" CFM/W\")","v":"0, 0 CFM, 0 CFM/W"}]
[null,"Corridor Outdoor Air Supply",null,"CFM/ft2",{"$f":"IF('Model Inputs'!E153=\"\",\"\",'Model Inputs'!E153/'Basic Info'!C20)","v":{"$error":"#DIV/0!"}},null,null,{"$f":"IF('Model Inputs'!F153=\"\",\"\",'Model Inputs'!F153/'Basic Info'!C20)","v":{"$error":"#DIV/0!"}},null,null,null,null,null,null,null,null,null,null,null,null,null,null,null,null,null,null,null,null,null," EER"," EER"]
[null,"Primary System Heating efficiency",null,"AFUE / HSPF, etc.",{"$f":"'Model Inputs'!AA71","v":" COP"},null,null,{"$f":"'Model Inputs'!AB71","v":" COP"},null,null,null,null,null,null,null,null,null,null,null,null,null,null,null,null,null,null,null,null,null,2.9999999999999997E-4,0]
[null,"Primary System Cooling efficiency",null,"SEER / EER",{"$f":"'Model Inputs'!AA87","v":" EER"},null,null,{"$f":"'Model Inputs'!AB87","v":" EER"},null,null,null,null,null,null,null,null,null,null,null,null,null,null,null,null,null,null,null,null,null,0,0]
[null,"Fan supply power",null,"kW/CFM",{"$f":"'Model Inputs'!E117","v":2.9999999999999997E-4},null,null,{"$f":"'Model Inputs'!F119","v":0},null,null,null,null,null,null,null,null,null,null,null,null,null,null,null,null,null,null,null,null,null,0,0]
[null,"Domestic Hot Water System",null,null,null,null,null,null,null,null,null,null,null,null,null,null,null,null,null,null,null,null,null,null,null,null,null,null,null,"2.5 @ 80 psi",0]
[null,"Equipment efficiency",null,"EF / Et",{"$f":"'Model Inputs'!E124","v":0},null,null,{"$f":"'Model Inputs'!F124","v":0}]
[null,"Kitchen Faucets",null,"GPM","2.5 @ 80 psi",null,null,{"$f":"'Model Inputs'!F136","v":0},null,null,null,null,null,null,null,null,null,null,null,null,null,null,null,null,null,null,null,null,null,"2.5 @ 80 psi",0]
[null,"Lavatory Faucets",null,"GPM","2.5 @ 80 psi",null,null,{"$f":"'Model Inputs'!F137","v":0},null,null,null,null,null,null,null,null,null,null,null,null,null,null,null,null,null,null,null,null,null,0,0]
[null,"Showerheads",null,"GPM","2.5 @ 80 psi",null,null,{"$f":"'Model Inputs'!F135","v":0},null,null,null,null,null,null,null,null,null,null,null,null,null,null,null,null,null,null,null,null,null,0,0]
[null,"Solar DHW system",null,"% of load",0,null,null,null,null,null,null,null,null,null,null,null,null,null,null,null,null,null,null,null,null,null,null,null,null,{"$error":"#REF!"},{"$error":"#REF!"}]
[null,"Renewable Electric Generation System",null,null,null,null,null,null,null,null,null,null,null,null,null,null,null,null,null,null,null,null,null,null,null,null,null,null,null,{"$error":"#REF!"},{"$error":"#REF!"}]
[null,"Type of system",null,null,{"$f":"'Model Inputs'!#REF!","v":{"$error":"#REF!"}},null,null,{"$f":"'Model Inputs'!#REF!","v":{"$error":"#REF!"}},null,null,null,null,null,null,null,null,null,null,null,null,null,null,null,null,null,null,null,null,null,0,0]
[null,"Rated capacity",null,"kW",{"$f":"'Model Inputs'!#REF!","v":{"$error":"#REF!"}},null,null,{"$f":"'Model Inputs'!#REF!","v":{"$error":"#REF!"}},null,null,null,null,null,null,null,null,null,null,null,null,null,null,null,null,null,null,null,null,null,0,0]
[null,"Other, if applicable",null,null,null,null,null,null,null,null,null,null,null,null,null,null,null,null,null,null,null,null,null,null,null,null,null,null,null,0,0]
[null,null,null,null,null,null,null,null,null,null,null,null,null,null,null,null,null,null,null,null,null,null,null,null,null,null,null,null,null,0,0]
[null,null,null,null,null,null,null,null,null,null,null,null,null,null,null,null,null,null,null,null,null,null,null,null,null,null,null,null,null,0,0]
[null,null,null,null,null,null,null,null,null,null,null,null,null,null,null,null,null,null,null,null,null,null,null,null,null,null,null,null,null,"Baseline \nAnnual Consumption ",0]
[null,"Table 6. Comparison of Estimated Consumption",null,null,null,null,null,null,null,null,null,null,null,null,null,null,null,null,null,null,null,null,null,null,null,null,null,null,null,0,0]
[null,"End Use",null,"Units","Baseline \nAnnual Consumption ",null,"Proposed Design \nAnnual Consumption",null,"% Savings \nby End-Use",null,"% Savings \ntoward target",null,null,null,null,null,null,null,null,null,null,null,null,null,null,null,null,null,null,{"$error":"#DIV/0!"},0]
[null,"Electric loads",null,null,null,null,null,null,null,null,null,null,null,null,null,null,null,null,null,null,null,null,null,null,null,null,null,null,null,{"$error":"#DIV/0!"},{"$f":"H89","v":0}]
[null,"Ventilation fans",null,"kWh",{"$f":"'Results from eQUEST'!T19","v":{"$error":"#DIV/0!"}},null,{"$f":"'Results from eQUEST'!T22","v":0},null,{"$f":"IF(E88>0, (E88-G88)/E88, \"N/A\")","v":{"$error":"#DIV/0!"}},null,{"$f":"$C$112*(E88-G88)/$E$125","v":{"$error":"#DIV/0!"}},null,null,null,null,null,null,null,null,null,null,null,null,null,null,null,null,null,null,{"$error":"#DIV/0!"},0]
[null,"Space heating",null,"kWh",{"$f":"'Results from eQUEST'!P19+'Results from eQUEST'!V19","v":{"$error":"#DIV/0!"}},null,{"$f":"'Results from eQUEST'!P22+'Results from eQUEST'!V22","v":0},null,{"$error":"#DIV/0!"},null,{"$error":"#DIV/0!"},null,null,null,null,null,null,null,null,null,null,null,null,null,null,null,null,null,null,{"$error":"#DIV/0!"},0]
[null,"Space cooling",null,"kWh",{"$f":"'Results from eQUEST'!Q19+'Results from eQUEST'!R19","v":{"$error":"#DIV/0!"}},null,{"$f":"'Results from eQUEST'!Q22+'Results from eQUEST'!R22","v":0},null,{"$error":"#DIV/0!"},null,{"$error":"#DIV/0!"},null,null,null,null,null,null,null,null,null,null,null,null,null,null,null,null,null,null,{"$error":"#DIV/0!"},0]
[null,"Domestic hot water",null,"kWh",{"$f":"'Results from eQUEST'!W19","v":{"$error":"#DIV/0!"}},null,{"$f":"'Results from eQUEST'!W22","v":0},null,{"$error":"#DIV/0!"},null,{"$error":"#DIV/0!"},null,null,null,null,null,null,null,null,null,null,null,null,null,null,null,null,null,null,"0",0]
[null,"Interior lighting",null,"kWh",{"$f":"'Results from eQUEST'!M19+'Results from eQUEST'!N19","v":{"$error":"#DIV/0!"}},null,{"$f":"'Results from eQUEST'!M22+'Results from eQUEST'!N22","v":0},null,{"$error":"#DIV/0!"},null,{"$error":"#DIV/0!"},null,null,null,null,null,null,null,null,null,null,null,null,null,null,null,null,null,null,{"$error":"#DIV/0!"},0]
[null,"Exterior lighting",null,"kWh",{"$f":"IF('Results from eQUEST'!M15=\"\",\"0\",E57*12*365/1000)","v":"0"},null,{"$f":"IF('Results from eQUEST'!M15=\"\",\"0\",H57*12*365/1000)","v":"0"},null,{"$error":"#DIV/0!"},null,{"$error":"#DIV/0!"}]
[null,"Appliances",null,"kWh",{"$f":"'Results from eQUEST'!$O$19+'Results from eQUEST'!$U$19-E97","v":{"$error":"#DIV/0!"}},null,{"$f":"'Results from eQUEST'!$O$22+'Results from eQUEST'!$U$22-G97","v":0},null,{"$error":"#DIV/0!"},null,{"$error":"#DIV/0!"},null,null,null,null,null,null,null,null,null,null,null,null,null,null,null,null,null,null,{"$f":"E96","v":{"$error":"#DIV/0!"}},{"$f":"H96","v":0}]
[null,"Pumps and Aux",null,"kWh",{"$f":"'Results from eQUEST'!S19","v":{"$error":"#DIV/0!"}},null,{"$f":"'Results from eQUEST'!S22","v":0},null,{"$error":"#DIV/0!"},null,{"$error":"#DIV/0!"},null,null,null,null,null,null,null,null,null,null,null,null,null,null,null,null,null,null,0,0]
[null,"Other exterior",null,"kWh",{"$f":"'Results from eQUEST'!X19-E93","v":{"$error":"#DIV/0!"}},null,{"$f":"'Results from eQUEST'!X22-G93","v":0},null,{"$error":"#DIV/0!"},null,{"$error":"#DIV/0!"},null,null,null,null,null,null,null,null,null,null,null,null,null,null,null,null,null,null,0,0]
[null,"Plug loads",null,"kWh",{"$f":"1.05*'Basic Info'!C16+0.7*('Basic Info'!C17+'Basic Info'!C18+'Basic Info'!C20+'Basic Info'!C21+'Basic Info'!C22+'Basic Info'!C25+'Basic Info'!C26)+4.9*'Basic Info'!C23+1.6*('Basic Info'!C19+'Basic Info'!C24+'Basic Info'!C27+'Basic Info'!C28)","v":0},null,{"$f":"E97","v":0},null,"N/A",null,{"$error":"#DIV/0!"},null,null,null,null,null,null,null,null,null,null,null,null,null,null,null,null,null,null,{"$error":"#DIV/0!"},0]
[null,"Gas loads",null,null,null,null,null,null,null,null,null,null,null,null,null,null,null,null,null,null,null,null,null,null,null,null,null,null,null,{"$error":"#DIV/0!"},0]
[null,"Space heating",null,"MMbtu",{"$f":"'Results from eQUEST'!$BB$19*100000/1000000+'Results from eQUEST'!$BH$19*100000/1000000-E104","v":{"$error":"#DIV/0!"}},null,{"$f":"'Results from eQUEST'!$BB$22*100000/1000000+'Results from eQUEST'!$BH$22*100000/1000000-G104","v":0},null,{"$f":"IF(E99>0, (E99-G99)/E99, \"N/A\")","v":{"$error":"#DIV/0!"}},null,{"$f":"$C$113*(E99-G99)*10/$E$125","v":{"$error":"#DIV/0!"}},null,null,null,null,null,null,null,null,null,null,null,null,null,null,null,null,null,null,{"$error":"#DIV/0!"},0]
[null,"Domestic hot water",null,"MMbtu",{"$f":"'Results from eQUEST'!$BI$19*100000/1000000-E105","v":{"$error":"#DIV/0!"}},null,{"$f":"'Results from eQUEST'!$BI$22*100000/1000000-G105","v":0},null,{"$f":"IF(E100>0, (E100-G100)/E100, \"N/A\")","v":{"$error":"#DIV/0!"}},null,{"$f":"$C$113*(E100-G100)*10/$E$125","v":{"$error":"#DIV/0!"}}]
[null,"Appliances",null,"MMbtu",{"$f":"'Results from eQUEST'!$BA$19*100000/1000000","v":{"$error":"#DIV/0!"}},null,{"$f":"'Results from eQUEST'!$BA$22*100000/1000000","v":0},null,{"$f":"IF(E101>0, (E101-G101)/E101, \"N/A\")","v":{"$error":"#DIV/0!"}},null,{"$f":"$C$113*(E101-G101)*10/$E$125","v":{"$error":"#DIV/0!"}},null,null,null,null,null,null,null,null,null,null,null,null,null,null,null,null,null,null,{"$f":"E103","v":0},{"$f":"H103","v":0}]
[null,"Other (describe)",null,"MMbtu",{"$f":"('Results from eQUEST'!BK19)*100000/1000000-'Reporting Summary'!E99:F99-'Reporting Summary'!E100:F100-'Reporting Summary'!E101:F101","v":{"$error":"#DIV/0!"}},null,{"$f":"('Results from eQUEST'!BK22)*100000/1000000-'Reporting Summary'!G99:H99-'Reporting Summary'!G100:H100-'Reporting Summary'!G101:H101","v":0},null,{"$f":"IF(E102>0.001, (E102-G102)/E102, \"N/A\")","v":{"$error":"#DIV/0!"}},null,{"$f":"$C$113*(E102-G102)*10/$E$125","v":{"$error":"#DIV/0!"}},null,null,null,null,null,null,null,null,null,null,null,null,null,null,null,null,null,null,0,{"$f":"H104","v":0}]
[null,"Fuel oil loads",null,null,null,null,null,null,null,null,null,null,null,null,null,null,null,null,null,null,null,null,null,null,null,null,null,null,null,0,{"$f":"H105","v":0}]
[null,"Space heating",null,"MMbtu",null,null,null,null,null,null,null,null,null,null,null,null,null,null,null,null,null,null,null,null,null,null,null,null,null,{"$f":"E107","v":0},{"$f":"H107","v":0}]
[null,"Domestic hot water",null,"MMbtu",null,null,null,null,null,null,null,null,null,null,null,null,null,null,null,null,null,null,null,null,null,null,null,null,null,{"$f":"E108","v":{"$error":"#DIV/0!"}},{"$f":"H108","v":0}]
[null,"Other (describe)",null,"MMbtu"]
[null,"Totals",null,null,null,null,null,null,null,null,null,null,null,null,null,null,null,null,null,null,null,null,null,null,null,null,null,null,null,{"$error":"#DIV/0!"},0]
[null,"Electric loads",null,"kWh",{"$f":"SUM(E88:F97)","v":{"$error":"#DIV/0!"}},null,{"$f":"SUM(G88:H97)","v":0},null,{"$f":"IF(E108>0, (E108-G108)/E108, \"N/A\")","v":{"$error":"#DIV/0!"}},null,{"$f":"$C$112*(E108-G108)/$E$125","v":{"$error":"#DIV/0!"}},null,null,null,null,null,null,null,null,null,null,null,null,null,null,null,null,null,null,0,0]
[null,"Gas loads",null,"MMbtu",{"$f":"SUM(E99:F102)","v":{"$error":"#DIV/0!"}},null,{"$f":"SUM(G99:H102)","v":0},null,{"$f":"IF(E109>0, (E109-G109)/E109, \"N/A\")","v":{"$error":"#DIV/0!"}},null,{"$f":"$C$113*(E109-G109)*10/$E$125","v":{"$error":"#DIV/0!"}},null,null,null,null,null,null,null,null,null,null,null,null,null,null,null,null,null,null,0,0]
[null,"Oil loads",null,"MMbtu",{"$f":"SUM(E104:F105)","v":0},null,{"$f":"SUM(G104:H105)","v":0},null,{"$f":"IF(E110>0, (E110-G110)/E110, \"N/A\")","v":"N/A"},null,null,null,null,null,null,null,null,null,null,null,null,null,null,null,null,null,null,null,null,0,0]
[null,"Table 7. Fuel Cost",null,null,null,null,null,null,null,null,null,null,null,null,null,null,null,null,null,null,null,null,null,null,null,null,null,null,null,0,0]
[null,"Electricity",{"$f":"'Simulation Summary'!C17","v":0.18579999999999999},"$/kWh",null,null,null,null,null,null,null,null,null,null,null,null,null,null,null,null,null,null,null,null,null,null,null,null,null,0,0]
[null,"Natural Gas",{"$f":"'Simulation Summary'!C18","v":1.3220000000000001},"$/Therm",null,null,null,null,null,null,null,null,null,null,null,null,null,null,null,null,null,null,null,null,null,null,null,null,null,{"$f":"E115","v":0},{"$f":"H115","v":0}]
[null,"Fuel Oil",null,"$/Gallon",null,null,null,null,null,null,null,null,null,null,null,null,null,null,null,null,null,null,null,null,null,null,null,null,null,0,0]
[null,"Table 8. Performance Rating Calculation",null,null,null,null,null,null,null,null,null,null,null,"End use contribution to cost savings (%)","End Use contribution to performance rating (pts)",null,null,null,null,null,null,null,null,null,null,null,null,null,null,"Cost, $","Electricity, Btu"]
[null,null,"Baseline",null,null,null,"Proposed",null,null,"BTU Savings, %","$ Savings, %",null,null,null,null,null,null,null,null,null,null,null,null,null,null,null,null,null,null,{"$error":"#DIV/0!"},0]
[null,null,"Fossil Fuel, Btu","Electricity, Btu","Cost, $",null,"Fossil Fuel, Btu","Electricity, Btu","Cost, $",null,null,null,null,null,null,null,null,null,null,null,null,null,null,null,null,null,null,null,null,{"$error":"#DIV/0!"},0]
[null,"Annual Heating",{"$f":"100000*SUMIF('Results from eQUEST'!$AY$8:$BJ$8, B118, 'Results from eQUEST'!$AY$19:$BJ$19)","v":{"$error":"#DIV/0!"}},{"$f":"3412*SUMIF('Results from eQUEST'!$M$8:$X$8,B118, 'Results from eQUEST'!$M$19:$X$19)","v":{"$error":"#DIV/0!"}},{"$f":"C118/100000*$C$113+D118/3412*$C$112","v":{"$error":"#DIV/0!"}},null,{"$f":"100000*SUMIF('Results from eQUEST'!$AY$8:$BJ$8, B118, 'Results from eQUEST'!$AY$22:$BJ$22)","v":0},{"$f":"3412*SUMIF('Results from eQUEST'!$M$8:$X$8,B118, 'Results from eQUEST'!$M$22:$X$22)","v":0},{"$f":"G118/100000*$C$113+H118/3412*$C$112","v":0},{"$f":"IF(SUM(C118:D118)=0,0,(SUM(C118:D118)-SUM(G118:H118))/SUM(C118:D118))","v":{"$error":"#DIV/0!"}},{"$f":"IF(E118=0,0,(E118-I118)/E118)","v":{"$error":"#DIV/0!"}},null,null,{"$f":"(E118-J118)/($E$125-$J$125)","v":{"$error":"#DIV/0!"}},{"$f":"N118*$K$125*100","v":{"$error":"#DIV/0!"}},null,null,null,null,null,null,null,null,null,null,null,null,null,null,{"$error":"#DIV/0!"},0]
[null,"Annual Cooling ",{"$f":"100000*SUMIF('Results from eQUEST'!$AY$8:$BJ$8, B119, 'Results from eQUEST'!$AY$19:$BJ$19)","v":{"$error":"#DIV/0!"}},{"$f":"3412*SUMIF('Results from eQUEST'!$M$8:$X$8,B119, 'Results from eQUEST'!$M$19:$X$19)","v":{"$error":"#DIV/0!"}},{"$f":"C119/100000*$C$113+D119/3412*$C$112","v":{"$error":"#DIV/0!"}},null,{"$f":"100000*SUMIF('Results from eQUEST'!$AY$8:$BJ$8, B119, 'Results from eQUEST'!$AY$22:$BJ$22)","v":0},{"$f":"3412*SUMIF('Results from eQUEST'!$M$8:$X$8,B119, 'Results from eQUEST'!$M$22:$X$22)","v":0},{"$f":"G119/100000*$C$113+H119/3412*$C$112","v":0},{"$f":"IF(SUM(C119:D119)=0,0,(SUM(C119:D119)-SUM(G119:H119))/SUM(C119:D119))","v":{"$error":"#DIV/0!"}},{"$f":"IF(E119=0,0,(E119-I119)/E119)","v":{"$error":"#DIV/0!"}},null,null,{"$f":"(E119-J119)/($E$125-$J$125)","v":{"$error":"#DIV/0!"}},{"$f":"N119*$K$125*100","v":{"$error":"#DIV/0!"}},null,null,null,null,null,null,null,null,null,null,null,null,null,null,{"$error":"#DIV/0!"},0]
[null,"Annual Lighting",{"$f":"100000*SUMIF('Results from eQUEST'!$AY$8:$BJ$8, B120, 'Results from eQUEST'!$AY$19:$BJ$19)","v":{"$error":"#DIV/0!"}},{"$f":"3412*SUMIF('Results from eQUEST'!$M$8:$X$8,B120, 'Results from eQUEST'!$M$19:$X$19)","v":{"$error":"#DIV/0!"}},{"$error":"#DIV/0!"},null,{"$f":"100000*SUMIF('Results from eQUEST'!$AY$8:$BJ$8, B120, 'Results from eQUEST'!$AY$22:$BJ$22)","v":0},{"$f":"3412*SUMIF('Results from eQUEST'!$M$8:$X$8,B120, 'Results from eQUEST'!$M$22:$X$22)","v":0},0,{"$error":"#DIV/0!"},{"$error":"#DIV/0!"},null,null,{"$error":"#DIV/0!"},{"$error":"#DIV/0!"},null,null,null,null,null,null,null,null,null,null,null,null,null,null,{"$error":"#DIV/0!"},0]
[null,"Annual Hot Water",{"$f":"100000*SUMIF('Results from eQUEST'!$AY$8:$BJ$8, B121, 'Results from eQUEST'!$AY$19:$BJ$19)","v":{"$error":"#DIV/0!"}},{"$f":"3412*SUMIF('Results from eQUEST'!$M$8:$X$8,B121, 'Results from eQUEST'!$M$19:$X$19)","v":{"$error":"#DIV/0!"}},{"$error":"#DIV/0!"},null,{"$f":"100000*SUMIF('Results from eQUEST'!$AY$8:$BJ$8, B121, 'Results from eQUEST'!$AY$22:$BJ$22)","v":0},{"$f":"3412*SUMIF('Results from eQUEST'!$M$8:$X$8,B121, 'Results from eQUEST'!$M$22:$X$22)","v":0},0,{"$error":"#DIV/0!"},{"$error":"#DIV/0!"},null,null,{"$error":"#DIV/0!"},{"$error":"#DIV/0!"}]
[null,"Annual Appliance",{"$f":"100000*SUMIF('Results from eQUEST'!$AY$8:$BJ$8, B122, 'Results from eQUEST'!$AY$19:$BJ$19)","v":{"$error":"#DIV/0!"}},{"$f":"3412*SUMIF('Results from eQUEST'!$M$8:$X$8,B122, 'Results from eQUEST'!$M$19:$X$19)","v":{"$error":"#DIV/0!"}},{"$error":"#DIV/0!"},null,{"$f":"100000*SUMIF('Results from eQUEST'!$AY$8:$BJ$8, B122, 'Results from eQUEST'!$AY$22:$BJ$22)","v":0},{"$f":"3412*SUMIF('Results from eQUEST'!$M$8:$X$8,B122, 'Results from eQUEST'!$M$22:$X$22)","v":0},0,{"$error":"#DIV/0!"},{"$error":"#DIV/0!"},null,null,{"$error":"#DIV/0!"},{"$error":"#DIV/0!"}]
[null,"Annual Fans",{"$f":"100000*SUMIF('Results from eQUEST'!$AY$8:$BJ$8, B123, 'Results from eQUEST'!$AY$19:$BJ$19)","v":{"$error":"#DIV/0!"}},{"$f":"3412*SUMIF('Results from eQUEST'!$M$8:$X$8,B123, 'Results from eQUEST'!$M$19:$X$19)","v":{"$error":"#DIV/0!"}},{"$f":"C123/100000*$C$113+D123/3412*$C$112","v":{"$error":"#DIV/0!"}},null,{"$f":"100000*SUMIF('Results from eQUEST'!$AY$8:$BJ$8, B123, 'Results from eQUEST'!$AY$22:$BJ$22)","v":0},{"$f":"3412*SUMIF('Results from eQUEST'!$M$8:$X$8,B123, 'Results from eQUEST'!$M$22:$X$22)","v":0},{"$f":"G123/100000*$C$113+H123/3412*$C$112","v":0},{"$f":"IF(SUM(C123:D123)=0,0,(SUM(C123:D123)-SUM(G123:H123))/SUM(C123:D123))","v":{"$error":"#DIV/0!"}},{"$f":"IF(E123=0,0,(E123-I123)/E123)","v":{"$error":"#DIV/0!"}},null,null,{"$error":"#DIV/0!"},{"$error":"#DIV/0!"},null,null,null,null,null,null,null,null,null,null,null,null,null,null,{"$f":"E125","v":{"$error":"#DIV/0!"}},{"$f":"H125","v":0}]
[null,"Annual Pumps",{"$f":"100000*SUMIF('Results from eQUEST'!$AY$8:$BJ$8, B124, 'Results from eQUEST'!$AY$19:$BJ$19)","v":{"$error":"#DIV/0!"}},{"$f":"3412*SUMIF('Results from eQUEST'!$M$8:$X$8,B124, 'Results from eQUEST'!$M$19:$X$19)","v":{"$error":"#DIV/0!"}},{"$error":"#DIV/0!"},null,{"$f":"100000*SUMIF('Results from eQUEST'!$AY$8:$BJ$8, B124, 'Results from eQUEST'!$AY$22:$BJ$22)","v":0},{"$f":"3412*SUMIF('Results from eQUEST'!$M$8:$X$8,B124, 'Results from eQUEST'!$M$22:$X$22)","v":0},0,{"$error":"#DIV/0!"},{"$error":"#DIV/0!"},null,null,{"$error":"#DIV/0!"},{"$error":"#DIV/0!"}]
[null,"Total without Renewable",{"$f":"SUM(C118:C124)","v":{"$error":"#DIV/0!"}},{"$f":"SUM(D118:D124)","v":{"$error":"#DIV/0!"}},{"$f":"SUM(E118:E124)","v":{"$error":"#DIV/0!"}},null,{"$f":"SUM(G118:G124)","v":0},{"$f":"SUM(H118:H124)","v":0},{"$f":"SUM(I118:I124)","v":0},{"$error":"#DIV/0!"},{"$error":"#DIV/0!"},null,null,{"$f":"SUM(N118:N124)","v":{"$error":"#DIV/0!"}},{"$f":"SUM(O118:O124)","v":{"$error":"#DIV/0!"}},null,null,null,null,null,null,null,null,null,null,null,null,null,null,{"$f":"E129","v":0},{"$f":"H129","v":0}]
[null,"Annual Renewable",0,0,0,null,null,null,0,{"$f":"IF(SUM(C126:D126)=0,0,(SUM(C126:D126)-SUM(G126:H126))/SUM(C126:D126))","v":0},{"$f":"IF(E126=0,0,(E126-I126)/E126)","v":0}]
[null,"Total with Renewable",{"$f":"C125","v":{"$error":"#DIV/0!"}},{"$f":"D125","v":{"$error":"#DIV/0!"}},{"$f":"E125","v":{"$error":"#DIV/0!"}},null,{"$f":"G126+G125","v":0},{"$f":"H126+H125","v":0},{"$f":"I126+I125","v":0},{"$error":"#DIV/0!"},{"$f":"IF(E127=0,0,(E127-I127)/E127)","v":{"$error":"#DIV/0!"}}]
[null,"Table 9. Energy Usage per Square Foot of Conditioned Area",null,null,null,null,null,null,null,null,null,null,null,null,null,null,null,null,null,null,null,null,null,null,null,null,null,null,null,0,0]
[null,null,"Baseline","Proposed",null,null,null,null,null,null,null,null,null,null,null,null,null,null,null,null,null,null,null,null,null,null,null,null,null,0,0]
[null,null,"Btu/SqFt","Btu/SqFt",null,null,null,null,null,null,null,null,null,null,null,null,null,null,null,null,null,null,null,null,null,null,null,null,null,0,0]
[null,"Annual Heating",{"$f":"IF('GHSF Calculator'!$E$18=0,0,SUM(C118:D118)/'GHSF Calculator'!$E$18)","v":0},{"$f":"IF('GHSF Calculator'!$E$18=0,0,SUM(G118:H118)/'GHSF Calculator'!$E$18)","v":0},null,null,null,null,null,null,null,null,null,null,null,null,null,null,null,null,null,null,null,null,null,null,null,null,null,0,0]
[null,"Annual Cooling ",{"$f":"IF('GHSF Calculator'!$E$18=0,0,SUM(C119:D119)/'GHSF Calculator'!$E$18)","v":0},{"$f":"IF('GHSF Calculator'!$E$18=0,0,SUM(G119:H119)/'GHSF Calculator'!$E$18)","v":0},null,null,null,null,null,null,null,null,null,null,null,null,null,null,null,null,null,null,null,null,null,null,null,null,null,0,0]
[null,"Annual Lighting",{"$f":"IF('GHSF Calculator'!$E$18=0,0,SUM(C120:D120)/'GHSF Calculator'!$E$18)","v":0},{"$f":"IF('GHSF Calculator'!$E$18=0,0,SUM(G120:H120)/'GHSF Calculator'!$E$18)","v":0},null,null,null,null,null,null,null,null,null,null,null,null,null,null,null,null,null,null,null,null,null,null,null,null,null,0,0]
[null,"Annual Hot Water",{"$f":"IF('GHSF Calculator'!$E$18=0,0,SUM(C121:D121)/'GHSF Calculator'!$E$18)","v":0},{"$f":"IF('GHSF Calculator'!$E$18=0,0,SUM(G121:H121)/'GHSF Calculator'!$E$18)","v":0}]
[null,"Annual Appliance",{"$f":"IF('GHSF Calculator'!$E$18=0,0,SUM(C122:D122)/'GHSF Calculator'!$E$18)","v":0},{"$f":"IF('GHSF Calculator'!$E$18=0,0,SUM(G122:H122)/'GHSF Calculator'!$E$18)","v":0}]
[null,"Annual Fans",{"$f":"IF('GHSF Calculator'!$E$18=0,0,SUM(C123:D123)/'GHSF Calculator'!$E$18)","v":0},{"$f":"IF('GHSF Calculator'!$E$18=0,0,SUM(G123:H123)/'GHSF Calculator'!$E$18)","v":0},null,null,null,null,null,null,null,null,null,null,null,null,null,null,null,null,null,null,null,null,null,null,null,null,null,{"$f":"E138","v":0},{"$f":"H138","v":0}]
[null,"Annual Pumps",{"$f":"IF('GHSF Calculator'!$E$18=0,0,SUM(C124:D124)/'GHSF Calculator'!$E$18)","v":0},{"$f":"IF('GHSF Calculator'!$E$18=0,0,SUM(G124:H124)/'GHSF Calculator'!$E$18)","v":0}]
[null,"Total without Renewable",{"$f":"IF('GHSF Calculator'!$E$18=0,0,SUM(C125:D125)/'GHSF Calculator'!$E$18)","v":0},{"$f":"IF('GHSF Calculator'!$E$18=0,0,SUM(G125:H125)/'GHSF Calculator'!$E$18)","v":0}]

{"sheet":"Detailed Measures","index":11,"n_rows":46,"n_cols":21,"rows_kept":46,"cut":false,"hidden":false,"merged":[[4,0,6,0],[5,9,6,9],[5,6,6,6],[5,3,6,3],[4,6,4,11],[5,10,6,10],[5,11,6,11],[4,2,6,2],[4,1,6,1],[4,3,4,5],[5,4,6,4],[5,5,6,5],[5,7,6,7],[5,8,6,8],[45,1,45,6],[5,18,6,18],[4,12,4,20],[5,12,5,15],[5,20,6,20],[5,16,6,16],[5,17,6,17],[5,19,6,19]]}
[null,"Energy-Saving Measures"]
[]
[null,"Instructions:  Detailed instruction below table."]
[]
["ID","Parametric Run","Measure Category","Baseline Components",null,null,"Proposed Components",null,null,null,null,null,"Incremental Metrics"]
[null,null,null,"Description","Cost","Cost Source","Description","Cost","Cost Source","Lifetime\nyears","Quantity","Units","Energy Savings",null,null,null,"Demand Savings kW","Water Savings 1000 gal","O&M Savings \n$","Costs\n$","Cost Savings\n$"]
[null,null,null,null,null,null,null,null,null,null,null,null,"Heating MMBtu","Non-Heating MMBtu","Cooling kWh","Non- CoolingkWh"]
[]
[1,{"$f":"'Results from eQUEST'!K30","v":0},null,{"$f":"INDEX(ERMs!$B$5:$E$87,MATCH(A9,ERMs!$B$5:$B$87,0),4)","v":{"$error":"#N/A"}},null,null,{"$f":"INDEX(ERMs!$B$5:$E$87,MATCH(A9,ERMs!$B$5:$B$87,0),2)","v":{"$error":"#N/A"}},null,null,{"$f":"IF(C9=\"\",\"\",VLOOKUP(C9,'Demand Savings Lookup'!$A$2:$G$51,6,FALSE))","v":""},null,{"$f":"IF(C9=\"\",\"\",VLOOKUP(C9,'Demand Savings Lookup'!$A$1:$G$51,7,FALSE))","v":""},{"$f":"IF(B9=0,0,(('Results from eQUEST'!BB19+'Results from eQUEST'!BH19)/10-('Results from eQUEST'!BB30+'Results from eQUEST'!BH30)/10))","v":0},{"$f":"IF(B9=0,0,('Results from eQUEST'!BK19-'Results from eQUEST'!BK30)/10-M9)","v":0},{"$f":"IF(B9=0,0,(('Results from eQUEST'!Q19+'Results from eQUEST'!R19)-('Results from eQUEST'!Q30+'Results from eQUEST'!R30)))","v":0},{"$f":"IF(B9=0,0,'Results from eQUEST'!Y19-'Results from eQUEST'!Y30-O9)","v":0},{"$f":"IF(O9+P9<=0,0,IF(AND(O9=0,P9=0),0,IF(B9=0,0,O9*VLOOKUP(C9,'Demand Savings Lookup'!$A$2:$E$51,IF('Basic Info'!$C$64=4,5,3),FALSE)+P9*VLOOKUP(C9,'Demand Savings Lookup'!$A$2:$E$51,IF('Basic Info'!$C$64=4,4,2),FALSE))))","v":0},null,null,{"$f":"IF(H9=\"\",\"\",H9-E9)","v":""},{"$f":"IF(B9=0,\"\",(O9+P9)*'Reporting Summary'!$C$112+(M9+N9)*'Reporting Summary'!$C$113*10+'Water Savings'!$C$10*R9*1000)","v":""}]
[2,{"$f":"'Results from eQUEST'!K31","v":0},null,{"$f":"INDEX(ERMs!$B$5:$E$87,MATCH(A10,ERMs!$B$5:$B$87,0),4)","v":{"$error":"#N/A"}},null,null,{"$f":"INDEX(ERMs!$B$5:$E$87,MATCH(A10,ERMs!$B$5:$B$87,0),2)","v":{"$error":"#N/A"}},null,null,{"$f":"IF(C10=\"\",\"\",VLOOKUP(C10,'Demand Savings Lookup'!$A$2:$G$51,6,FALSE))","v":""},null,{"$f":"IF(C10=\"\",\"\",VLOOKUP(C10,'Demand Savings Lookup'!$A$1:$G$51,7,FALSE))","v":""},{"$f":"IF(B10=0,0,(('Results from eQUEST'!BB30+'Results from eQUEST'!BH30)/10-('Results from eQUEST'!BB31+'Results from eQUEST'!BH31)/10))","v":0},{"$f":"IF(B10=0,0,('Results from eQUEST'!BK30-'Results from eQUEST'!BK31)/10-M10)","v":0},{"$f":"IF(B10=0,0,(('Results from eQUEST'!Q30+'Results from eQUEST'!R30)-('Results from eQUEST'!Q31+'Results from eQUEST'!R31)))","v":0},{"$f":"IF(B10=0,0,'Results from eQUEST'!Y30-'Results from eQUEST'!Y31-O10)","v":0},{"$f":"IF(O10+P10<=0,0,IF(AND(O10=0,P10=0),0,IF(B10=0,0,O10*VLOOKUP(C10,'Demand Savings Lookup'!$A$2:$E$51,IF('Basic Info'!$C$64=4,5,3),FALSE)+P10*VLOOKUP(C10,'Demand Savings Lookup'!$A$2:$E$51,IF('Basic Info'!$C$64=4,4,2),FALSE))))","v":0},null,null,{"$f":"IF(H10=\"\",\"\",H10-E10)","v":""},{"$f":"IF(B10=0,\"\",(O10+P10)*'Reporting Summary'!$C$112+(M10+N10)*'Reporting Summary'!$C$113*10+'Water Savings'!$C$10*R10*1000)","v":""}]
[3,{"$f":"'Results from eQUEST'!K32","v":0},null,{"$f":"INDEX(ERMs!$B$5:$E$87,MATCH(A11,ERMs!$B$5:$B$87,0),4)","v":{"$error":"#N/A"}},null,null,{"$f":"INDEX(ERMs!$B$5:$E$87,MATCH(A11,ERMs!$B$5:$B$87,0),2)","v":{"$error":"#N/A"}},null,null,{"$f":"IF(C11=\"\",\"\",VLOOKUP(C11,'Demand Savings Lookup'!$A$2:$G$51,6,FALSE))","v":""},null,{"$f":"IF(C11=\"\",\"\",VLOOKUP(C11,'Demand Savings Lookup'!$A$1:$G$51,7,FALSE))","v":""},{"$f":"IF(B11=0,0,(('Results from eQUEST'!BB31+'Results from eQUEST'!BH31)/10-('Results from eQUEST'!BB32+'Results from eQUEST'!BH32)/10))","v":0},{"$f":"IF(B11=0,0,('Results from eQUEST'!BK31-'Results from eQUEST'!BK32)/10-M11)","v":0},{"$f":"IF(B11=0,0,(('Results from eQUEST'!Q31+'Results from eQUEST'!R31)-('Results from eQUEST'!Q32+'Results from eQUEST'!R32)))","v":0},{"$f":"IF(B11=0,0,'Results from eQUEST'!Y31-'Results from eQUEST'!Y32-O11)","v":0},{"$f":"IF(O11+P11<=0,0,IF(AND(O11=0,P11=0),0,IF(B11=0,0,O11*VLOOKUP(C11,'Demand Savings Lookup'!$A$2:$E$51,IF('Basic Info'!$C$64=4,5,3),FALSE)+P11*VLOOKUP(C11,'Demand Savings Lookup'!$A$2:$E$51,IF('Basic Info'!$C$64=4,4,2),FALSE))))","v":0},null,null,"",{"$f":"IF(B11=0,\"\",(O11+P11)*'Reporting Summary'!$C$112+(M11+N11)*'Reporting Summary'!$C$113*10+'Water Savings'!$C$10*R11*1000)","v":""}]
[4,{"$f":"'Results from eQUEST'!K33","v":0},null,{"$f":"INDEX(ERMs!$B$5:$E$87,MATCH(A12,ERMs!$B$5:$B$87,0),4)","v":{"$error":"#N/A"}},null,null,{"$f":"INDEX(ERMs!$B$5:$E$87,MATCH(A12,ERMs!$B$5:$B$87,0),2)","v":{"$error":"#N/A"}},null,null,{"$f":"IF(C12=\"\",\"\",VLOOKUP(C12,'Demand Savings Lookup'!$A$2:$G$51,6,FALSE))","v":""},null,{"$f":"IF(C12=\"\",\"\",VLOOKUP(C12,'Demand Savings Lookup'!$A$1:$G$51,7,FALSE))","v":""},{"$f":"IF(B12=0,0,(('Results from eQUEST'!BB32+'Results from eQUEST'!BH32)/10-('Results from eQUEST'!BB33+'Results from eQUEST'!BH33)/10))","v":0},{"$f":"IF(B12=0,0,('Results from eQUEST'!BK32-'Results from eQUEST'!BK33)/10-M12)","v":0},{"$f":"IF(B12=0,0,(('Results from eQUEST'!Q32+'Results from eQUEST'!R32)-('Results from eQUEST'!Q33+'Results from eQUEST'!R33)))","v":0},{"$f":"IF(B12=0,0,'Results from eQUEST'!Y32-'Results from eQUEST'!Y33-O12)","v":0},{"$f":"IF(O12+P12<=0,0,IF(AND(O12=0,P12=0),0,IF(B12=0,0,O12*VLOOKUP(C12,'Demand Savings Lookup'!$A$2:$E$51,IF('Basic Info'!$C$64=4,5,3),FALSE)+P12*VLOOKUP(C12,'Demand Savings Lookup'!$A$2:$E$51,IF('Basic Info'!$C$64=4,4,2),FALSE))))","v":0},null,null,"",{"$f":"IF(B12=0,\"\",(O12+P12)*'Reporting Summary'!$C$112+(M12+N12)*'Reporting Summary'!$C$113*10+'Water Savings'!$C$10*R12*1000)","v":""}]
[5,{"$f":"'Results from eQUEST'!K34","v":0},null,{"$f":"INDEX(ERMs!$B$5:$E$87,MATCH(A13,ERMs!$B$5:$B$87,0),4)","v":{"$error":"#N/A"}},null,null,{"$f":"INDEX(ERMs!$B$5:$E$87,MATCH(A13,ERMs!$B$5:$B$87,0),2)","v":{"$error":"#N/A"}},null,null,{"$f":"IF(C13=\"\",\"\",VLOOKUP(C13,'Demand Savings Lookup'!$A$2:$G$51,6,FALSE))","v":""},null,{"$f":"IF(C13=\"\",\"\",VLOOKUP(C13,'Demand Savings Lookup'!$A$1:$G$51,7,FALSE))","v":""},{"$f":"IF(B13=0,0,(('Results from eQUEST'!BB33+'Results from eQUEST'!BH33)/10-('Results from eQUEST'!BB34+'Results from eQUEST'!BH34)/10))","v":0},{"$f":"IF(B13=0,0,('Results from eQUEST'!BK33-'Results from eQUEST'!BK34)/10-M13)","v":0},{"$f":"IF(B13=0,0,(('Results from eQUEST'!Q33+'Results from eQUEST'!R33)-('Results from eQUEST'!Q34+'Results from eQUEST'!R34)))","v":0},{"$f":"IF(B13=0,0,'Results from eQUEST'!Y33-'Results from eQUEST'!Y34-O13)","v":0},{"$f":"IF(O13+P13<=0,0,IF(AND(O13=0,P13=0),0,IF(B13=0,0,O13*VLOOKUP(C13,'Demand Savings Lookup'!$A$2:$E$51,IF('Basic Info'!$C$64=4,5,3),FALSE)+P13*VLOOKUP(C13,'Demand Savings Lookup'!$A$2:$E$51,IF('Basic Info'!$C$64=4,4,2),FALSE))))","v":0},null,null,"",{"$f":"IF(B13=0,\"\",(O13+P13)*'Reporting Summary'!$C$112+(M13+N13)*'Reporting Summary'!$C$113*10+'Water Savings'!$C$10*R13*1000)","v":""}]
[6,{"$f":"'Results from eQUEST'!K35","v":0},null,{"$f":"INDEX(ERMs!$B$5:$E$87,MATCH(A14,ERMs!$B$5:$B$87,0),4)","v":{"$error":"#N/A"}},null,null,{"$f":"INDEX(ERMs!$B$5:$E$87,MATCH(A14,ERMs!$B$5:$B$87,0),2)","v":{"$error":"#N/A"}},null,null,{"$f":"IF(C14=\"\",\"\",VLOOKUP(C14,'Demand Savings Lookup'!$A$2:$G$51,6,FALSE))","v":""},null,{"$f":"IF(C14=\"\",\"\",VLOOKUP(C14,'Demand Savings Lookup'!$A$1:$G$51,7,FALSE))","v":""},{"$f":"IF(B14=0,0,(('Results from eQUEST'!BB34+'Results from eQUEST'!BH34)/10-('Results from eQUEST'!BB35+'Results from eQUEST'!BH35)/10))","v":0},{"$f":"IF(B14=0,0,('Results from eQUEST'!BK34-'Results from eQUEST'!BK35)/10-M14)","v":0},{"$f":"IF(B14=0,0,(('Results from eQUEST'!Q34+'Results from eQUEST'!R34)-('Results from eQUEST'!Q35+'Results from eQUEST'!R35)))","v":0},{"$f":"IF(B14=0,0,'Results from eQUEST'!Y34-'Results from eQUEST'!Y35-O14)","v":0},{"$f":"IF(O14+P14<=0,0,IF(AND(O14=0,P14=0),0,IF(B14=0,0,O14*VLOOKUP(C14,'Demand Savings Lookup'!$A$2:$E$51,IF('Basic Info'!$C$64=4,5,3),FALSE)+P14*VLOOKUP(C14,'Demand Savings Lookup'!$A$2:$E$51,IF('Basic Info'!$C$64=4,4,2),FALSE))))","v":0},null,null,"",{"$f":"IF(B14=0,\"\",(O14+P14)*'Reporting Summary'!$C$112+(M14+N14)*'Reporting Summary'!$C$113*10+'Water Savings'!$C$10*R14*1000)","v":""}]
[7,{"$f":"'Results from eQUEST'!K36","v":0},null,{"$f":"INDEX(ERMs!$B$5:$E$87,MATCH(A15,ERMs!$B$5:$B$87,0),4)","v":{"$error":"#N/A"}},null,null,{"$f":"INDEX(ERMs!$B$5:$E$87,MATCH(A15,ERMs!$B$5:$B$87,0),2)","v":{"$error":"#N/A"}},null,null,{"$f":"IF(C15=\"\",\"\",VLOOKUP(C15,'Demand Savings Lookup'!$A$2:$G$51,6,FALSE))","v":""},null,{"$f":"IF(C15=\"\",\"\",VLOOKUP(C15,'Demand Savings Lookup'!$A$1:$G$51,7,FALSE))","v":""},{"$f":"IF(B15=0,0,(('Results from eQUEST'!BB35+'Results from eQUEST'!BH35)/10-('Results from eQUEST'!BB36+'Results from eQUEST'!BH36)/10))","v":0},{"$f":"IF(B15=0,0,('Results from eQUEST'!BK35-'Results from eQUEST'!BK36)/10-M15)","v":0},{"$f":"IF(B15=0,0,(('Results from eQUEST'!Q35+'Results from eQUEST'!R35)-('Results from eQUEST'!Q36+'Results from eQUEST'!R36)))","v":0},{"$f":"IF(B15=0,0,'Results from eQUEST'!Y35-'Results from eQUEST'!Y36-O15)","v":0},{"$f":"IF(O15+P15<=0,0,IF(AND(O15=0,P15=0),0,IF(B15=0,0,O15*VLOOKUP(C15,'Demand Savings Lookup'!$A$2:$E$51,IF('Basic Info'!$C$64=4,5,3),FALSE)+P15*VLOOKUP(C15,'Demand Savings Lookup'!$A$2:$E$51,IF('Basic Info'!$C$64=4,4,2),FALSE))))","v":0},null,null,"",{"$f":"IF(B15=0,\"\",(O15+P15)*'Reporting Summary'!$C$112+(M15+N15)*'Reporting Summary'!$C$113*10+'Water Savings'!$C$10*R15*1000)","v":""}]
[8,{"$f":"'Results from eQUEST'!K37","v":0},null,{"$f":"INDEX(ERMs!$B$5:$E$87,MATCH(A16,ERMs!$B$5:$B$87,0),4)","v":{"$error":"#N/A"}},null,null,{"$f":"INDEX(ERMs!$B$5:$E$87,MATCH(A16,ERMs!$B$5:$B$87,0),2)","v":{"$error":"#N/A"}},null,null,{"$f":"IF(C16=\"\",\"\",VLOOKUP(C16,'Demand Savings Lookup'!$A$2:$G$51,6,FALSE))","v":""},null,{"$f":"IF(C16=\"\",\"\",VLOOKUP(C16,'Demand Savings Lookup'!$A$1:$G$51,7,FALSE))","v":""},{"$f":"IF(B16=0,0,(('Results from eQUEST'!BB36+'Results from eQUEST'!BH36)/10-('Results from eQUEST'!BB37+'Results from eQUEST'!BH37)/10))","v":0},{"$f":"IF(B16=0,0,('Results from eQUEST'!BK36-'Results from eQUEST'!BK37)/10-M16)","v":0},{"$f":"IF(B16=0,0,(('Results from eQUEST'!Q36+'Results from eQUEST'!R36)-('Results from eQUEST'!Q37+'Results from eQUEST'!R37)))","v":0},{"$f":"IF(B16=0,0,'Results from eQUEST'!Y36-'Results from eQUEST'!Y37-O16)","v":0},{"$f":"IF(O16+P16<=0,0,IF(AND(O16=0,P16=0),0,IF(B16=0,0,O16*VLOOKUP(C16,'Demand Savings Lookup'!$A$2:$E$51,IF('Basic Info'!$C$64=4,5,3),FALSE)+P16*VLOOKUP(C16,'Demand Savings Lookup'!$A$2:$E$51,IF('Basic Info'!$C$64=4,4,2),FALSE))))","v":0},null,null,"",{"$f":"IF(B16=0,\"\",(O16+P16)*'Reporting Summary'!$C$112+(M16+N16)*'Reporting Summary'!$C$113*10+'Water Savings'!$C$10*R16*1000)","v":""}]
[9,{"$f":"'Results from eQUEST'!K38","v":0},null,{"$f":"INDEX(ERMs!$B$5:$E$87,MATCH(A17,ERMs!$B$5:$B$87,0),4)","v":{"$error":"#N/A"}},null,null,{"$f":"INDEX(ERMs!$B$5:$E$87,MATCH(A17,ERMs!$B$5:$B$87,0),2)","v":{"$error":"#N/A"}},null,null,{"$f":"IF(C17=\"\",\"\",VLOOKUP(C17,'Demand Savings Lookup'!$A$2:$G$51,6,FALSE))","v":""},null,{"$f":"IF(C17=\"\",\"\",VLOOKUP(C17,'Demand Savings Lookup'!$A$1:$G$51,7,FALSE))","v":""},{"$f":"IF(B17=0,0,(('Results from eQUEST'!BB37+'Results from eQUEST'!BH37)/10-('Results from eQUEST'!BB38+'Results from eQUEST'!BH38)/10))","v":0},{"$f":"IF(B17=0,0,('Results from eQUEST'!BK37-'Results from eQUEST'!BK38)/10-M17)","v":0},{"$f":"IF(B17=0,0,(('Results from eQUEST'!Q37+'Results from eQUEST'!R37)-('Results from eQUEST'!Q38+'Results from eQUEST'!R38)))","v":0},{"$f":"IF(B17=0,0,'Results from eQUEST'!Y37-'Results from eQUEST'!Y38-O17)","v":0},{"$f":"IF(O17+P17<=0,0,IF(AND(O17=0,P17=0),0,IF(B17=0,0,O17*VLOOKUP(C17,'Demand Savings Lookup'!$A$2:$E$51,IF('Basic Info'!$C$64=4,5,3),FALSE)+P17*VLOOKUP(C17,'Demand Savings Lookup'!$A$2:$E$51,IF('Basic Info'!$C$64=4,4,2),FALSE))))","v":0},null,null,"",{"$f":"IF(B17=0,\"\",(O17+P17)*'Reporting Summary'!$C$112+(M17+N17)*'Reporting Summary'!$C$113*10+'Water Savings'!$C$10*R17*1000)","v":""}]
[10,{"$f":"'Results from eQUEST'!K39","v":0},null,{"$f":"INDEX(ERMs!$B$5:$E$87,MATCH(A18,ERMs!$B$5:$B$87,0),4)","v":{"$error":"#N/A"}},null,null,{"$f":"INDEX(ERMs!$B$5:$E$87,MATCH(A18,ERMs!$B$5:$B$87,0),2)","v":{"$error":"#N/A"}},null,null,{"$f":"IF(C18=\"\",\"\",VLOOKUP(C18,'Demand Savings Lookup'!$A$2:$G$51,6,FALSE))","v":""},null,{"$f":"IF(C18=\"\",\"\",VLOOKUP(C18,'Demand Savings Lookup'!$A$1:$G$51,7,FALSE))","v":""},{"$f":"IF(B18=0,0,(('Results from eQUEST'!BB38+'Results from eQUEST'!BH38)/10-('Results from eQUEST'!BB39+'Results from eQUEST'!BH39)/10))","v":0},{"$f":"IF(B18=0,0,('Results from eQUEST'!BK38-'Results from eQUEST'!BK39)/10-M18)","v":0},{"$f":"IF(B18=0,0,(('Results from eQUEST'!Q38+'Results from eQUEST'!R38)-('Results from eQUEST'!Q39+'Results from eQUEST'!R39)))","v":0},{"$f":"IF(B18=0,0,'Results from eQUEST'!Y38-'Results from eQUEST'!Y39-O18)","v":0},{"$f":"IF(O18+P18<=0,0,IF(AND(O18=0,P18=0),0,IF(B18=0,0,O18*VLOOKUP(C18,'Demand Savings Lookup'!$A$2:$E$51,IF('Basic Info'!$C$64=4,5,3),FALSE)+P18*VLOOKUP(C18,'Demand Savings Lookup'!$A$2:$E$51,IF('Basic Info'!$C$64=4,4,2),FALSE))))","v":0},null,null,"",{"$f":"IF(B18=0,\"\",(O18+P18)*'Reporting Summary'!$C$112+(M18+N18)*'Reporting Summary'!$C$113*10+'Water Savings'!$C$10*R18*1000)","v":""}]
[11,{"$f":"'Results from eQUEST'!K40","v":0},null,{"$f":"INDEX(ERMs!$B$5:$E$87,MATCH(A19,ERMs!$B$5:$B$87,0),4)","v":{"$error":"#N/A"}},null,null,{"$f":"INDEX(ERMs!$B$5:$E$87,MATCH(A19,ERMs!$B$5:$B$87,0),2)","v":{"$error":"#N/A"}},null,null,{"$f":"IF(C19=\"\",\"\",VLOOKUP(C19,'Demand Savings Lookup'!$A$2:$G$51,6,FALSE))","v":""},null,{"$f":"IF(C19=\"\",\"\",VLOOKUP(C19,'Demand Savings Lookup'!$A$1:$G$51,7,FALSE))","v":""},{"$f":"IF(B19=0,0,(('Results from eQUEST'!BB39+'Results from eQUEST'!BH39)/10-('Results from eQUEST'!BB40+'Results from eQUEST'!BH40)/10))","v":0},{"$f":"IF(B19=0,0,('Results from eQUEST'!BK39-'Results from eQUEST'!BK40)/10-M19)","v":0},{"$f":"IF(B19=0,0,(('Results from eQUEST'!Q39+'Results from eQUEST'!R39)-('Results from eQUEST'!Q40+'Results from eQUEST'!R40)))","v":0},{"$f":"IF(B19=0,0,'Results from eQUEST'!Y39-'Results from eQUEST'!Y40-O19)","v":0},{"$f":"IF(O19+P19<=0,0,IF(AND(O19=0,P19=0),0,IF(B19=0,0,O19*VLOOKUP(C19,'Demand Savings Lookup'!$A$2:$E$51,IF('Basic Info'!$C$64=4,5,3),FALSE)+P19*VLOOKUP(C19,'Demand Savings Lookup'!$A$2:$E$51,IF('Basic Info'!$C$64=4,4,2),FALSE))))","v":0},null,null,"",{"$f":"IF(B19=0,\"\",(O19+P19)*'Reporting Summary'!$C$112+(M19+N19)*'Reporting Summary'!$C$113*10+'Water Savings'!$C$10*R19*1000)","v":""}]
[12,{"$f":"'Results from eQUEST'!K41","v":0},null,{"$f":"INDEX(ERMs!$B$5:$E$87,MATCH(A20,ERMs!$B$5:$B$87,0),4)","v":{"$error":"#N/A"}},null,null,{"$f":"INDEX(ERMs!$B$5:$E$87,MATCH(A20,ERMs!$B$5:$B$87,0),2)","v":{"$error":"#N/A"}},null,null,{"$f":"IF(C20=\"\",\"\",VLOOKUP(C20,'Demand Savings Lookup'!$A$2:$G$51,6,FALSE))","v":""},null,{"$f":"IF(C20=\"\",\"\",VLOOKUP(C20,'Demand Savings Lookup'!$A$1:$G$51,7,FALSE))","v":""},{"$f":"IF(B20=0,0,(('Results from eQUEST'!BB40+'Results from eQUEST'!BH40)/10-('Results from eQUEST'!BB41+'Results from eQUEST'!BH41)/10))","v":0},{"$f":"IF(B20=0,0,('Results from eQUEST'!BK40-'Results from eQUEST'!BK41)/10-M20)","v":0},{"$f":"IF(B20=0,0,(('Results from eQUEST'!Q40+'Results from eQUEST'!R40)-('Results from eQUEST'!Q41+'Results from eQUEST'!R41)))","v":0},{"$f":"IF(B20=0,0,'Results from eQUEST'!Y40-'Results from eQUEST'!Y41-O20)","v":0},{"$f":"IF(O20+P20<=0,0,IF(AND(O20=0,P20=0),0,IF(B20=0,0,O20*VLOOKUP(C20,'Demand Savings Lookup'!$A$2:$E$51,IF('Basic Info'!$C$64=4,5,3),FALSE)+P20*VLOOKUP(C20,'Demand Savings Lookup'!$A$2:$E$51,IF('Basic Info'!$C$64=4,4,2),FALSE))))","v":0},null,null,"",{"$f":"IF(B20=0,\"\",(O20+P20)*'Reporting Summary'!$C$112+(M20+N20)*'Reporting Summary'!$C$113*10+'Water Savings'!$C$10*R20*1000)","v":""}]
[13,{"$f":"'Results from eQUEST'!K42","v":0},null,{"$f":"INDEX(ERMs!$B$5:$E$87,MATCH(A21,ERMs!$B$5:$B$87,0),4)","v":{"$error":"#N/A"}},null,null,{"$f":"INDEX(ERMs!$B$5:$E$87,MATCH(A21,ERMs!$B$5:$B$87,0),2)","v":{"$error":"#N/A"}},null,null,{"$f":"IF(C21=\"\",\"\",VLOOKUP(C21,'Demand Savings Lookup'!$A$2:$G$51,6,FALSE))","v":""},null,{"$f":"IF(C21=\"\",\"\",VLOOKUP(C21,'Demand Savings Lookup'!$A$1:$G$51,7,FALSE))","v":""},{"$f":"IF(B21=0,0,(('Results from eQUEST'!BB41+'Results from eQUEST'!BH41)/10-('Results from eQUEST'!BB42+'Results from eQUEST'!BH42)/10))","v":0},{"$f":"IF(B21=0,0,('Results from eQUEST'!BK41-'Results from eQUEST'!BK42)/10-M21)","v":0},{"$f":"IF(B21=0,0,(('Results from eQUEST'!Q41+'Results from eQUEST'!R41)-('Results from eQUEST'!Q42+'Results from eQUEST'!R42)))","v":0},{"$f":"IF(B21=0,0,'Results from eQUEST'!Y41-'Results from eQUEST'!Y42-O21)","v":0},{"$f":"IF(O21+P21<=0,0,IF(AND(O21=0,P21=0),0,IF(B21=0,0,O21*VLOOKUP(C21,'Demand Savings Lookup'!$A$2:$E$51,IF('Basic Info'!$C$64=4,5,3),FALSE)+P21*VLOOKUP(C21,'Demand Savings Lookup'!$A$2:$E$51,IF('Basic Info'!$C$64=4,4,2),FALSE))))","v":0},null,null,"",{"$f":"IF(B21=0,\"\",(O21+P21)*'Reporting Summary'!$C$112+(M21+N21)*'Reporting Summary'!$C$113*10+'Water Savings'!$C$10*R21*1000)","v":""}]
[14,{"$f":"'Results from eQUEST'!K43","v":0},null,{"$f":"INDEX(ERMs!$B$5:$E$87,MATCH(A22,ERMs!$B$5:$B$87,0),4)","v":{"$error":"#N/A"}},null,null,{"$f":"INDEX(ERMs!$B$5:$E$87,MATCH(A22,ERMs!$B$5:$B$87,0),2)","v":{"$error":"#N/A"}},null,null,{"$f":"IF(C22=\"\",\"\",VLOOKUP(C22,'Demand Savings Lookup'!$A$2:$G$51,6,FALSE))","v":""},null,{"$f":"IF(C22=\"\",\"\",VLOOKUP(C22,'Demand Savings Lookup'!$A$1:$G$51,7,FALSE))","v":""},{"$f":"IF(B22=0,0,(('Results from eQUEST'!BB42+'Results from eQUEST'!BH42)/10-('Results from eQUEST'!BB43+'Results from eQUEST'!BH43)/10))","v":0},{"$f":"IF(B22=0,0,('Results from eQUEST'!BK42-'Results from eQUEST'!BK43)/10-M22)","v":0},{"$f":"IF(B22=0,0,(('Results from eQUEST'!Q42+'Results from eQUEST'!R42)-('Results from eQUEST'!Q43+'Results from eQUEST'!R43)))","v":0},{"$f":"IF(B22=0,0,'Results from eQUEST'!Y42-'Results from eQUEST'!Y43-O22)","v":0},{"$f":"IF(O22+P22<=0,0,IF(AND(O22=0,P22=0),0,IF(B22=0,0,O22*VLOOKUP(C22,'Demand Savings Lookup'!$A$2:$E$51,IF('Basic Info'!$C$64=4,5,3),FALSE)+P22*VLOOKUP(C22,'Demand Savings Lookup'!$A$2:$E$51,IF('Basic Info'!$C$64=4,4,2),FALSE))))","v":0},null,null,"",{"$f":"IF(B22=0,\"\",(O22+P22)*'Reporting Summary'!$C$112+(M22+N22)*'Reporting Summary'!$C$113*10+'Water Savings'!$C$10*R22*1000)","v":""}]
[15,{"$f":"'Results from eQUEST'!K44","v":0},null,{"$f":"INDEX(ERMs!$B$5:$E$87,MATCH(A23,ERMs!$B$5:$B$87,0),4)","v":{"$error":"#N/A"}},null,null,{"$f":"INDEX(ERMs!$B$5:$E$87,MATCH(A23,ERMs!$B$5:$B$87,0),2)","v":{"$error":"#N/A"}},null,null,{"$f":"IF(C23=\"\",\"\",VLOOKUP(C23,'Demand Savings Lookup'!$A$2:$G$51,6,FALSE))","v":""},null,{"$f":"IF(C23=\"\",\"\",VLOOKUP(C23,'Demand Savings Lookup'!$A$1:$G$51,7,FALSE))","v":""},{"$f":"IF(B23=0,0,(('Results from eQUEST'!BB43+'Results from eQUEST'!BH43)/10-('Results from eQUEST'!BB44+'Results from eQUEST'!BH44)/10))","v":0},{"$f":"IF(B23=0,0,('Results from eQUEST'!BK43-'Results from eQUEST'!BK44)/10-M23)","v":0},{"$f":"IF(B23=0,0,(('Results from eQUEST'!Q43+'Results from eQUEST'!R43)-('Results from eQUEST'!Q44+'Results from eQUEST'!R44)))","v":0},{"$f":"IF(B23=0,0,'Results from eQUEST'!Y43-'Results from eQUEST'!Y44-O23)","v":0},{"$f":"IF(O23+P23<=0,0,IF(AND(O23=0,P23=0),0,IF(B23=0,0,O23*VLOOKUP(C23,'Demand Savings Lookup'!$A$2:$E$51,IF('Basic Info'!$C$64=4,5,3),FALSE)+P23*VLOOKUP(C23,'Demand Savings Lookup'!$A$2:$E$51,IF('Basic Info'!$C$64=4,4,2),FALSE))))","v":0},null,null,"",{"$f":"IF(B23=0,\"\",(O23+P23)*'Reporting Summary'!$C$112+(M23+N23)*'Reporting Summary'!$C$113*10+'Water Savings'!$C$10*R23*1000)","v":""}]
[16,{"$f":"'Results from eQUEST'!K45","v":0},null,{"$f":"INDEX(ERMs!$B$5:$E$87,MATCH(A24,ERMs!$B$5:$B$87,0),4)","v":{"$error":"#N/A"}},null,null,{"$f":"INDEX(ERMs!$B$5:$E$87,MATCH(A24,ERMs!$B$5:$B$87,0),2)","v":{"$error":"#N/A"}},null,null,{"$f":"IF(C24=\"\",\"\",VLOOKUP(C24,'Demand Savings Lookup'!$A$2:$G$51,6,FALSE))","v":""},null,{"$f":"IF(C24=\"\",\"\",VLOOKUP(C24,'Demand Savings Lookup'!$A$1:$G$51,7,FALSE))","v":""},{"$f":"IF(B24=0,0,(('Results from eQUEST'!BB44+'Results from eQUEST'!BH44)/10-('Results from eQUEST'!BB45+'Results from eQUEST'!BH45)/10))","v":0},{"$f":"IF(B24=0,0,('Results from eQUEST'!BK44-'Results from eQUEST'!BK45)/10-M24)","v":0},{"$f":"IF(B24=0,0,(('Results from eQUEST'!Q44+'Results from eQUEST'!R44)-('Results from eQUEST'!Q45+'Results from eQUEST'!R45)))","v":0},{"$f":"IF(B24=0,0,'Results from eQUEST'!Y44-'Results from eQUEST'!Y45-O24)","v":0},{"$f":"IF(O24+P24<=0,0,IF(AND(O24=0,P24=0),0,IF(B24=0,0,O24*VLOOKUP(C24,'Demand Savings Lookup'!$A$2:$E$51,IF('Basic Info'!$C$64=4,5,3),FALSE)+P24*VLOOKUP(C24,'Demand Savings Lookup'!$A$2:$E$51,IF('Basic Info'!$C$64=4,4,2),FALSE))))","v":0},null,null,"",{"$f":"IF(B24=0,\"\",(O24+P24)*'Reporting Summary'!$C$112+(M24+N24)*'Reporting Summary'!$C$113*10+'Water Savings'!$C$10*R24*1000)","v":""}]
[17,{"$f":"'Results from eQUEST'!K46","v":0},null,{"$f":"INDEX(ERMs!$B$5:$E$87,MATCH(A25,ERMs!$B$5:$B$87,0),4)","v":{"$error":"#N/A"}},null,null,{"$f":"INDEX(ERMs!$B$5:$E$87,MATCH(A25,ERMs!$B$5:$B$87,0),2)","v":{"$error":"#N/A"}},null,null,{"$f":"IF(C25=\"\",\"\",VLOOKUP(C25,'Demand Savings Lookup'!$A$2:$G$51,6,FALSE))","v":""},null,{"$f":"IF(C25=\"\",\"\",VLOOKUP(C25,'Demand Savings Lookup'!$A$1:$G$51,7,FALSE))","v":""},{"$f":"IF(B25=0,0,(('Results from eQUEST'!BB45+'Results from eQUEST'!BH45)/10-('Results from eQUEST'!BB46+'Results from eQUEST'!BH46)/10))","v":0},{"$f":"IF(B25=0,0,('Results from eQUEST'!BK45-'Results from eQUEST'!BK46)/10-M25)","v":0},{"$f":"IF(B25=0,0,(('Results from eQUEST'!Q45+'Results from eQUEST'!R45)-('Results from eQUEST'!Q46+'Results from eQUEST'!R46)))","v":0},{"$f":"IF(B25=0,0,'Results from eQUEST'!Y45-'Results from eQUEST'!Y46-O25)","v":0},{"$f":"IF(O25+P25<=0,0,IF(AND(O25=0,P25=0),0,IF(B25=0,0,O25*VLOOKUP(C25,'Demand Savings Lookup'!$A$2:$E$51,IF('Basic Info'!$C$64=4,5,3),FALSE)+P25*VLOOKUP(C25,'Demand Savings Lookup'!$A$2:$E$51,IF('Basic Info'!$C$64=4,4,2),FALSE))))","v":0},null,null,"",{"$f":"IF(B25=0,\"\",(O25+P25)*'Reporting Summary'!$C$112+(M25+N25)*'Reporting Summary'!$C$113*10+'Water Savings'!$C$10*R25*1000)","v":""}]
[18,{"$f":"'Results from eQUEST'!K47","v":0},null,{"$f":"INDEX(ERMs!$B$5:$E$87,MATCH(A26,ERMs!$B$5:$B$87,0),4)","v":{"$error":"#N/A"}},null,null,{"$f":"INDEX(ERMs!$B$5:$E$87,MATCH(A26,ERMs!$B$5:$B$87,0),2)","v":{"$error":"#N/A"}},null,null,{"$f":"IF(C26=\"\",\"\",VLOOKUP(C26,'Demand Savings Lookup'!$A$2:$G$51,6,FALSE))","v":""},null,{"$f":"IF(C26=\"\",\"\",VLOOKUP(C26,'Demand Savings Lookup'!$A$1:$G$51,7,FALSE))","v":""},{"$f":"IF(B26=0,0,(('Results from eQUEST'!BB46+'Results from eQUEST'!BH46)/10-('Results from eQUEST'!BB47+'Results from eQUEST'!BH47)/10))","v":0},{"$f":"IF(B26=0,0,('Results from eQUEST'!BK46-'Results from eQUEST'!BK47)/10-M26)","v":0},{"$f":"IF(B26=0,0,(('Results from eQUEST'!Q46+'Results from eQUEST'!R46)-('Results from eQUEST'!Q47+'Results from eQUEST'!R47)))","v":0},{"$f":"IF(B26=0,0,'Results from eQUEST'!Y46-'Results from eQUEST'!Y47-O26)","v":0},{"$f":"IF(O26+P26<=0,0,IF(AND(O26=0,P26=0),0,IF(B26=0,0,O26*VLOOKUP(C26,'Demand Savings Lookup'!$A$2:$E$51,IF('Basic Info'!$C$64=4,5,3),FALSE)+P26*VLOOKUP(C26,'Demand Savings Lookup'!$A$2:$E$51,IF('Basic Info'!$C$64=4,4,2),FALSE))))","v":0},null,null,"",{"$f":"IF(B26=0,\"\",(O26+P26)*'Reporting Summary'!$C$112+(M26+N26)*'Reporting Summary'!$C$113*10+'Water Savings'!$C$10*R26*1000)","v":""}]
[19,{"$f":"'Results from eQUEST'!K48","v":0},null,{"$f":"INDEX(ERMs!$B$5:$E$87,MATCH(A27,ERMs!$B$5:$B$87,0),4)","v":{"$error":"#N/A"}},null,null,{"$f":"INDEX(ERMs!$B$5:$E$87,MATCH(A27,ERMs!$B$5:$B$87,0),2)","v":{"$error":"#N/A"}},null,null,{"$f":"IF(C27=\"\",\"\",VLOOKUP(C27,'Demand Savings Lookup'!$A$2:$G$51,6,FALSE))","v":""},null,{"$f":"IF(C27=\"\",\"\",VLOOKUP(C27,'Demand Savings Lookup'!$A$1:$G$51,7,FALSE))","v":""},{"$f":"IF(B27=0,0,(('Results from eQUEST'!BB47+'Results from eQUEST'!BH47)/10-('Results from eQUEST'!BB48+'Results from eQUEST'!BH48)/10))","v":0},{"$f":"IF(B27=0,0,('Results from eQUEST'!BK47-'Results from eQUEST'!BK48)/10-M27)","v":0},{"$f":"IF(B27=0,0,(('Results from eQUEST'!Q47+'Results from eQUEST'!R47)-('Results from eQUEST'!Q48+'Results from eQUEST'!R48)))","v":0},{"$f":"IF(B27=0,0,'Results from eQUEST'!Y47-'Results from eQUEST'!Y48-O27)","v":0},{"$f":"IF(O27+P27<=0,0,IF(AND(O27=0,P27=0),0,IF(B27=0,0,O27*VLOOKUP(C27,'Demand Savings Lookup'!$A$2:$E$51,IF('Basic Info'!$C$64=4,5,3),FALSE)+P27*VLOOKUP(C27,'Demand Savings Lookup'!$A$2:$E$51,IF('Basic Info'!$C$64=4,4,2),FALSE))))","v":0},null,null,"",{"$f":"IF(B27=0,\"\",(O27+P27)*'Reporting Summary'!$C$112+(M27+N27)*'Reporting Summary'!$C$113*10+'Water Savings'!$C$10*R27*1000)","v":""}]
[20,{"$f":"'Results from eQUEST'!K49","v":0},null,{"$f":"INDEX(ERMs!$B$5:$E$87,MATCH(A28,ERMs!$B$5:$B$87,0),4)","v":{"$error":"#N/A"}},null,null,{"$f":"INDEX(ERMs!$B$5:$E$87,MATCH(A28,ERMs!$B$5:$B$87,0),2)","v":{"$error":"#N/A"}},null,null,{"$f":"IF(C28=\"\",\"\",VLOOKUP(C28,'Demand Savings Lookup'!$A$2:$G$51,6,FALSE))","v":""},null,{"$f":"IF(C28=\"\",\"\",VLOOKUP(C28,'Demand Savings Lookup'!$A$1:$G$51,7,FALSE))","v":""},{"$f":"IF(B28=0,0,(('Results from eQUEST'!BB48+'Results from eQUEST'!BH48)/10-('Results from eQUEST'!BB49+'Results from eQUEST'!BH49)/10))","v":0},{"$f":"IF(B28=0,0,('Results from eQUEST'!BK48-'Results from eQUEST'!BK49)/10-M28)","v":0},{"$f":"IF(B28=0,0,(('Results from eQUEST'!Q48+'Results from eQUEST'!R48)-('Results from eQUEST'!Q49+'Results from eQUEST'!R49)))","v":0},{"$f":"IF(B28=0,0,'Results from eQUEST'!Y48-'Results from eQUEST'!Y49-O28)","v":0},{"$f":"IF(O28+P28<=0,0,IF(AND(O28=0,P28=0),0,IF(B28=0,0,O28*VLOOKUP(C28,'Demand Savings Lookup'!$A$2:$E$51,IF('Basic Info'!$C$64=4,5,3),FALSE)+P28*VLOOKUP(C28,'Demand Savings Lookup'!$A$2:$E$51,IF('Basic Info'!$C$64=4,4,2),FALSE))))","v":0},null,null,"",{"$f":"IF(B28=0,\"\",(O28+P28)*'Reporting Summary'!$C$112+(M28+N28)*'Reporting Summary'!$C$113*10+'Water Savings'!$C$10*R28*1000)","v":""}]
[]
[null,null,null,null,null,null,null,null,null,null,null,"Totals:",{"$f":"SUM(M8:M29)","v":0},0,0,0,0,0,0,{"$f":"SUM(T8:T29)","v":0},{"$f":"SUM(U8:U29)","v":0}]
[]
[null,"Instructions"]
[null,"1. Measure Category  - Select the appropriate measure category from the drop down menu provided.  Make sure the measure corresponds to the Parametric Run that has been autofilled."]
[null,"2. Description - Provide a brief non-generic description of the measure for both Baseline Component (column D) and Proposed Component (column G).  If you complete the Model Inputs tab correctly, this will autofill."]
[null,"3. Cost and Cost Source - For Tier 1 & 2 projects, this measure-level information is optional. However, project-level costs are still required for Tiers 1& 2, so if these columns are not completed, you must hard enter the total cost into cell T30."]
[null,"4. Quantity - Provide a quantity for the proposed measure corresponding to the units automatically generated based on your measure selection.  If \"Other\" measure, enter appropriate units."]
[null,"5. Demand Savings - Enter calculated demand savings only if cell is highlighted blue."]
[null,"6. Annual Water/Sewer and O&M Savings - Enter as appropriate"]
[null,"7. Too Many Rows? Delete empty rows."]
[null,"8. Too Few Rows? Add as many rows as needed above row 29.  Then copy all formulas from above to new rows."]
[null,"Notes:"]
[null,"Use the same order as the parametric runs copied in the \"Results from eQUEST\" worksheet."]
[null,"If \"Cost Savings\" is negative, delete that row as that indicates a energy penalty and therefore should not be included in this list of energy saving measures."]
[]
[]
[null,"Partner Notes - Use this section to include any notes about the information entered above."]

{"sheet":"Simulation Summary","index":12,"n_rows":44,"n_cols":10,"rows_kept":44,"cut":false,"hidden":true,"merged":[[21,8,22,8],[5,1,5,10],[21,9,22,9],[8,3,8,9],[9,3,9,9],[10,3,10,9],[11,3,11,9],[12,3,12,9],[21,2,21,4],[21,5,21,7]]}
[null,"Instructions:"]
[1,"First fill in the Basic Info worksheet and copy results into Result Summary eQuest worksheet."]
[2,"Fill in cells highlighted with this color."]
[3,"If oil is used rather than natural gas, modifications to table are needed."]
[4,"Baseline and Proposed design fuel usage is copied from the corresponding rows in Result Summary eQuest worksheet."]
[5,"Performance rating is shown in Red Font"]
[]
[null,"Building Area Summary (conditioned spaces only)"]
[null,"Space Type","Area, SqFt","Notes"]
[null,"Residential ",{"$f":"'Basic Info'!C16","v":0},"Include total floor area of all residential units in building"]
[null,"Common Area",{"$f":"SUM('Basic Info'!C17:C22)+SUM('Basic Info'!C25:C26)","v":0},"Include combined floor area of corridors, recreation areas, lobbies, elevator shafts, etc."]
[null,"Commercial Area",{"$f":"'Basic Info'!C23+'Basic Info'!C24","v":0},"Include combined floor area of residential-associated office, retail, food sales, etc."]
[null,"Garage",{"$f":"'Basic Info'!C29","v":0},"Include floor area of residential-associated enclosed/underground garages [ventilated] "]
[null,"Total Conditioned",{"$f":"'Basic Info'!C32","v":0}]
[]
[null,"Fuel Cost"]
[null,"Electricity",{"$f":"'Basic Info'!C65","v":0.18579999999999999},"$/kWh"]
[null,"Natural Gas",{"$f":"'Basic Info'!C66","v":1.3220000000000001},"$/Therm"]
[null,"Fuel Oil",{"$f":"'Reporting Summary'!C114","v":0},"$/Gallon"]
[]
[null,"Performance Rating Calculation"]
[null,null,"Baseline",null,null,"Proposed",null,null,"Site BTU Savings, %","$ Savings, %"]
[null,null,"Fossil Fuel, Btu","Electricity, Btu","Cost, $","Fossil Fuel, Btu","Electricity, Btu","Cost, $"]
[null,"Annual Heating",{"$f":"'Reporting Summary'!C118","v":{"$error":"#DIV/0!"}},{"$f":"'Reporting Summary'!D118","v":{"$error":"#DIV/0!"}},{"$f":"C24/100000*$C$18+D24/3412*$C$17","v":{"$error":"#DIV/0!"}},{"$f":"'Reporting Summary'!G118","v":0},{"$f":"'Reporting Summary'!H118","v":0},{"$f":"F24/100000*$C$18+G24/3412*$C$17","v":0},{"$f":"IF(SUM(C24:D24)=0,0,(SUM(C24:D24)-SUM(F24:G24))/SUM(C24:D24))","v":{"$error":"#DIV/0!"}},{"$f":"IF(E24=0,0,(E24-H24)/E24)","v":{"$error":"#DIV/0!"}}]
[null,"Annual Cooling ",{"$f":"'Reporting Summary'!C119","v":{"$error":"#DIV/0!"}},{"$f":"'Reporting Summary'!D119","v":{"$error":"#DIV/0!"}},{"$error":"#DIV/0!"},{"$f":"'Reporting Summary'!G119","v":0},{"$f":"'Reporting Summary'!H119","v":0},0,{"$f":"IF(SUM(C25:D25)=0,0,(SUM(C25:D25)-SUM(F25:G25))/SUM(C25:D25))","v":{"$error":"#DIV/0!"}},{"$f":"IF(E25=0,0,(E25-H25)/E25)","v":{"$error":"#DIV/0!"}}]
[null,"Annual Lighting",{"$f":"'Reporting Summary'!C120","v":{"$error":"#DIV/0!"}},{"$f":"'Reporting Summary'!D120","v":{"$error":"#DIV/0!"}},{"$error":"#DIV/0!"},{"$f":"'Reporting Summary'!G120","v":0},{"$f":"'Reporting Summary'!H120","v":0},0,{"$error":"#DIV/0!"},{"$error":"#DIV/0!"}]
[null,"Annual Hot Water",{"$f":"'Reporting Summary'!C121","v":{"$error":"#DIV/0!"}},{"$f":"'Reporting Summary'!D121","v":{"$error":"#DIV/0!"}},{"$error":"#DIV/0!"},{"$f":"'Reporting Summary'!G121","v":0},{"$f":"'Reporting Summary'!H121","v":0},0,{"$error":"#DIV/0!"},{"$error":"#DIV/0!"}]
[null,"Annual Appliance",{"$f":"'Reporting Summary'!C122","v":{"$error":"#DIV/0!"}},{"$f":"'Reporting Summary'!D122","v":{"$error":"#DIV/0!"}},{"$error":"#DIV/0!"},{"$f":"'Reporting Summary'!G122","v":0},{"$f":"'Reporting Summary'!H122","v":0},0,{"$error":"#DIV/0!"},{"$error":"#DIV/0!"}]
[null,"Annual Fans",{"$f":"'Reporting Summary'!C123","v":{"$error":"#DIV/0!"}},{"$f":"'Reporting Summary'!D123","v":{"$error":"#DIV/0!"}},{"$error":"#DIV/0!"},{"$f":"'Reporting Summary'!G123","v":0},{"$f":"'Reporting Summary'!H123","v":0},0,{"$error":"#DIV/0!"},{"$error":"#DIV/0!"}]
[null,"Annual Pumps",{"$f":"'Reporting Summary'!C124","v":{"$error":"#DIV/0!"}},{"$f":"'Reporting Summary'!D124","v":{"$error":"#DIV/0!"}},{"$f":"C30/100000*$C$18+D30/3412*$C$17","v":{"$error":"#DIV/0!"}},{"$f":"'Reporting Summary'!G124","v":0},{"$f":"'Reporting Summary'!H124","v":0},{"$f":"F30/100000*$C$18+G30/3412*$C$17","v":0},{"$f":"IF(SUM(C30:D30)=0,0,(SUM(C30:D30)-SUM(F30:G30))/SUM(C30:D30))","v":{"$error":"#DIV/0!"}},{"$f":"IF(E30=0,0,(E30-H30)/E30)","v":{"$error":"#DIV/0!"}}]
[null,"Total",{"$f":"SUM(C24:C30)","v":{"$error":"#DIV/0!"}},{"$error":"#DIV/0!"},{"$error":"#DIV/0!"},0,0,0,{"$error":"#DIV/0!"},{"$error":"#DIV/0!"}]
[]
[null,"Energy Usage per Square Foot of Conditioned Area",null,null,null,null,null,{"$f":"F31*C18/100000/('Reporting Summary'!I27)/12","v":{"$error":"#DIV/0!"}},"average monthly gas costs per apartment"]
[null,null,null,null,null,null,null,{"$f":"G31*C17/3412/12/('Reporting Summary'!I27)","v":{"$error":"#DIV/0!"}},"average monthly electricity costs per apartment"]
[null,null,"Baseline","Proposed"]
[null,null,"Btu/SqFt","Btu/SqFt"]
[null,"Annual Heating",{"$f":"IF($C$14=0,0,SUM(C24:D24)/$C$14)","v":0},{"$f":"IF($C$14=0,0,SUM(F24:G24)/$C$14)","v":0}]
[null,"Annual Cooling ",0,0]
[null,"Annual Lighting",0,0]
[null,"Annual Hot Water",0,0]
[null,"Annual Appliance",0,0]
[null,"Annual Fans",0,0]
[null,"Annual Pumps",0,{"$f":"IF($C$14=0,0,SUM(F30:G30)/$C$14)","v":0}]
[null,"Total",{"$f":"SUM(C37:C43)","v":0},{"$f":"SUM(D37:D43)","v":0}]

{"sheet":"Results from eQUEST","index":13,"n_rows":53,"n_cols":77,"rows_kept":53,"cut":false,"hidden":false,"merged":[[18,1,18,11],[9,66,9,68],[9,71,9,76],[52,1,52,6]]}
[null,"Results from eQUEST Parms.csv file"]
["NOTE:","*To account for calculations done outside of eQuest, you can add rows after your last eQUEST parametric row with appropriate savings."]
["NOTE:","**If building uses more than one fossil fuel or uses oil instead of gas for heating, adjustments to the performance rating calculation in the Reporting Summary are needed."]
[]
["Step 1:","Open Parms.csv file that corresponds to baseline and proposed eQuest models."]
[]
["Step 2:","Baseline Design (copy runs corresponding to four exposures from <project name>-Parms.csv to row 14-17 below).  If not rotated, copy into row 14 only."]
[null,null,null,null,null,null,null,null,null,null,null,null,"Annual Lighting","Annual Lighting","Annual Appliance","Annual Heating","Annual Cooling ","Annual Cooling ","Annual Pumps","Annual Fans","Annual Appliance","Annual Heating","Annual Hot Water","Annual Lighting",null,null,null,null,null,null,null,null,null,null,null,null,null,null,null,null,null,null,null,null,null,null,null,null,null,null,"Annual Lighting","Annual Lighting","Annual Appliance","Annual Heating","Annual Cooling ","Annual Cooling ","Annual Pumps","Annual Fans","Annual Appliance","Annual Heating","Annual Hot Water","Annual Lighting",{"$f":"BK9","v":"TOTAL"}]
[null,null,null,null,null,null,null,null,null,null,null,null,"Annual Lighting","Annual Lighting","Annual Appliance","Annual Heating","Annual Cooling ","Annual Cooling ","Annual Other","Annual Other","Annual Appliance","Annual Heating","Annual Hot Water","Annual Other",null,null,null,null,null,null,null,null,null,null,null,null,null,null,null,null,null,null,null,null,null,null,null,null,null,null,"Annual Lighting","Annual Lighting","Annual Appliance","Annual Heating","Annual Cooling ","Annual Cooling ","Annual Other","Annual Other","Annual Appliance","Annual Heating","Annual Hot Water","Annual Other","TOTAL"]
[null,null,null,null,null,null,null,null,null,null,null,null,"Electric Usage:",null,null,null,null,null,null,null,null,null,null,null,null,"Non-Coincident Peak Demand:",null,null,null,null,null,null,null,null,null,null,null,"Coincident Peak Demand:",null,null,null,null,null,null,null,null,null,null,null,null,"Fuel Usage:",null,null,null,null,null,null,null,null,null,null,null,null,"Source Energy:",null,"TDV Energy:","Annual Utility Costs:",null,null,null,null,"Hours Outside Throttling Range:"]
[null,null,null,null,null,null,null,null,null,null,null,"SS-D","PS-E","PS-E","PS-E","PS-E","PS-E","PS-E","PS-E","PS-E","PS-E","PS-E","PS-E","PS-E","PS-E","PS-E","PS-E","PS-E","PS-E","PS-E","PS-E","PS-E","PS-E","PS-E","PS-E","PS-E","PS-E","PS-E","PS-E","PS-E","PS-E","PS-E","PS-E","PS-E","PS-E","PS-E","PS-E","PS-E","PS-E","PS-E","PS-E","PS-E","PS-E","PS-E","PS-E","PS-E","PS-E","PS-E","PS-E","PS-E","PS-E","PS-E","PS-E","BEPS","BEPS","TDV1","TDV1","ES-E","ES-E","ES-E","ES-E","BEPS","BEPS","SS-E",null,"BEPS","BEPS"]
[null,null,null,null,null,null,null,null,null,null,null,"Peak Cooling","Ambient","Task","Misc","Space","Space","Heat","Pumps","Ventilation","Refrig","Heat Pump","Domestic","Exterior",null,"Ambient","Task","Misc","Space","Space","Heat","Pumps","Ventilation","Refrig","Heat Pump","Domestic","Exterior","Ambient","Task","Misc","Space","Space","Heat","Pumps","Ventilation","Refrig","Heat Pump","Domestic","Exterior","Bldg","Ambient","Task","Misc","Space","Space","Heat","Pumps","Ventilation","Refrig","Heat Pump","Domestic","Exterior",null,"Bldg","Bldg","Bldg","Bldg","Total","Total","Electric","Electric","Zone Outsd","Plant Ld","Hours","Zone Outsd","Cool Loads","Heat Loads"]
[null,"Run","Internal","Case","Short","Carry","Incremental","Incremental","Date & Time",null,null,"Coil Load","Lights","Lights","Equip","Heating","Cooling","Reject","& Aux","Fans","Display","Supplement","Hot Water","Usage","Total","Lights","Lights","Equip","Heating","Cooling","Reject","& Aux","Fans","Display","Supplement","Hot Water","Usage","Lights","Lights","Equip","Heating","Cooling","Reject","& Aux","Fans","Display","Supplement","Hot Water","Usage","Total","Lights","Lights","Equip","Heating","Cooling","Reject","& Aux","Fans","Display","Supplement","Hot Water","Usage","Total","Energy","EUI","Energy","EUI","Electric","Fuel","kWh","kW","Thrtlng Rng","Not Met","Fans On","Thrtlng Rng","Not Met","Not Met"]
[null,"Type","Loads","#s","Name","Fwd","First Cost ($)","Annual Maint. ($)","of Run","File Name","Case Description","kBtu","kWh","kWh","kWh","kWh","kWh","kWh","kWh","kWh","kWh","kWh","kWh","kWh","kWh","kW","kW","kW","kW","kW","kW","kW","kW","kW","kW","kW","kW","kW","kW","kW","kW","kW","kW","kW","kW","kW","kW","kW","kW","kW","Therms","Therms","Therms","Therms","Therms","Therms","Therms","Therms","Therms","Therms","Therms","Therms","Therms","MBtu","kBtu/sf/yr","TDV-MBtu","TDV-kBtu/sf/yr","$","$","$","$","% hrs","% hrs","# hrs","# hrs","# hrs","# hrs"]
[null,null,null,null,null,null,null,null,null,null,null,null,null,null,null,null,null,null,null,null,null,null,null,null,null,null,null,null,null,null,null,null,null,null,null,null,null,null,null,null,null,null,null,null,null,null,null,null,null,null,null,null,null,null,null,null,null,null,null,null,null,null,null,null,null,null,null,null,null,null,null,0,0,8760,0]
[]
[]
[]
["Average Baseline","Average of 4 exposures (needed in Simulation Summary)",null,null,null,null,null,null,null,null,null,null,{"$f":"AVERAGE(M15:M18)","v":{"$error":"#DIV/0!"}},{"$error":"#DIV/0!"},{"$error":"#DIV/0!"},{"$error":"#DIV/0!"},{"$error":"#DIV/0!"},{"$error":"#DIV/0!"},{"$error":"#DIV/0!"},{"$error":"#DIV/0!"},{"$error":"#DIV/0!"},{"$error":"#DIV/0!"},{"$error":"#DIV/0!"},{"$error":"#DIV/0!"},{"$error":"#DIV/0!"},{"$error":"#DIV/0!"},{"$error":"#DIV/0!"},{"$error":"#DIV/0!"},{"$error":"#DIV/0!"},{"$error":"#DIV/0!"},{"$error":"#DIV/0!"},{"$error":"#DIV/0!"},{"$error":"#DIV/0!"},{"$error":"#DIV/0!"},{"$error":"#DIV/0!"},{"$error":"#DIV/0!"},{"$error":"#DIV/0!"},{"$error":"#DIV/0!"},{"$error":"#DIV/0!"},{"$error":"#DIV/0!"},{"$error":"#DIV/0!"},{"$error":"#DIV/0!"},{"$error":"#DIV/0!"},{"$error":"#DIV/0!"},{"$error":"#DIV/0!"},{"$error":"#DIV/0!"},{"$error":"#DIV/0!"},{"$error":"#DIV/0!"},{"$error":"#DIV/0!"},{"$error":"#DIV/0!"},{"$error":"#DIV/0!"},{"$error":"#DIV/0!"},{"$error":"#DIV/0!"},{"$error":"#DIV/0!"},{"$error":"#DIV/0!"},{"$error":"#DIV/0!"},{"$error":"#DIV/0!"},{"$error":"#DIV/0!"},{"$error":"#DIV/0!"},{"$error":"#DIV/0!"},{"$error":"#DIV/0!"},{"$error":"#DIV/0!"},{"$error":"#DIV/0!"},{"$error":"#DIV/0!"},{"$error":"#DIV/0!"},{"$error":"#DIV/0!"},{"$error":"#DIV/0!"},{"$error":"#DIV/0!"},{"$error":"#DIV/0!"},{"$error":"#DIV/0!"},{"$error":"#DIV/0!"},{"$f":"AVERAGE(BT15:BT18)","v":0},0,8760,0,{"$error":"#DIV/0!"},{"$error":"#DIV/0!"}]
[]
["Step 3:","Proposed Design (copy run that corresponds to proposed design from <project name>-Parms.csv to row 21 below) - this should represent your building with ALL measures included."]
[]
[]
[]
[]
["Step 4:","Energy Savings By Measure (copy runs that correspond to EACH parametric run from <project name>-Parms.csv to rows below; do not include BASELINE run). These are used to calculate savings in Detailed Measures worksheet.",null,null,null,null,null,null,null,null,null,null,null,null,null,null,null,null,null,null,null,null,null,null,null,null,null,null,null,null,null,null,null,null,null,null,null,null,null,null,null,null,null,null,null,null,null,null,null,null,null,null,null,null,null,null,null,null,null,null,null,null,null,null,null,null,null,null,null,null,null,"BEPS","BEPS","SS-E",null,"BEPS","BEPS"]
[null,null,null,null,null,null,null,null,null,null,null,"Peak Cooling","Ambient","Task","Misc","Space","Space","Heat","Pumps","Ventilation","Refrig","Heat Pump","Domestic","Exterior",null,"Ambient","Task","Misc","Space","Space","Heat","Pumps","Ventilation","Refrig","Heat Pump","Domestic","Exterior","Ambient","Task","Misc","Space","Space","Heat","Pumps","Ventilation","Refrig","Heat Pump","Domestic","Exterior","Bldg","Ambient","Task","Misc","Space","Space","Heat","Pumps","Ventilation","Refrig","Heat Pump","Domestic","Exterior",null,"Bldg","Bldg","Bldg","Bldg","Total","Total","Electric","Electric","Zone Outsd","Plant Ld","Hours","Zone Outsd","Cool Loads","Heat Loads"]
[null,"Run","Internal","Case","Short","Carry","Incremental","Incremental","Date & Time",null,null,"Coil Load","Lights","Lights","Equip","Heating","Cooling","Reject","& Aux","Fans","Display","Supplement","Hot Water","Usage","Total","Lights","Lights","Equip","Heating","Cooling","Reject","& Aux","Fans","Display","Supplement","Hot Water","Usage","Lights","Lights","Equip","Heating","Cooling","Reject","& Aux","Fans","Display","Supplement","Hot Water","Usage","Total","Lights","Lights","Equip","Heating","Cooling","Reject","& Aux","Fans","Display","Supplement","Hot Water","Usage","Total","Energy","EUI","Energy","EUI","Electric","Fuel","kWh","kW","Thrtlng Rng","Not Met","Fans On","Thrtlng Rng","Not Met","Not Met"]
[null,"Type","Loads","#s","Name","Fwd","First Cost ($)","Annual Maint.($)","of Run","File Name","Case Description","kBtu","kWh","kWh","kWh","kWh","kWh","kWh","kWh","kWh","kWh","kWh","kWh","kWh","kWh","kW","kW","kW","kW","kW","kW","kW","kW","kW","kW","kW","kW","kW","kW","kW","kW","kW","kW","kW","kW","kW","kW","kW","kW","kW","Therms","Therms","Therms","Therms","Therms","Therms","Therms","Therms","Therms","Therms","Therms","Therms","Therms","MBtu","kBtu/sf/yr","TDV-MBtu","TDV-kBtu/sf/yr","$","$","$","$","% hrs","% hrs","# hrs","# hrs","# hrs","# hrs"]
[null,null,null,null,null,null,null,null,null,null,null,null,null,null,null,null,null,null,null,null,null,null,null,null,null,null,null,null,null,null,null,null,null,null,null,null,null,null,null,null,null,null,null,null,null,null,null,null,null,null,null,null,null,null,null,null,null,null,null,null,null,null,null,null,null,null,null,null,null,null,null,0.71,0,8760,62]
[null,null,null,null,null,null,null,null,null,null,null,null,null,null,null,null,null,null,null,null,null,null,null,null,null,null,null,null,null,null,null,null,null,null,null,null,null,null,null,null,null,null,null,null,null,null,null,null,null,null,null,null,null,null,null,null,null,null,null,null,null,null,null,null,null,null,null,null,null,null,null,0.01,0,8760,1]
[null,null,null,null,null,null,null,null,null,null,null,null,null,null,null,null,null,null,null,null,null,null,null,null,null,null,null,null,null,null,null,null,null,null,null,null,null,null,null,null,null,null,null,null,null,null,null,null,null,null,null,null,null,null,null,null,null,null,null,null,null,null,null,null,null,null,null,null,null,null,null,0.01,0,8760,1]
[null,null,null,null,null,null,null,null,null,null,null,null,null,null,null,null,null,null,null,null,null,null,null,null,null,null,null,null,null,null,null,null,null,null,null,null,null,null,null,null,null,null,null,null,null,null,null,null,null,null,null,null,null,null,null,null,null,null,null,null,null,null,null,null,null,null,null,null,null,null,null,0.02,0,8760,2]
[null,null,null,null,null,null,null,null,null,null,null,null,null,null,null,null,null,null,null,null,null,null,null,null,null,null,null,null,null,null,null,null,null,null,null,null,null,null,null,null,null,null,null,null,null,null,null,null,null,null,null,null,null,null,null,null,null,null,null,null,null,null,null,null,null,null,null,null,null,null,null,0.02,0,8760,2]
[null,null,null,null,null,null,null,null,null,null,null,null,null,null,null,null,null,null,null,null,null,null,null,null,null,null,null,null,null,null,null,null,null,null,null,null,null,null,null,null,null,null,null,null,null,null,null,null,null,null,null,null,null,null,null,null,null,null,null,null,null,null,null,null,null,null,null,null,null,null,null,0.01,0,8760,1]
[null,null,null,null,null,null,null,null,null,null,null,null,null,null,null,null,null,null,null,null,null,null,null,null,null,null,null,null,null,null,null,null,null,null,null,null,null,null,null,null,null,null,null,null,null,null,null,null,null,null,null,null,null,null,null,null,null,null,null,null,null,null,null,null,null,null,null,null,null,null,null,0,0,8760,0]
[null,null,null,null,null,null,null,null,null,null,null,null,null,null,null,null,null,null,null,null,null,null,null,null,null,null,null,null,null,null,null,null,null,null,null,null,null,null,null,null,null,null,null,null,null,null,null,null,null,null,null,null,null,null,null,null,null,null,null,null,null,null,null,null,null,null,null,null,null,null,null,0,0,8760,0]
[null,null,null,null,null,null,null,null,null,null,null,null,null,null,null,null,null,null,null,null,null,null,null,null,null,null,null,null,null,null,null,null,null,null,null,null,null,null,null,null,null,null,null,null,null,null,null,null,null,null,null,null,null,null,null,null,null,null,null,null,null,null,null,null,null,null,null,null,null,null,null,0,0,8760,0]
[null,null,null,null,null,null,null,null,null,null,null,null,null,null,null,null,null,null,null,null,null,null,null,null,null,null,null,null,null,null,null,null,null,null,null,null,null,null,null,null,null,null,null,null,null,null,null,null,null,null,null,null,null,null,null,null,null,null,null,null,null,null,null,null,null,null,null,null,null,null,null,0,0,8760,0]
[null,null,null,null,null,null,null,null,null,null,null,null,null,null,null,null,null,null,null,null,null,null,null,null,null,null,null,null,null,null,null,null,null,null,null,null,null,null,null,null,null,null,null,null,null,null,null,null,null,null,null,null,null,null,null,null,null,null,null,null,null,null,null,null,null,null,null,null,null,null,null,0,0,8760,0]
[null,null,null,null,null,null,null,null,null,null,null,null,null,null,null,null,null,null,null,null,null,null,null,null,null,null,null,null,null,null,null,null,null,null,null,null,null,null,null,null,null,null,null,null,null,null,null,null,null,null,null,null,null,null,null,null,null,null,null,null,null,null,null,null,null,null,null,null,null,null,null,0,0,8760,0]
[null,null,null,null,null,null,null,null,null,null,null,null,null,null,null,null,null,null,null,null,null,null,null,null,null,null,null,null,null,null,null,null,null,null,null,null,null,null,null,null,null,null,null,null,null,null,null,null,null,null,null,null,null,null,null,null,null,null,null,null,null,null,null,null,null,null,null,null,null,null,null,0,0,8760,0]
[null,null,null,null,null,null,null,null,null,null,null,null,null,null,null,null,null,null,null,null,null,null,null,null,null,null,null,null,null,null,null,null,null,null,null,null,null,null,null,null,null,null,null,null,null,null,null,null,null,null,null,null,null,null,null,null,null,null,null,null,null,null,null,null,null,null,null,null,null,null,null,0,0,8760,0]
[]
[]
[]
[]
[]
[]
[]
[]
[]
[null,"Partner Notes - Use this section to include any notes about the information entered above."]

{"sheet":"SG Appx Intro","index":14,"n_rows":37,"n_cols":3,"rows_kept":37,"cut":false,"hidden":false,"merged":[[6,1,6,2],[3,1,4,2]]}
[null,"Simulation Guidelines Appendix"]
[null,"BPP Version 1.1 - ASHRAE 2010 - March 2017"]
[]
[null,"The following worksheets assist in calculating inputs to eQUEST and similar simulation tools.  The Interior Lighting, In-Unit Lighting and Exterior Lighting tabs are required for all projects, including Passive House projects."]
[]
[]
[null,"Note that throughout these worksheets, common information from cells are linked and should automatically update.  Only cells shaded in blue need to be entered manually. Entering values into white or orange cells will override pre-determined formulas."]
[]
[null,"Windows eQuest"]
[null,null,"For eQuest users only, this calculates the Shading Coefficient for entry into eQuest and modifies the NFRC U-factor to exclude the air-film."]
[]
[null,"DHW Demand"]
[null,null,"Enter in occupancy usage characteristic (low/medium/high) and information about the appliances that consume water in the building. You must enter data in the Basic Info and Water Savings tab, prior to this tab."]
[]
[null,"Water Savings"]
[null,null,"By entering data in blue cells only, this worksheet will calculate the water savings in gallons based on the proposed flow rates entered. This information does not affect the Performance Rating but can be used when calculating SIR to justify measures that reduce consumption of water."]
[]
[null,"Appliances"]
[null,null,"Enter data in blue cells. Values are calculated in W/SF or kWh/yr for entry into software."]
[]
[null,"Lighting Schedule"]
[null,null,"Developed for eQuest users, but can be used with other software to translate total operating hours/day into an hourly schedule that meets the requirements from the Simulation Guidelines."]
[]
[null,"Interior Lighting"]
[null,null,"Using floor plans, a lighting schedule, and lighting cut sheets, fill in the details of this worksheet. This will sum the square footages by ASHRAE space type for reporting purposes on the Basic Info tab, and calculate the lighting power density to be modeled per room. It also provides the maximum wattage allowed by ASHRAE 90.1 for that room, which can be more useful to the design team than the lighting power density. To help project compliance with program Prerequisites, zones are highlighted in red that exceed ASHRAE LPD’s by more than 20%, which reduce the energy savings of the building, as well as zones that have insufficient illumination. "]
[]
[null,"In-Unit Lighting"]
[null,null,"Enter details and counts of installed lighting fixtures in apartments only. Square footage not illuminated by these fixtures will have a default lighting power density assigned to both baseline and proposed. Installed fixtures in rooms where supplemental light will be provided by the occupant or through switched outlets, shall not be modeled as providing illumination for the entire room. Overall lighting power density is calculated on this worksheet for input into software."]
[]
[null,"Exterior Lighting"]
[null,null,"Enter details in blue cells only on exterior areas to be illuminated. The total wattage will be provided for input into the simulation software."]
[]
[null,"Infiltration&Ventilation"]
[null,null,"Although developed initially for eQuest users, the approach can be used for other simulation software if needed. "]
[]
[null,"EIR for PTAC or PTHP"]
[null,null,"Although developed initially for eQuest users, the approach can be used for other simulation software if the energy efficiency of these systems are entered in terms of EIR, rather than EER."]

{"sheet":"Windows eQuest","index":15,"n_rows":33,"n_cols":8,"rows_kept":33,"cut":false,"hidden":false,"merged":[[32,1,32,6],[24,2,24,3],[24,4,24,5],[24,6,24,7],[7,2,7,3],[7,4,7,5],[16,2,16,3],[16,4,16,5],[16,6,16,7]]}
[null,"eQUEST Calculator - Windows"]
[]
[null,"Instructions: "]
[1,"Using ASHRAE 90.1-2010 Table 5.5, enter values for your Climate Zone (reference below). "]
[2,"Enter actual NFRC values in the Proposed column."]
[3,"Use calculated values as inputs into eQuest Glass Type Properties - Basic Specifications screen."]
[]
[null,null,"Residential",null,"Non-Residential"]
[null,null,"Baseline","Proposed","Baseline","Proposed"," "]
[null,"NFRC SHGC",0.4,null,0.4]
[null,"NFRC U-value"]
[]
[null,"eQuest SC",{"$f":"C10/0.87","v":0.45977011494252878},{"$f":"IF(D10=\"\",\"\",D10/0.87)","v":""},{"$f":"E10/0.87","v":0.45977011494252878},{"$f":"IF(F10=\"\",\"\",F10/0.87)","v":""}]
[null,"eQuest Glass Conductance",{"$f":"IF(C11=\"\",\"\",1/(1/C11-0.17))","v":""},{"$f":"IF(D11=\"\",\"\",1/(1/D11-0.17))","v":""},{"$f":"IF(E11=\"\",\"\",1/(1/E11-0.17))","v":""},{"$f":"IF(F11=\"\",\"\",1/(1/F11-0.17))","v":""}]
[]
[null,"ASHRAE 90.1-2010 Table 5.5 (FOR YOUR REFERENCE)"]
[null,"Residential (In-unit)","Climate Zone 4",null,"Climate Zone 5",null,"Climate Zone 6"]
[null,null,"U-value","SHGC","U-value","SHGC","U-value","SHGC"]
[null,"Nonmetal Framing (all)",0.4,0.4,0.35,0.4,0.35,0.4]
[null,"Metal Framing (storefront)",0.5,0.4,0.45,0.4,0.45,0.4]
[null,"Metal Framing (entrance door)",0.85,0.4,0.8,0.4,0.8,0.4]
[null,"Metal Framing (all other)",0.55000000000000004,0.4,0.55000000000000004,0.4,0.55000000000000004,0.4]
[]
[]
[null,"Nonresidential (Common Areas)","Climate Zone 4",null,"Climate Zone 5",null,"Climate Zone 6"]
[null,null,"U-value","SHGC","U-value","SHGC","U-value","SHGC"]
[null,"Nonmetal Framing (all)",0.4,0.4,0.35,0.4,0.35,0.4]
[null,"Metal Framing (storefront)",0.5,0.4,0.45,0.4,0.45,0.4]
[null,"Metal Framing (entrance door)",0.85,0.4,0.8,0.4,0.8,0.4]
[null,"Metal Framing (all other)",0.55000000000000004,0.4,0.55000000000000004,0.4,0.55000000000000004,0.4]
[]
[]
[null,"Partner Notes - Use this section to include any notes about the information entered above."]

{"sheet":"DHW Demand","index":16,"n_rows":66,"n_cols":27,"rows_kept":66,"cut":false,"hidden":false,"merged":[[25,1,26,4],[65,1,65,6]]}
[null,"eQUEST Calculator - DHW Demand"]
[]
[null,"Instructions: "]
[1,"First fill in the Basic Info tabs.",null,null,null,null,null,null,null,null,null,null,null,null,null,null,null,null,null,null,null,null,null,null,null,null,"Low"]
[2,"Fill in all blue cells",null,null,null,null,null,null,null,null,null,null,null,null,null,null,null,null,null,null,null,null,null,null,null,null,"Medium"]
[3,"For proposed indirect DHW systems, refer to the Indirect DHW calculations box for further instructions.",null,null,null,null,null,null,null,null,null,null,null,null,null,null,null,null,null,null,null,null,null,null,null,null,"High"]
[4,"For all other proposed DHW systems, enter data from orange cells into eQuest."]
[null,null,null,null,null,null,"Occupancy",null,"Low/medium/high usage (see Simulation Guidelines, 3.9.2)"]
[null,null,"Proposed","Baseline",null,null,"Hot Water Usage",{"$f":"IF(H8=\"Low\",12,IF(H8=\"Medium\",25,44))","v":44},"gallons per person per day"]
[null,"Faucet gpm (weighted AVG)",{"$f":"($H$11*$H$27+$H$12*$H$28)/($H$27+$H$28)","v":{"$error":"#DIV/0!"}},{"$f":"(H27*'Water Savings'!D20+'DHW Demand'!H28*'Water Savings'!D19)/('DHW Demand'!H27+'DHW Demand'!H28)","v":{"$error":"#DIV/0!"}},null,null,"Proposed Showerhead",null,"GPM @",80,"Pressure (PSI)"]
[null,"Showerhead gpm",{"$f":"H10","v":0},{"$f":"'Water Savings'!D18","v":2.5},null,null,"Proposed Kitchen Faucet",null,"GPM @",80,"Pressure (PSI)"]
[null,"Total Gal/day (occupant only)",{"$f":"D12*(0.36+0.54*C11/2.5+0.1*C10/2.5)","v":{"$error":"#DIV/0!"}},{"$f":"H9*H25","v":0},null,null,"Proposed Bath Faucet",null,"GPM @",80,"Pressure (PSI)"]
[null,"Total Gal/day (w/both DW & CW)",{"$f":"$C$12+$K$16+K14*H22","v":{"$error":"#DIV/0!"}},{"$f":"$D$12+$K$15+K13*H22","v":0},null,null,"Baseline DW",{"$f":"IF(H20=\"Y\",1290,0)","v":0},"GAL/YR PER APT   = ",null,{"$f":"H13/365","v":0},"gallons/day-apt (1 dishwasher)"]
[null,"GPM w/ schedule shown below",{"$f":"C13/$B$63/60","v":{"$error":"#DIV/0!"}},{"$f":"D13/$B$63/60","v":0},"REDUCTIONS",null,"Proposed DW",{"$f":"IF(H20=\"N\",0,IF(H21=\"Y\",860,1290))","v":1290},"GAL/YR PER APT   = ",null,{"$f":"H14/365","v":3.5342465753424657},"gallons/day-apt (1 dishwasher)"]
[null,"GPM Low Flow Fixtures ",{"$f":"C12/B63/60","v":{"$error":"#DIV/0!"}},{"$f":"D12/B63/60","v":0},{"$f":"D15-C15","v":{"$error":"#DIV/0!"}},null,"Baseline CW",{"$f":"IF($H$31=0,0,IF($H$33=\"Common\",0.2*30943,0.2*12768))","v":0},"hot water gallons/yr  =",null,{"$f":"H15*H31/365","v":0},"Total hot water gallons/day (all clothes washers)"]
[null,"GPM for CW",{"$f":"K16/B63/60","v":0},{"$f":"K15/B63/60","v":0},{"$f":"D16-C16","v":0},null,"Proposed CW",{"$f":"IF($H$31=0,0,IF($H$32=\"N\", $H$15, IF($H$33=\"Common\",0.2*14032,0.2*5790)))","v":0},"hot water gallons/yr  =",null,{"$f":"H16*H31/365","v":0},"Total hot water gallons/day (all clothes washers)"]
[null,"GPM for DW",{"$f":"(K14*H22)/$B$63/60","v":0},{"$f":"(K13*H22)/$B$63/60","v":0},0]
[]
[null,{"$f":"IF(AND(H21=\"Y\",H32=\"Y\"),\"Is the parametric run for clothes washers modeled before the dishwashers?\",\"\")","v":""},"Y",null,null,null,null,"Dishwashers"]
[null,{"$f":"IF(H32=\"Y\",\"GPM for Clothes Washers parametric run\",\"\")","v":""},{"$f":"IF(AND(H21=\"Y\",H32=\"Y\"),IF(C19=\"Y\",(D14-E16),(D14-E17-E16)),(D14-E16))","v":0},null,null,null,null,null,"Do apartments have dishwashers?  (Y/N)"]
[null,{"$f":"IF(H21=\"Y\",\"GPM for Dishwashers parametric run\",\"\")","v":""},{"$f":"IF(AND(H21=\"Y\",H32=\"Y\"),IF(C19=\"Y\",(D14-E16-E17),(D14-E17)),(D14-E17))","v":0},null,null,null,null,null,"Are they Energy Star rated? (Y/N)"]
[null,"GPM for Low Flow Fixtures parametric run",{"$f":"MIN(C20:C21)-E15","v":{"$error":"#DIV/0!"}},null,null,null,null,null,"# of dishwashers"]
[]
[null,"Indirect DHW Calculations",null,null,null,null,null,"Low-flow faucets"]
[null,"1. Complete steps listed above.",null,null,null,null,null,{"$f":"'Basic Info'!C8+'Basic Info'!C9+2*'Basic Info'!C10+3*'Basic Info'!C11+4*'Basic Info'!C12","v":0},"# of bedrooms"]
[null,"2. These calculations are only valid if modeled in the following order: the appliance parametric runs must be modeled first, then the indirect DHW parametric run, and then finally the low-flow fixture parametric run.",null,null,null,null,null,{"$f":"SUM('Basic Info'!C8:C12)","v":0},"# of apartments"]
[null,null,null,null,null,null,null,null,"# kitchen faucets",null,null,null,"# kitchens"]
[null,"3. Data to be entered into eQuest.",null,null,null,null,null,null,"# lav faucets",null,null,null,"# lavatories (that require exhaust)"]
[]
[null,null,"MMBtu/hr","GPM",null,null,null,"Clothes Washers"]
[null,{"$f":"IF(H32=\"Y\",\"GPM for Clothes Washers parametric run\",\"\")","v":""},"n/a",{"$f":"C20","v":0},null,null,null,null,"# of clothes washers"]
[null,{"$f":"IF(H21=\"Y\",\"GPM for Dishwashers parametric run\",\"\")","v":""},"n/a",{"$f":"C21","v":0},null,null,null,null,"Are the clothes washers Energy Star rated? (Y/N/NA)"]
[null,"Process load for indirect DHW parametric run",{"$f":"D33*65*8.33*60*1*0.000001","v":0},{"$f":"MIN(D31:D32)","v":0},null,null,null,null,"washer and dryer"]
[null,"Process load for low-flow fixture parametric run",{"$f":"D34*65*8.33*60*1*0.000001","v":{"$error":"#DIV/0!"}},{"$f":"D33-E15","v":{"$error":"#DIV/0!"}}]
[null,null,null,null,null,null,null,"DHW System"]
[null,null,null,null,null,null,null,null,"DHW Storage Volume (gallons)"]
[null,null,null,null,null,null,null,null,"DHW Storage Tank radius (ft)"]
[null,"Schedule used in eQUEST model","DOE APT DHW","Proposed","Baseline",null,null,12.5,"R-value"]
[null,0.05,0,{"$f":"B39*$C$14*60","v":{"$error":"#DIV/0!"}},{"$f":"B39*$D$14*60","v":0},null,null,{"$f":"2*(22/7)*H37^2+(22/7)*2*H37*H36*0.13368/((22/7)*H37^2)","v":{"$error":"#DIV/0!"}},"Surface Area"]
[null,0.05,{"$f":"C39+1","v":1},{"$f":"B40*$C$14*60","v":{"$error":"#DIV/0!"}},{"$f":"B40*$D$14*60","v":0},null,null,{"$f":"H39/H38","v":{"$error":"#DIV/0!"}},"UA for eQuest"]
[null,0.05,{"$f":"C40+1","v":2},{"$error":"#DIV/0!"},0,null,null,null,"DHW Fuel Type"]
[null,0.05,3,{"$error":"#DIV/0!"},0,null,null,null,"Proposed Efficiency, %"]
[null,0.05,4,{"$error":"#DIV/0!"},0,null,null,{"$f":"1/(H42)","v":{"$error":"#DIV/0!"}},"Proposed HIR/EIR for eQuest"]
[null,0.05,5,{"$error":"#DIV/0!"},0,null,null,{"$f":"1/IF(H41=\"Electric\", 0.93-0.00132*H36, IF(H41=\"Gas\", 0.62-0.0019*H36,\"\" ))","v":{"$error":"#VALUE!"}},"Baseline HIR/EIR for eQuest (for in-unit storage water heaters)"]
[null,0.3,6,{"$error":"#DIV/0!"},0]
[null,0.5,7,{"$error":"#DIV/0!"},0]
[null,0.4,8,{"$error":"#DIV/0!"},0]
[null,0.3,9,{"$error":"#DIV/0!"},0]
[null,0.3,10,{"$error":"#DIV/0!"},0]
[null,0.35,11,{"$error":"#DIV/0!"},0]
[null,0.4,12,{"$error":"#DIV/0!"},0]
[null,0.35,13,{"$error":"#DIV/0!"},0]
[null,0.35,14,{"$error":"#DIV/0!"},0]
[null,0.3,15,{"$error":"#DIV/0!"},0]
[null,0.3,16,{"$error":"#DIV/0!"},0]
[null,0.5,17,{"$error":"#DIV/0!"},0]
[null,0.5,18,{"$error":"#DIV/0!"},0]
[null,0.4,19,{"$error":"#DIV/0!"},0]
[null,0.35,20,{"$error":"#DIV/0!"},0]
[null,0.45,21,{"$error":"#DIV/0!"},0]
[null,0.3,22,{"$error":"#DIV/0!"},0]
[null,0.05,{"$f":"C61+1","v":23},{"$error":"#DIV/0!"},0]
[null,{"$f":"SUM(B39:B62)","v":6.7},null,{"$f":"SUM(D39:D62)","v":{"$error":"#DIV/0!"}},{"$f":"SUM(E39:E62)","v":0}]
[]
[]
[null,"Partner Notes - Use this section to include any notes about the information entered above."]

{"sheet":"Water Savings","index":17,"n_rows":41,"n_cols":5,"rows_kept":41,"cut":false,"hidden":false,"merged":[[40,1,40,6],[4,1,4,4],[5,1,5,4],[6,1,6,4],[7,1,7,4]]}
[null,"Water Savings Calculator"]
[]
[null,"Instructions:"]
[1,"First, complete the DHW Demand tab."]
[2,"In the \"Baseline Fixture\" table, enter an estimated number of uses/day for urinals in the appropriate space.  Enter \"0\" if there are no urinals in building."]
[3,"In the \"Proposed Fixture\" table, enter the proposed toilet and urinal flow rates.  The proposed usage and pressures for the showerheads and faucets will autofill from the DHW Demand tab."]
[5,"When on-site collected graywater or rainwater is used for sewage conveyance, the total estimated annual graywater quantity may be subtracted from the total annual design case water usage. Estimated graywater quantity may not be greater than the total usage of fixtures that utilize it. For example, if graywater will be used only in flush toilets, the estimated graywater quantity cannot be greater than the total annual water used by the toilets.  Estimate graywater usage for each fixture type and enter the value in the appropriate cell."]
[6,"The remaining values will generate automatically.  Water usage savings and cost savings may be reported as indicated in the Water Savings section of the Simulation Guidelines. "]
[]
[null,"Average Price per Gallon of Water",{"$f":"IF('Basic Info'!C40<12000,0.007,0.003)","v":7.0000000000000001E-3}]
[null,"No. of Occupants",{"$f":"2*'Basic Info'!C8+2*'Basic Info'!C9+3*'Basic Info'!C10+4*'Basic Info'!C11+5*'Basic Info'!C12","v":0}]
[null,"Dishwasher Savings (Gal/yr)",{"$f":"IF('DHW Demand'!H20=\"Y\", 430*'DHW Demand'!H22, 0)","v":0}]
[null,"Clothes Washers Savings (Gal/yr)",{"$f":"('DHW Demand'!H15-'DHW Demand'!H16)*'DHW Demand'!H31","v":0}]
[]
[null,"Baseline Fixture","(Uses/Day)","Baseline Flow Rates (GPF/GPM)","Baseline Usage (Gallons/year)"]
[null,"Toilets",null,1.6,{"$f":"IF(C17=\"<Enter '0' if no urinals>\",'Drop Down'!B17*($C$11*'Drop Down'!E27)*365,'Drop Down'!B17*($C$11*'Drop Down'!E27-C17)*365)","v":0}]
[null,"Urinals",null,1,{"$f":"IF(C17=\"<Enter '0' if no urinals>\",0,C17*'Drop Down'!B18*365)","v":0}]
[null,"Showerheads",null,{"$f":"IF(A26=80,2.5,2.2)","v":2.5},{"$f":"$C$11*D18*'Drop Down'!E30*(IF('DHW Demand'!H8=\"Low\",'Drop Down'!B30,IF('DHW Demand'!H8=\"Medium\",'Drop Down'!C30,IF('DHW Demand'!H8=\"High\",'Drop Down'!D30))))*365/60","v":0}]
[null,"Bathroom Faucets",null,{"$f":"IF(A27=80,2.5,2.2)","v":2.5},{"$f":"$C$11*D19*'Drop Down'!E31*(IF('DHW Demand'!H8=\"Low\",'Drop Down'!B31,IF('DHW Demand'!H8=\"Medium\",'Drop Down'!C31,IF('DHW Demand'!H8=\"High\",'Drop Down'!D31))))*365/60","v":0}]
[null,"Kitchen Faucets",null,{"$f":"IF(A28=80,2.5,2.2)","v":2.5},{"$f":"$C$11*D20*'Drop Down'!E32*(IF('DHW Demand'!H8=\"Low\",'Drop Down'!B32,IF('DHW Demand'!H8=\"Medium\",'Drop Down'!C32,IF('DHW Demand'!H8=\"High\",'Drop Down'!D32))))*365/60","v":0}]
[null,"Total",null,null,{"$f":"SUM(E16:E20)","v":0}]
[]
["PSI","Proposed Fixture","Proposed Fixture Flow Rate (GPM/GPF)","Graywater Usage (Gallons/year)","Proposed Usage (Gallons/year)"]
[null,"Toilets",null,null,{"$f":"IF(C17=\"<Enter '0' if no urinals>\",(C24*($C$11*'Drop Down'!E27)*365)-D24,(C24*($C$11*'Drop Down'!E27-C17)*365)-D24)","v":0}]
[null,"Urinals",null,null,{"$f":"IF(C17=\"<Enter '0' if no urinals>\",0,(C25*C17*365)-D25)","v":0}]
[{"$f":"'DHW Demand'!J10","v":80},"Showerheads",{"$f":"'DHW Demand'!H10","v":0},null,{"$f":"$C$11*C26*'Drop Down'!E30*(IF('DHW Demand'!H8=\"Low\",'Drop Down'!B30,IF('DHW Demand'!H8=\"Medium\",'Drop Down'!C30,IF('DHW Demand'!H8=\"High\",'Drop Down'!D30))))*365/60-D26","v":0}]
[{"$f":"'DHW Demand'!J12","v":80},"Bathroom Faucets",{"$f":"'DHW Demand'!H12","v":0},null,{"$f":"$C$11*C27*'Drop Down'!E31*(IF('DHW Demand'!H8=\"Low\",'Drop Down'!B31,IF('DHW Demand'!H8=\"Medium\",'Drop Down'!C31,IF('DHW Demand'!H8=\"High\",'Drop Down'!D31))))*365/60-D27","v":0}]
[{"$f":"'DHW Demand'!J11","v":80},"Kitchen Faucets",{"$f":"'DHW Demand'!H11","v":0},null,{"$f":"$C$11*C28*'Drop Down'!E32*(IF('DHW Demand'!H8=\"Low\",'Drop Down'!B32,IF('DHW Demand'!H8=\"Medium\",'Drop Down'!C32,IF('DHW Demand'!H8=\"High\",'Drop Down'!D32))))*365/60-D28","v":0}]
[null,"Total",null,null,{"$f":"SUM(E24:E28)","v":0}]
[]
[null,"Savings by Fixture Type","Water Usage Savings (Gallons/year)","Cost Savings ($/year)"]
[null,"Toilets",{"$f":"E16-E24","v":0},{"$f":"C32*$C$10","v":0}]
[null,"Urinals",{"$f":"E17-E25","v":0},0]
[null,"Showerheads",{"$f":"E18-E26","v":0},0]
[null,"Bathroom Faucets",{"$f":"E19-E27","v":0},0]
[null,"Kitchen Faucets",{"$f":"E20-E28","v":0},0]
[null,"Total savings (fixtures only)",{"$f":"SUM(C32:C36)","v":0},0]
[null,"Total Savings (fixtures + appliances)",{"$f":"SUM(C32:C36,C12:C13)","v":0},0]
[]
[]
[null,"Partner Notes - Use this section to include any notes about the information entered above."]

{"sheet":"Appliances","index":18,"n_rows":65,"n_cols":23,"rows_kept":65,"cut":false,"hidden":false,"merged":[[64,1,64,6]]}
[null,"eQUEST Calculator - Appliances"]
[]
[null,"Instructions: "]
[1,"First, fill out Basic Info and DHW tabs."]
[2,"Fill in cells highlighted with this color."]
[3,"Data to be entered in eQuest as Equipment or Internal Energy Sources."]
[]
[null,null,"Proposed","Baseline","Equipment # (optional)","Sensible","Latent","Schedule"]
[null,"Refrigerator, kWh/yr-unit",423,529,null,"Heat Ratio","Heat Ratio",null,null,null,null,null,null,null,null,null,null,null,null,null,null,"Electric","In-Unit"]
[null,"Refrigerator, kWh/yr-blg",{"$f":"C9*'DHW Demand'!$H$26","v":0},{"$f":"D9*'DHW Demand'!$H$26","v":0},null,null,null,null,null,null,null,null,null,null,null,null,null,null,null,null,null,"Gas","Common"]
[null,"Refrigerator, W/SqFt",{"$f":"C10*1000/('Basic Info'!$C$16)/365/$D$62","v":{"$error":"#DIV/0!"}},{"$f":"D10*1000/('Basic Info'!$C$16)/365/$D$62","v":{"$error":"#DIV/0!"}},"Apt Equipment [#]",1,0,"T24 DAY EQP WD",null,null,null,null,"1 Stove"]
[null,"Electric Stove, kWh/yr-unit",{"$f":"IF(J12=\"Electric\", 604, IF(J12=\"Gas\", \"Enter as Internal Energy Source\", 0))","v":604},{"$f":"IF(J12=\"Electric\", 604, IF(J12=\"Gas\", \"Enter as Internal Energy Source\", 0))","v":604},null,null,null,null,null,"Electric","Stove Type",null,{"$f":"IF(J12=\"Gas\", 45, 0)","v":0},"Therms"]
[null,"Electric Stove, kWh/yr-blg",{"$f":"IF(J12=\"Electric\",C12*'DHW Demand'!$H$26,IF(J12=\"Gas\",\"2126 BTUH per Apt\",0))","v":0},{"$f":"IF(J12=\"Electric\",D12*'DHW Demand'!$H$26,IF(J12=\"Gas\",\"2126 BTUH per Apt\",0))","v":0}]
[null,"Stove, W/SqFt",{"$f":"IF(J12=\"Gas\", 0, C13*1000/('Basic Info'!$C$16)/365/$D$62)","v":{"$error":"#DIV/0!"}},{"$f":"IF(J12=\"Gas\", 0, D13*1000/('Basic Info'!$C$16)/365/$D$62)","v":{"$error":"#DIV/0!"}},"Apt Equipment [#]",{"$f":"IF(J12=\"Electric\",0.4,IF(J12=\"Gas\",0.3,0))","v":0.4},{"$f":"IF(J12=\"Electric\",0.3,IF(J12=\"Gas\",0.2,0))","v":0.3},"T24 DAY EQP WD"]
[null,"Dishwasher, kWh/yr-unit",{"$f":"IF(J15>0, 164, 0)","v":0},{"$f":"IF(J15>0, 206, 0)","v":0},null,null,null,null,null,{"$f":"'DHW Demand'!H22","v":0},"# of dishwashers"]
[null,"Dishwasher, kWh/yr-bldg",{"$f":"C15*J15","v":0},{"$f":"D15*J15","v":0}]
[null,"Dishwasher, W/SqFt",{"$f":"C16*1000/('Basic Info'!$C$16)/365/$D$62","v":{"$error":"#DIV/0!"}},{"$f":"D16*1000/('Basic Info'!$C$16)/365/$D$62","v":{"$error":"#DIV/0!"}},"Apt Equipment [#]",0.6,0.15,"T24 DAY EQP WD"]
[null,"In-Unit Clothes Washer, kWh/yr",{"$f":"IF('DHW Demand'!$H$33=\"In-Unit\", 57, 0)","v":0},{"$f":"IF('DHW Demand'!$H$33=\"In-Unit\", 81, 0)","v":0}]
[null,"In-Unit Clothes Washer, kWh/yr-bldg",{"$f":"C18*J20","v":0},{"$f":"D18*J20","v":0},null,null,null,null,null,{"$f":"IF('DHW Demand'!H33=\"Common\", 2.423, 1)","v":1},"F-factor"]
[null,"In-Unit Washer, W/SqFt",{"$f":"(C19)*1000/J24/365/$D$62","v":{"$error":"#DIV/0!"}},{"$f":"(D19)*1000/J24/365/$D$62","v":{"$error":"#DIV/0!"}},"Apt Equipment [#]",0.8,{"$f":"IF('DHW Demand'!$H$33=\"Common\", \"NA\", 0)","v":0},"T24 DAY EQP WD",null,{"$f":"'DHW Demand'!H31","v":0},"# of washers"]
[null,"In-Unit Dryer, kWh/yr-bldg",{"$f":"IF('DHW Demand'!$H$33=\"Common\",0,IF($J$23=\"Electric\",$J$22*(418+139*$J$21)*$J$19,$J$22*(38+12.7*$J$21)*$J$19))","v":{"$error":"#DIV/0!"}},{"$f":"IF('DHW Demand'!$H$33=\"Common\",0,IF($J$23=\"Electric\",$J$22*(418+139*$J$21)*$J$19,$J$22*(38+12.7*$J$21)*$J$19))","v":{"$error":"#DIV/0!"}},null,null,null,null,null,{"$f":"('Basic Info'!C8*1+'Basic Info'!C9*1+'Basic Info'!C10*2+'Basic Info'!C11*3)/SUM('Basic Info'!C8:C11)","v":{"$error":"#DIV/0!"}},"Average # bedrooms in living units",null,"1 Dryer"]
[null,"In-Unit Dryer, W/SqFt",{"$f":"(C21)*1000/(J24)/365/$D$62","v":{"$error":"#DIV/0!"}},{"$f":"(D21)*1000/(J24)/365/$D$62","v":{"$error":"#DIV/0!"}},"Apt Equipment [#]",{"$f":"IF('DHW Demand'!$H$33=\"Common\", \"NA\", IF($J$23=\"Gas\", 1, 0.15))","v":1},{"$f":"IF('DHW Demand'!$H$33=\"Common\", \"NA\", IF($J$23=\"Gas\", 0, 0.05))","v":0},"T24 DAY EQP WD",null,null,"# of dryers",null,{"$f":"IF(J23=\"Gas\", (26.5+8.8*J21)*J19, 0)","v":{"$error":"#DIV/0!"}},"Therms"]
[null,"In-Unit Dryer, BTU/h (per dryer)",{"$f":"IF('DHW Demand'!$H$33=\"In-Unit\",$M$22*100000/365/D62,0)","v":0},{"$f":"IF('DHW Demand'!$H$33=\"In-Unit\",$M$22*100000/365/D62,0)","v":0},{"$f":"IF(J23=\"Gas\",\"Internal Energy Source\", \"NA\")","v":"Internal Energy Source"},{"$f":"IF('DHW Demand'!$H$33=\"Common\",\"NA\",IF($J$23=\"Gas\",0.1,\"NA\"))","v":0.1},{"$f":"IF('DHW Demand'!$H$33=\"Common\",\"NA\",IF($J$23=\"Gas\",0.05,\"NA\"))","v":0.05},"T24 DAY EQP WD",null,"Gas","DRYER"]
[null,"Common Washer, kWh/yr-machine",138,196,null,null,null,null,null,{"$f":"'Basic Info'!C16","v":0},"sum of area of all apartments with in-unit laundry (default = total apartment sqft)"]
[null,"Common Washer, kWh/yr-bldg",{"$f":"C24*J20","v":0},{"$f":"D24*J20","v":0},null,null,null,null,null,null,"sum of area of all common laundry rooms"]
[null,"Common Washer, W/SqFt",{"$f":"(C25)*1000/J25/365/$C$62","v":{"$error":"#DIV/0!"}},{"$f":"(D25)*1000/J25/365/$C$62","v":{"$error":"#DIV/0!"}},{"$f":"\"Laundry Equipment 1\"","v":"Laundry Equipment 1"},{"$f":"IF('DHW Demand'!$H$33=\"Common\", 0.8, \"NA\")","v":"NA"},{"$f":"IF('DHW Demand'!$H$33=\"Common\", 0, \"NA\")","v":"NA"},"T24 EQP WD"]
[null,"Common Dryer, kWh/yr-bldg",{"$f":"IF('DHW Demand'!$H$33=\"In-Unit\",0,IF($J$23=\"Electric\",$J$22*(418+139*$J$21)*J19,$J$22*(38+12.7*$J$21)*J19))","v":{"$error":"#DIV/0!"}},{"$f":"IF('DHW Demand'!$H$33=\"In-Unit\",0,IF($J$23=\"Electric\",$J$22*(418+139*$J$21)*J19,$J$22*(38+12.7*$J$21)*J19))","v":{"$error":"#DIV/0!"}}]
[null,"Common Dryer, W/SqFt",{"$f":"(C27)*1000/J25/365/$C$62","v":{"$error":"#DIV/0!"}},{"$f":"(D27)*1000/J25/365/$C$62","v":{"$error":"#DIV/0!"}},{"$f":"\"Laundry Equipment 2\"","v":"Laundry Equipment 2"},{"$f":"IF('DHW Demand'!$H$33=\"In-Unit\", \"NA\", IF($J$23=\"Gas\", 1, 0.15))","v":1},{"$f":"IF('DHW Demand'!$H$33=\"In-Unit\", \"NA\", IF($J$23=\"Gas\", 0, 0.05))","v":0},"T24 EQP WD",null,{"$f":"SUM('Basic Info'!C8:C12)","v":0},"Number of Units"]
[null,"Common Dryer, BTU/h (per dryer)",{"$f":"IF('DHW Demand'!$H$33=\"In-Unit\",0, $M$22*100000/365/C62)","v":{"$error":"#DIV/0!"}},{"$f":"IF('DHW Demand'!$H$33=\"In-Unit\",0, $M$22*100000/365/C62)","v":{"$error":"#DIV/0!"}},{"$f":"IF(J23=\"Gas\",\"Internal Energy Source\", \"NA\")","v":"Internal Energy Source"},{"$f":"IF($J$23=\"Gas\", 0.1, \"NA\")","v":0.1},{"$f":"IF($J$23=\"Gas\", 0.05, \"NA\")","v":0.05},{"$f":"IF('DHW Demand'!H33=\"Common\", \"T24 EQP WD\", \"T24 DAY EQP WD\")","v":"T24 DAY EQP WD"},null,null,"Number of Stories"]
[null,"In-unit, misc. kWh/yr-SqFt (SG 3-13)",1.05,1.05,null,null,null,null,null,null,"Area of Elevator"]
[null,"In-unit misc W/SqFt ",{"$f":"C30*1000/365/$D$62","v":0.49598488427019383},{"$f":"D30*1000/365/$D$62","v":0.49598488427019383},"Apt Equipment 1",0.9,0.1,"T24 DAY EQP WD",null,{"$f":"IF(J29=0,\"\",IF(J29<7,\"Hydraulic\",IF(AND(J29>=7,J29<=20,J28>=21),\"Geared Traction\",IF(AND(J29>=21,J28>50),\"Gearless Traction\",\"ERROR\"))))","v":""},"Baseline Elevator Type"]
[null,"Corridor, restrooms & Stairs W/SqFt",0.2,0.2,"Corr & Stairs Equipment 1",1,0,"T24 EQP WD",null,null,"Proposed Elevator Type"]
[null,"Elevator W/SqFt",{"$f":"J34*1000/J30/365/$C$62","v":{"$error":"#DIV/0!"}},{"$f":"J33*1000/J30/365/$C$62","v":{"$error":"#VALUE!"}},"Elevator Equipment 1",0.1,0,"T24 EQP WD",null,{"$f":"IF(J29=\"\",\"\",IF(J31=\"Hydraulic\",IF(J28<7,1910,IF(J28<21,2150,IF(J28<51,2940,4120))),IF(J31=\"GEARED TRACTION\",IF(J28<51,3150,4550),IF(J31=\"GEARLESS TRACTION\",7570,\"ERROR\"))))","v":""},"Baseline kWh/yr for elevator"]
[null,"Office W/SqFt",1.5,1.5,"Office Equipment 1",1,0,"T24 EQP WD",null,null,"Proposed kWh/yr (same as Baseline if not requesting performance credit)"]
[null,"Other Public and Common Area W/SqFt",0.5,0.5,"Common Area Equipment 1"]
[]
[null,"Hour","Common area plug load schedule\n(Same as T24 EQP WD)","Apartment Plug load schedule (Same as T24 DAY EQP WD)"]
[null,1,0.1,0.05]
[null,2,0.1,0.05]
[null,3,0.1,0.05]
[null,4,0.1,0.05]
[null,5,0.1,0.05]
[null,6,0.3,0.05]
[null,7,0.45,0.05]
[null,8,0.45,0.05]
[null,9,0.45,0.5]
[null,10,0.45,0.5]
[null,11,0.3,0.5]
[null,12,0.3,0.5]
[null,13,0.3,0.3]
[null,14,0.3,0.5]
[null,15,0.3,0.5]
[null,16,0.3,0.5]
[null,17,0.3,0.5]
[null,18,0.3,0.5]
[null,19,0.6,0.35]
[null,20,0.8,0.05]
[null,21,0.9,0.05]
[null,22,0.8,0.05]
[null,23,0.6,0.05]
[null,24,0.3,0.05]
[null,"Total",{"$f":"SUM(C38:C61)","v":9},{"$f":"SUM(D38:D61)","v":5.799999999999998}]
[]
[]
[null,"Partner Notes - Use this section to include any notes about the information entered above."]

{"sheet":"Lighting Schedule","index":19,"n_rows":44,"n_cols":4,"rows_kept":44,"cut":false,"hidden":false,"merged":[[43,1,43,6]]}
[null,"eQUEST Calculator - Lighting"]
[]
[null,"Instructions: "]
[1,"Use this worksheet to generate schedules for lighting inputs."]
[2,"Do not edit cells highlighted in this color. These calculated values are for editing or creating schedules."]
[3,"Elevator lighting should only be assigned to ONE elevator zone."]
[4,"Exit Signs can be added as Lighting #2 (kW) in the appropriate zones."]
[5,"Credit for occupancy sensors can be applied to corridors and stairs by reducing proposed W/SF by 25% and 35% respectively."]
[]
[null,null,"Daily operating hours","hr/day"]
[null,null,"Apartments",2.34]
[null,null,"Garage, Corridors, Lobbies & Stairs",24]
[null,null,"Exterior Lighting ",12]
[]
[null,null,"APT LTG WD","Adjusted Fraction"]
[null,"Hr","Fraction","Apartments"]
[null,1,0.05,{"$f":"C17*$D$42","v":1.5496688741721854E-2}]
[null,2,0.05,1.5496688741721854E-2]
[null,3,0.05,1.5496688741721854E-2]
[null,4,0.05,1.5496688741721854E-2]
[null,5,0.05,1.5496688741721854E-2]
[null,6,0.05,1.5496688741721854E-2]
[null,7,0.25,7.7483443708609268E-2]
[null,8,0.45,0.13947019867549668]
[null,9,0.45,0.13947019867549668]
[null,10,0.35,0.10847682119205297]
[null,11,0.35,0.10847682119205297]
[null,12,0.35,0.10847682119205297]
[null,13,0.25,7.7483443708609268E-2]
[null,14,0.25,7.7483443708609268E-2]
[null,15,0.25,7.7483443708609268E-2]
[null,16,0.25,7.7483443708609268E-2]
[null,17,0.25,7.7483443708609268E-2]
[null,18,0.35,0.10847682119205297]
[null,19,0.7,0.21695364238410594]
[null,20,0.7,0.21695364238410594]
[null,21,0.7,0.21695364238410594]
[null,22,0.7,0.21695364238410594]
[null,23,0.6,0.18596026490066223]
[null,24,0.05,1.5496688741721854E-2]
[null,"Total",{"$f":"SUM(C17:C40)","v":7.55},{"$f":"SUM(D17:D40)","v":2.34}]
[null,"Apartment Adjustment",null,{"$f":"D11/C41","v":0.30993377483443707}]
[]
[null,"Partner Notes - Use this section to include any notes about the information entered above."]

{"sheet":"Interior Lighting","index":20,"n_rows":366,"n_cols":28,"rows_kept":366,"cut":false,"hidden":false,"merged":[[3,7,3,8],[365,1,365,6]]}
[null,"Calculator - Interior Lighting"]
[null,null,null,null,null,null,null,null,null,null,null,null,null,"*Enter manufacturer/model only once fixtures are specified."]
["Instructions: ",null,null,null,null,null,null,null,null,"Fixture Code","Light Source & Distribution ","Watts/Fixture","Default Lumen/Watt","Manufacturer/Model*","General Location","ENERGY STAR? (Y/N)","Notes","Quantity","Apt Qty"]
["1. Fill in cells highlighted with this color, including the Watts/fixture and Light Source in Column K&L.",null,null,null,null,null,null,"MUST BE ALPHABETICAL",null,"A",null,null,{"$f":"INDEX(Lookup!$P$9:$P$24,MATCH(K4,Lookup!$K$9:$K$24,0))","v":{"$error":"#N/A"}},null,null,null,null,{"$f":"SUMIF($G$30:$G$361, J4, $K$30:$K$361)/L4","v":{"$error":"#DIV/0!"}},{"$f":"SUMIF('In-Unit Lighting'!$E$13:$E$64, J4, 'In-Unit Lighting'!$N$13:$N$64)/L4","v":{"$error":"#DIV/0!"}}]
["2. When available, provide manufacturer, model, location, and whether ENERGY STAR qualified.",null,null,null,null,null,null,null,null,"B",null,null,{"$f":"INDEX(Lookup!$P$9:$P$24,MATCH(K5,Lookup!$K$9:$K$24,0))","v":{"$error":"#N/A"}},null,null,null,null,{"$error":"#DIV/0!"},{"$f":"SUMIF('In-Unit Lighting'!$E$13:$E$64, J5, 'In-Unit Lighting'!$N$13:$N$64)/L5","v":{"$error":"#DIV/0!"}}]
["3. List NON-APARTMENT rooms in the building that have specified lighting by FLOOR. For typical floors, indicate the floor multiplier in Column J.",null,null,null,null,null,null,null,null,"C",null,null,{"$f":"INDEX(Lookup!$P$9:$P$24,MATCH(K6,Lookup!$K$9:$K$24,0))","v":{"$error":"#N/A"}},null,null,null,null,{"$error":"#DIV/0!"},{"$f":"SUMIF('In-Unit Lighting'!$E$13:$E$64, J6, 'In-Unit Lighting'!$N$13:$N$64)/L6","v":{"$error":"#DIV/0!"}}]
["4. List square footages for all NON-APARTMENT spaces in Column B (do not assign square footages to rows for Exit Signs).",null,null,null,null,null,null,null,null,"D",null,null,{"$f":"INDEX(Lookup!$P$9:$P$24,MATCH(K7,Lookup!$K$9:$K$24,0))","v":{"$error":"#N/A"}},null,null,null,null,{"$error":"#DIV/0!"},{"$f":"SUMIF('In-Unit Lighting'!$E$13:$E$64, J7, 'In-Unit Lighting'!$N$13:$N$64)/L7","v":{"$error":"#DIV/0!"}}]
["5. Indicate how many fixtures of each type are in each room in Column F.",null,null,null,null,null,null,null,null,"E",null,null,{"$f":"INDEX(Lookup!$P$9:$P$24,MATCH(K8,Lookup!$K$9:$K$24,0))","v":{"$error":"#N/A"}},null,null,null,null,{"$error":"#DIV/0!"},{"$f":"SUMIF('In-Unit Lighting'!$E$13:$E$64, J8, 'In-Unit Lighting'!$N$13:$N$64)/L8","v":{"$error":"#DIV/0!"}}]
["6. Use drop down menu to indicate the ASHRAE space type for calculating baseline LPD's.",null,null,null,null,null,null,null,null,"F",null,null,{"$f":"INDEX(Lookup!$P$9:$P$24,MATCH(K9,Lookup!$K$9:$K$24,0))","v":{"$error":"#N/A"}},null,null,null,null,{"$error":"#DIV/0!"},{"$f":"SUMIF('In-Unit Lighting'!$E$13:$E$64, J9, 'In-Unit Lighting'!$N$13:$N$64)/L9","v":{"$error":"#DIV/0!"}}]
["7. Rooms with more than one fixture type should be entered using multiple rows; square footage should be distributed between entries.",null,null,null,null,null,null,null,null,"G",null,null,{"$f":"INDEX(Lookup!$P$9:$P$24,MATCH(K10,Lookup!$K$9:$K$24,0))","v":{"$error":"#N/A"}},null,null,null,null,{"$error":"#DIV/0!"},{"$f":"SUMIF('In-Unit Lighting'!$E$13:$E$64, J10, 'In-Unit Lighting'!$N$13:$N$64)/L10","v":{"$error":"#DIV/0!"}}]
["8. If you need more rows for your building, add them at the bottom by copying rows above (or filling down).",null,null,null,null,null,null,null,null,"H",null,null,{"$f":"INDEX(Lookup!$P$9:$P$24,MATCH(K11,Lookup!$K$9:$K$24,0))","v":{"$error":"#N/A"}},null,null,null,null,{"$error":"#DIV/0!"},{"$f":"SUMIF('In-Unit Lighting'!$E$13:$E$64, J11, 'In-Unit Lighting'!$N$13:$N$64)/L11","v":{"$error":"#DIV/0!"}}]
["9. When finished, be sure to delete any \"#N/A\" from blank rows.",null,null,null,null,null,null,null,null,"I",null,null,{"$f":"INDEX(Lookup!$P$9:$P$24,MATCH(K12,Lookup!$K$9:$K$24,0))","v":{"$error":"#N/A"}},null,null,null,null,{"$error":"#DIV/0!"},{"$f":"SUMIF('In-Unit Lighting'!$E$13:$E$64, J12, 'In-Unit Lighting'!$N$13:$N$64)/L12","v":{"$error":"#DIV/0!"}}]
["10.Red cells indicate ZONES where proposed lighting exceed ASHRAE LPD by more than 20%. While permitted, it identifies an opportunity for savings.",null,null,null,null,null,null,null,null,"J",null,null,{"$f":"INDEX(Lookup!$P$9:$P$24,MATCH(K13,Lookup!$K$9:$K$24,0))","v":{"$error":"#N/A"}},null,null,null,null,{"$error":"#DIV/0!"},{"$f":"SUMIF('In-Unit Lighting'!$E$13:$E$64, J13, 'In-Unit Lighting'!$N$13:$N$64)/L13","v":{"$error":"#DIV/0!"}}]
["11. Zones can exceed LPDs by more than 20%, but the TOTAL proposed wattage cannot exceed the TOTAL wattage in the baseline by more than 20%.",null,null,null,null,null,null,null,null,"K",null,null,{"$f":"INDEX(Lookup!$P$9:$P$24,MATCH(K14,Lookup!$K$9:$K$24,0))","v":{"$error":"#N/A"}},null,null,null,null,{"$error":"#DIV/0!"},{"$f":"SUMIF('In-Unit Lighting'!$E$13:$E$64, J14, 'In-Unit Lighting'!$N$13:$N$64)/L14","v":{"$error":"#DIV/0!"}}]
["   Note:  For Prescriptive Path projects using this tool, the TOTAL proposed wattage cannot exceed ASHRAE 90.1-2010 allowances at all.",null,null,null,null,null,null,null,null,"L",null,null,{"$f":"INDEX(Lookup!$P$9:$P$24,MATCH(K15,Lookup!$K$9:$K$24,0))","v":{"$error":"#N/A"}},null,null,null,null,{"$error":"#DIV/0!"},{"$f":"SUMIF('In-Unit Lighting'!$E$13:$E$64, J15, 'In-Unit Lighting'!$N$13:$N$64)/L15","v":{"$error":"#DIV/0!"}}]
["12. In column A, note which spaces, if any, have increased Baseline LPD by 20% due to calculated RCR exceeding Table 9.6.1 thresholds or corridors < 8ft.",null,null,null,null,null,null,null,null,"M",null,null,{"$f":"INDEX(Lookup!$P$9:$P$24,MATCH(K16,Lookup!$K$9:$K$24,0))","v":{"$error":"#N/A"}},null,null,null,null,{"$error":"#DIV/0!"},{"$f":"SUMIF('In-Unit Lighting'!$E$13:$E$64, J16, 'In-Unit Lighting'!$N$13:$N$64)/L16","v":{"$error":"#DIV/0!"}}]
["13. ASHRAE 90.10210 requires mandatory sensors in community rooms, storage rooms (50-1000ft2), stairs, garages, offices <250ft2, or restrooms.  ",null,null,null,null,null,null,null,null,"N",null,null,{"$f":"INDEX(Lookup!$P$9:$P$24,MATCH(K17,Lookup!$K$9:$K$24,0))","v":{"$error":"#N/A"}},null,null,null,null,{"$error":"#DIV/0!"},{"$f":"SUMIF('In-Unit Lighting'!$E$13:$E$64, J17, 'In-Unit Lighting'!$N$13:$N$64)/L17","v":{"$error":"#DIV/0!"}}]
["   Note:  No W/SF reduction is shown for sensors in either the baseline or proposed W/SF for these areas.",null,null,null,null,null,null,null,null,"O",null,null,{"$f":"INDEX(Lookup!$P$9:$P$24,MATCH(K18,Lookup!$K$9:$K$24,0))","v":{"$error":"#N/A"}},null,null,null,null,{"$error":"#DIV/0!"},{"$f":"SUMIF('In-Unit Lighting'!$E$13:$E$64, J18, 'In-Unit Lighting'!$N$13:$N$64)/L18","v":{"$error":"#DIV/0!"}}]
[null,null,null,null,null,null,null,null,null,"P",null,null,{"$f":"INDEX(Lookup!$P$9:$P$24,MATCH(K19,Lookup!$K$9:$K$24,0))","v":{"$error":"#N/A"}},null,null,null,null,{"$error":"#DIV/0!"},{"$f":"SUMIF('In-Unit Lighting'!$E$13:$E$64, J19, 'In-Unit Lighting'!$N$13:$N$64)/L19","v":{"$error":"#DIV/0!"}}]
[null,null,"Select calculation method:","Space-By-Space (90.1-2010)",null,null,null,null,null,"Q",null,null,{"$f":"INDEX(Lookup!$P$9:$P$24,MATCH(K20,Lookup!$K$9:$K$24,0))","v":{"$error":"#N/A"}},null,null,null,null,{"$error":"#DIV/0!"},{"$f":"SUMIF('In-Unit Lighting'!$E$13:$E$64, J20, 'In-Unit Lighting'!$N$13:$N$64)/L20","v":{"$error":"#DIV/0!"}}]
[null,null,null,null,null,null,null,null,null,"R",null,null,{"$f":"INDEX(Lookup!$P$9:$P$24,MATCH(K21,Lookup!$K$9:$K$24,0))","v":{"$error":"#N/A"}},null,null,null,null,{"$error":"#DIV/0!"},{"$f":"SUMIF('In-Unit Lighting'!$E$13:$E$64, J21, 'In-Unit Lighting'!$N$13:$N$64)/L21","v":{"$error":"#DIV/0!"}}]
[null,null,"Fixture Count","TOTAL","ENERGY STAR","> 80%?",null,null,null,"S",null,null,{"$f":"INDEX(Lookup!$P$9:$P$24,MATCH(K22,Lookup!$K$9:$K$24,0))","v":{"$error":"#N/A"}},null,null,null,null,{"$error":"#DIV/0!"},{"$f":"SUMIF('In-Unit Lighting'!$E$13:$E$64, J22, 'In-Unit Lighting'!$N$13:$N$64)/L22","v":{"$error":"#DIV/0!"}}]
[null,null,"Apartment",{"$f":"SUMIF($S$4:$S$27, \">0\", $S$4:$S$27)","v":0},{"$f":"SUMIFS($S$4:$S$27,$P$4:$P$27, \"Yes\")","v":0},{"$f":"E23/D23","v":{"$error":"#DIV/0!"}},null,null,null,"T",null,null,{"$f":"INDEX(Lookup!$P$9:$P$24,MATCH(K23,Lookup!$K$9:$K$24,0))","v":{"$error":"#N/A"}},null,null,null,null,{"$error":"#DIV/0!"},{"$f":"SUMIF('In-Unit Lighting'!$E$13:$E$64, J23, 'In-Unit Lighting'!$N$13:$N$64)/L23","v":{"$error":"#DIV/0!"}}]
[null,null,"Common Space",{"$f":"SUMIF($O$4:$O$27, C24, $R$4:$R$27)","v":0},{"$f":"SUMIFS($R$4:$R$27, $O$4:$O$27, C24, $P$4:$P$27, \"Yes\")","v":0},{"$f":"E24/D24","v":{"$error":"#DIV/0!"}},null,null,null,"U",null,null,{"$f":"INDEX(Lookup!$P$9:$P$24,MATCH(K24,Lookup!$K$9:$K$24,0))","v":{"$error":"#N/A"}},null,null,null,null,{"$error":"#DIV/0!"},{"$f":"SUMIF('In-Unit Lighting'!$E$13:$E$64, J24, 'In-Unit Lighting'!$N$13:$N$64)/L24","v":{"$error":"#DIV/0!"}}]
[null,null,null,null,null,null,null,null,null,"V",null,null,{"$f":"INDEX(Lookup!$P$9:$P$24,MATCH(K25,Lookup!$K$9:$K$24,0))","v":{"$error":"#N/A"}},null,null,null,null,{"$error":"#DIV/0!"},{"$f":"SUMIF('In-Unit Lighting'!$E$13:$E$64, J25, 'In-Unit Lighting'!$N$13:$N$64)/L25","v":{"$error":"#DIV/0!"}}]
[null,null,null,null,null,null,null,null,"If you need more rows, insert below this row >>>","W",null,null,{"$f":"INDEX(Lookup!$P$9:$P$24,MATCH(K26,Lookup!$K$9:$K$24,0))","v":{"$error":"#N/A"}},null,null,null,null,{"$error":"#DIV/0!"},{"$f":"SUMIF('In-Unit Lighting'!$E$13:$E$64, J26, 'In-Unit Lighting'!$N$13:$N$64)/L26","v":{"$error":"#DIV/0!"}}]
[null,null,"*REMEMBER: Please enter all apartment lighting in the \"In-unit Lighting\" tab, not here.",null,null,null,null,null,null,"X",null,null,{"$f":"INDEX(Lookup!$P$9:$P$24,MATCH(K27,Lookup!$K$9:$K$24,0))","v":{"$error":"#N/A"}},null,null,null,null,{"$error":"#DIV/0!"},{"$f":"SUMIF('In-Unit Lighting'!$E$13:$E$64, J27, 'In-Unit Lighting'!$N$13:$N$64)/L27","v":{"$error":"#DIV/0!"}}]
[null,null,null,null,null,null,null,null,null,{"$f":"SUM(K30:K361)","v":0},null,null,null,{"$f":"SUM(O30:O361)","v":0},null,null,null,null,{"$f":"SUM(S30:S362)","v":0}]
["90.1-2010 RCR Exception?","Square Footage","Room Name","ASHRAE Space Type","RCR \nA=1, B=4, C=7","Installed quantity","Fixture Code (A,B,C etc)","Automatic Lighting Controls?","Fixture Installed Wattage","Floor Multiplier","Total Installed Wattage","PROPOSED W/SF","PROPOSED W/SF with Sensors","BASELINE W/SF","BASELINE WATTS","TEFavg Calculated (IESNA) ","CALCULATED FOOTCANDLES","IESNA FOOTCANDLES","Total Square Footage",null,null,null,"RCR Factor",null,"Lm/W","Light Source & Distribution","LLF","Cu"]
[null,null,null,null,{"$f":"INDEX(Lookup!$I$9:$I$24,MATCH('Interior Lighting'!D30,Lookup!$C$9:$C$24,0))","v":{"$error":"#N/A"}},null,null,null,{"$f":"INDEX($L$4:$L$27,MATCH(G30,$J$4:$J$27,0))","v":{"$error":"#N/A"}},null,{"$f":"IF(F30>0, F30*I30*J30, 0)","v":0},{"$f":"IF(D30=\"Exit Signs\",\"convert to kW\", K30/S30)","v":{"$error":"#DIV/0!"}},{"$f":"IF(H30=\"Yes\",IF(D30=\"Corridor/Transition\",0.75*L30,1*L30),\"N/A\")","v":"N/A"},{"$f":"IF($D$20=\"Space-By-Space (90.1-2010)\",INDEX(LPD2010SS,MATCH('Interior Lighting'!D30,LightingSpaceType,0)*W30),INDEX(LPD2010WB,MATCH('Interior Lighting'!D30,LightingSpaceType,0)))","v":{"$error":"#N/A"}},{"$f":"IF(D30=\"Exit Signs\", 5*F30*J30, IF(B30>0, N30*S30, 0))","v":0},{"$f":"Y30*AA30*AB30","v":{"$error":"#N/A"}},{"$f":"IF(D30=\"Exit Signs\",\"NA\", K30*P30/S30)","v":{"$error":"#N/A"}},{"$f":"INDEX(Footcandles,MATCH(D30,LightingSpaceType,0))","v":{"$error":"#N/A"}},{"$f":"J30*B30","v":0},{"$f":"IF(F30>0, IF(Q30<R30, \"Insufficient lighting to meet IESNA footcandle recommendations.\", \"\"), \"\")","v":""},null,null,{"$f":"IF(A30=\"Yes\",1.2,1)","v":1},null,{"$f":"INDEX($M$4:$M$27,MATCH(G30,$J$4:$J$27,0))","v":{"$error":"#N/A"}},{"$f":"INDEX($K$4:$K$27,MATCH(G30,$J$4:$J$27,0))","v":{"$error":"#N/A"}},{"$f":"INDEX(Lookup!$O$9:$O$24,MATCH('Interior Lighting'!Z30,Lookup!$K$9:$K$24,0))","v":{"$error":"#N/A"}},{"$f":"IF(E30=\"A\",INDEX(Lookup!$L$9:$L$24,MATCH(Z30,Lookup!$K$9:$K$24,0)),IF(E30=\"B\",INDEX(Lookup!$M$9:$M$24,MATCH(Z30,Lookup!$K$9:$K$24,0)),IF(E30=\"C\",INDEX(Lookup!$N$9:$N$24,MATCH(Z30,Lookup!$K$9:$K$24,0)),\"N/A\")))","v":{"$error":"#N/A"}}]
[null,null,null,null,{"$f":"INDEX(Lookup!$I$9:$I$24,MATCH('Interior Lighting'!D31,Lookup!$C$9:$C$24,0))","v":{"$error":"#N/A"}},null,null,null,{"$f":"INDEX($L$4:$L$27,MATCH(G31,$J$4:$J$27,0))","v":{"$error":"#N/A"}},null,{"$f":"IF(F31>0, F31*I31*J31, 0)","v":0},{"$f":"IF(D31=\"Exit Signs\",\"convert to kW\", K31/S31)","v":{"$error":"#DIV/0!"}},{"$f":"IF(H31=\"Yes\",IF(D31=\"Corridor/Transition\",0.75*L31,1*L31),\"N/A\")","v":"N/A"},{"$f":"IF($D$20=\"Space-By-Space (90.1-2010)\",INDEX(LPD2010SS,MATCH('Interior Lighting'!D31,LightingSpaceType,0)*W31),INDEX(LPD2010WB,MATCH('Interior Lighting'!D31,LightingSpaceType,0)))","v":{"$error":"#N/A"}},{"$f":"IF(D31=\"Exit Signs\", 5*F31*J31, IF(B31>0, N31*S31, 0))","v":0},{"$error":"#N/A"},{"$f":"IF(D31=\"Exit Signs\",\"NA\", K31*P31/S31)","v":{"$error":"#N/A"}},{"$error":"#N/A"},0,"",null,null,1,null,{"$error":"#N/A"},{"$error":"#N/A"},{"$f":"INDEX(Lookup!$O$9:$O$24,MATCH('Interior Lighting'!Z31,Lookup!$K$9:$K$24,0))","v":{"$error":"#N/A"}},{"$f":"IF(E31=\"A\",INDEX(Lookup!$L$9:$L$24,MATCH(Z31,Lookup!$K$9:$K$24,0)),IF(E31=\"B\",INDEX(Lookup!$M$9:$M$24,MATCH(Z31,Lookup!$K$9:$K$24,0)),IF(E31=\"C\",INDEX(Lookup!$N$9:$N$24,MATCH(Z31,Lookup!$K$9:$K$24,0)),\"N/A\")))","v":{"$error":"#N/A"}}]
[null,null,null,null,{"$f":"INDEX(Lookup!$I$9:$I$24,MATCH('Interior Lighting'!D32,Lookup!$C$9:$C$24,0))","v":{"$error":"#N/A"}},null,null,null,{"$error":"#N/A"},null,0,{"$error":"#DIV/0!"},"N/A",{"$f":"IF($D$20=\"Space-By-Space (90.1-2010)\",INDEX(LPD2010SS,MATCH('Interior Lighting'!D32,LightingSpaceType,0)*W32),INDEX(LPD2010WB,MATCH('Interior Lighting'!D32,LightingSpaceType,0)))","v":{"$error":"#N/A"}},0,{"$error":"#N/A"},{"$error":"#N/A"},{"$error":"#N/A"},0,"",null,null,1,null,{"$error":"#N/A"},{"$error":"#N/A"},{"$f":"INDEX(Lookup!$O$9:$O$24,MATCH('Interior Lighting'!Z32,Lookup!$K$9:$K$24,0))","v":{"$error":"#N/A"}},{"$f":"IF(E32=\"A\",INDEX(Lookup!$L$9:$L$24,MATCH(Z32,Lookup!$K$9:$K$24,0)),IF(E32=\"B\",INDEX(Lookup!$M$9:$M$24,MATCH(Z32,Lookup!$K$9:$K$24,0)),IF(E32=\"C\",INDEX(Lookup!$N$9:$N$24,MATCH(Z32,Lookup!$K$9:$K$24,0)),\"N/A\")))","v":{"$error":"#N/A"}}]
[null,null,null,null,{"$f":"INDEX(Lookup!$I$9:$I$24,MATCH('Interior Lighting'!D33,Lookup!$C$9:$C$24,0))","v":{"$error":"#N/A"}},null,null,null,{"$error":"#N/A"},null,0,{"$error":"#DIV/0!"},"N/A",{"$f":"IF($D$20=\"Space-By-Space (90.1-2010)\",INDEX(LPD2010SS,MATCH('Interior Lighting'!D33,LightingSpaceType,0)*W33),INDEX(LPD2010WB,MATCH('Interior Lighting'!D33,LightingSpaceType,0)))","v":{"$error":"#N/A"}},0,{"$error":"#N/A"},{"$error":"#N/A"},{"$error":"#N/A"},0,"",null,null,1,null,{"$error":"#N/A"},{"$error":"#N/A"},{"$f":"INDEX(Lookup!$O$9:$O$24,MATCH('Interior Lighting'!Z33,Lookup!$K$9:$K$24,0))","v":{"$error":"#N/A"}},{"$f":"IF(E33=\"A\",INDEX(Lookup!$L$9:$L$24,MATCH(Z33,Lookup!$K$9:$K$24,0)),IF(E33=\"B\",INDEX(Lookup!$M$9:$M$24,MATCH(Z33,Lookup!$K$9:$K$24,0)),IF(E33=\"C\",INDEX(Lookup!$N$9:$N$24,MATCH(Z33,Lookup!$K$9:$K$24,0)),\"N/A\")))","v":{"$error":"#N/A"}}]
[null,null,null,null,{"$f":"INDEX(Lookup!$I$9:$I$24,MATCH('Interior Lighting'!D34,Lookup!$C$9:$C$24,0))","v":{"$error":"#N/A"}},null,null,null,{"$error":"#N/A"},null,0,{"$error":"#DIV/0!"},"N/A",{"$f":"IF($D$20=\"Space-By-Space (90.1-2010)\",INDEX(LPD2010SS,MATCH('Interior Lighting'!D34,LightingSpaceType,0)*W34),INDEX(LPD2010WB,MATCH('Interior Lighting'!D34,LightingSpaceType,0)))","v":{"$error":"#N/A"}},0,{"$error":"#N/A"},{"$error":"#N/A"},{"$error":"#N/A"},0,"",null,null,1,null,{"$error":"#N/A"},{"$error":"#N/A"},{"$f":"INDEX(Lookup!$O$9:$O$24,MATCH('Interior Lighting'!Z34,Lookup!$K$9:$K$24,0))","v":{"$error":"#N/A"}},{"$f":"IF(E34=\"A\",INDEX(Lookup!$L$9:$L$24,MATCH(Z34,Lookup!$K$9:$K$24,0)),IF(E34=\"B\",INDEX(Lookup!$M$9:$M$24,MATCH(Z34,Lookup!$K$9:$K$24,0)),IF(E34=\"C\",INDEX(Lookup!$N$9:$N$24,MATCH(Z34,Lookup!$K$9:$K$24,0)),\"N/A\")))","v":{"$error":"#N/A"}}]
[null,null,null,null,{"$f":"INDEX(Lookup!$I$9:$I$24,MATCH('Interior Lighting'!D35,Lookup!$C$9:$C$24,0))","v":{"$error":"#N/A"}},null,null,null,{"$error":"#N/A"},null,0,{"$error":"#DIV/0!"},"N/A",{"$f":"IF($D$20=\"Space-By-Space (90.1-2010)\",INDEX(LPD2010SS,MATCH('Interior Lighting'!D35,LightingSpaceType,0)*W35),INDEX(LPD2010WB,MATCH('Interior Lighting'!D35,LightingSpaceType,0)))","v":{"$error":"#N/A"}},0,{"$error":"#N/A"},{"$error":"#N/A"},{"$error":"#N/A"},0,"",null,null,1,null,{"$error":"#N/A"},{"$error":"#N/A"},{"$f":"INDEX(Lookup!$O$9:$O$24,MATCH('Interior Lighting'!Z35,Lookup!$K$9:$K$24,0))","v":{"$error":"#N/A"}},{"$f":"IF(E35=\"A\",INDEX(Lookup!$L$9:$L$24,MATCH(Z35,Lookup!$K$9:$K$24,0)),IF(E35=\"B\",INDEX(Lookup!$M$9:$M$24,MATCH(Z35,Lookup!$K$9:$K$24,0)),IF(E35=\"C\",INDEX(Lookup!$N$9:$N$24,MATCH(Z35,Lookup!$K$9:$K$24,0)),\"N/A\")))","v":{"$error":"#N/A"}}]
[null,null,null,null,{"$f":"INDEX(Lookup!$I$9:$I$24,MATCH('Interior Lighting'!D36,Lookup!$C$9:$C$24,0))","v":{"$error":"#N/A"}},null,null,null,{"$error":"#N/A"},null,0,{"$error":"#DIV/0!"},"N/A",{"$f":"IF($D$20=\"Space-By-Space (90.1-2010)\",INDEX(LPD2010SS,MATCH('Interior Lighting'!D36,LightingSpaceType,0)*W36),INDEX(LPD2010WB,MATCH('Interior Lighting'!D36,LightingSpaceType,0)))","v":{"$error":"#N/A"}},0,{"$error":"#N/A"},{"$error":"#N/A"},{"$error":"#N/A"},0,"",null,null,1,null,{"$error":"#N/A"},{"$error":"#N/A"},{"$f":"INDEX(Lookup!$O$9:$O$24,MATCH('Interior Lighting'!Z36,Lookup!$K$9:$K$24,0))","v":{"$error":"#N/A"}},{"$f":"IF(E36=\"A\",INDEX(Lookup!$L$9:$L$24,MATCH(Z36,Lookup!$K$9:$K$24,0)),IF(E36=\"B\",INDEX(Lookup!$M$9:$M$24,MATCH(Z36,Lookup!$K$9:$K$24,0)),IF(E36=\"C\",INDEX(Lookup!$N$9:$N$24,MATCH(Z36,Lookup!$K$9:$K$24,0)),\"N/A\")))","v":{"$error":"#N/A"}}]
[null,null,null,null,{"$f":"INDEX(Lookup!$I$9:$I$24,MATCH('Interior Lighting'!D37,Lookup!$C$9:$C$24,0))","v":{"$error":"#N/A"}},null,null,null,{"$error":"#N/A"},null,0,{"$error":"#DIV/0!"},"N/A",{"$f":"IF($D$20=\"Space-By-Space (90.1-2010)\",INDEX(LPD2010SS,MATCH('Interior Lighting'!D37,LightingSpaceType,0)*W37),INDEX(LPD2010WB,MATCH('Interior Lighting'!D37,LightingSpaceType,0)))","v":{"$error":"#N/A"}},0,{"$error":"#N/A"},{"$error":"#N/A"},{"$error":"#N/A"},0,"",null,null,1,null,{"$error":"#N/A"},{"$error":"#N/A"},{"$f":"INDEX(Lookup!$O$9:$O$24,MATCH('Interior Lighting'!Z37,Lookup!$K$9:$K$24,0))","v":{"$error":"#N/A"}},{"$f":"IF(E37=\"A\",INDEX(Lookup!$L$9:$L$24,MATCH(Z37,Lookup!$K$9:$K$24,0)),IF(E37=\"B\",INDEX(Lookup!$M$9:$M$24,MATCH(Z37,Lookup!$K$9:$K$24,0)),IF(E37=\"C\",INDEX(Lookup!$N$9:$N$24,MATCH(Z37,Lookup!$K$9:$K$24,0)),\"N/A\")))","v":{"$error":"#N/A"}}]
[null,null,null,null,{"$f":"INDEX(Lookup!$I$9:$I$24,MATCH('Interior Lighting'!D38,Lookup!$C$9:$C$24,0))","v":{"$error":"#N/A"}},null,null,null,{"$error":"#N/A"},null,0,{"$error":"#DIV/0!"},"N/A",{"$f":"IF($D$20=\"Space-By-Space (90.1-2010)\",INDEX(LPD2010SS,MATCH('Interior Lighting'!D38,LightingSpaceType,0)*W38),INDEX(LPD2010WB,MATCH('Interior Lighting'!D38,LightingSpaceType,0)))","v":{"$error":"#N/A"}},0,{"$error":"#N/A"},{"$error":"#N/A"},{"$error":"#N/A"},0,"",null,null,1,null,{"$error":"#N/A"},{"$error":"#N/A"},{"$f":"INDEX(Lookup!$O$9:$O$24,MATCH('Interior Lighting'!Z38,Lookup!$K$9:$K$24,0))","v":{"$error":"#N/A"}},{"$f":"IF(E38=\"A\",INDEX(Lookup!$L$9:$L$24,MATCH(Z38,Lookup!$K$9:$K$24,0)),IF(E38=\"B\",INDEX(Lookup!$M$9:$M$24,MATCH(Z38,Lookup!$K$9:$K$24,0)),IF(E38=\"C\",INDEX(Lookup!$N$9:$N$24,MATCH(Z38,Lookup!$K$9:$K$24,0)),\"N/A\")))","v":{"$error":"#N/A"}}]
[null,null,null,null,{"$f":"INDEX(Lookup!$I$9:$I$24,MATCH('Interior Lighting'!D39,Lookup!$C$9:$C$24,0))","v":{"$error":"#N/A"}},null,null,null,{"$error":"#N/A"},null,0,{"$error":"#DIV/0!"},"N/A",{"$f":"IF($D$20=\"Space-By-Space (90.1-2010)\",INDEX(LPD2010SS,MATCH('Interior Lighting'!D39,LightingSpaceType,0)*W39),INDEX(LPD2010WB,MATCH('Interior Lighting'!D39,LightingSpaceType,0)))","v":{"$error":"#N/A"}},0,{"$error":"#N/A"},{"$error":"#N/A"},{"$error":"#N/A"},0,"",null,null,1,null,{"$error":"#N/A"},{"$error":"#N/A"},{"$f":"INDEX(Lookup!$O$9:$O$24,MATCH('Interior Lighting'!Z39,Lookup!$K$9:$K$24,0))","v":{"$error":"#N/A"}},{"$f":"IF(E39=\"A\",INDEX(Lookup!$L$9:$L$24,MATCH(Z39,Lookup!$K$9:$K$24,0)),IF(E39=\"B\",INDEX(Lookup!$M$9:$M$24,MATCH(Z39,Lookup!$K$9:$K$24,0)),IF(E39=\"C\",INDEX(Lookup!$N$9:$N$24,MATCH(Z39,Lookup!$K$9:$K$24,0)),\"N/A\")))","v":{"$error":"#N/A"}}]
[null,null,null,null,{"$f":"INDEX(Lookup!$I$9:$I$24,MATCH('Interior Lighting'!D40,Lookup!$C$9:$C$24,0))","v":{"$error":"#N/A"}},null,null,null,{"$error":"#N/A"},null,0,{"$error":"#DIV/0!"},"N/A",{"$f":"IF($D$20=\"Space-By-Space (90.1-2010)\",INDEX(LPD2010SS,MATCH('Interior Lighting'!D40,LightingSpaceType,0)*W40),INDEX(LPD2010WB,MATCH('Interior Lighting'!D40,LightingSpaceType,0)))","v":{"$error":"#N/A"}},0,{"$error":"#N/A"},{"$error":"#N/A"},{"$error":"#N/A"},0,"",null,null,1,null,{"$error":"#N/A"},{"$error":"#N/A"},{"$f":"INDEX(Lookup!$O$9:$O$24,MATCH('Interior Lighting'!Z40,Lookup!$K$9:$K$24,0))","v":{"$error":"#N/A"}},{"$f":"IF(E40=\"A\",INDEX(Lookup!$L$9:$L$24,MATCH(Z40,Lookup!$K$9:$K$24,0)),IF(E40=\"B\",INDEX(Lookup!$M$9:$M$24,MATCH(Z40,Lookup!$K$9:$K$24,0)),IF(E40=\"C\",INDEX(Lookup!$N$9:$N$24,MATCH(Z40,Lookup!$K$9:$K$24,0)),\"N/A\")))","v":{"$error":"#N/A"}}]
[null,null,null,null,{"$f":"INDEX(Lookup!$I$9:$I$24,MATCH('Interior Lighting'!D41,Lookup!$C$9:$C$24,0))","v":{"$error":"#N/A"}},null,null,null,{"$error":"#N/A"},null,0,{"$error":"#DIV/0!"},"N/A",{"$f":"IF($D$20=\"Space-By-Space (90.1-2010)\",INDEX(LPD2010SS,MATCH('Interior Lighting'!D41,LightingSpaceType,0)*W41),INDEX(LPD2010WB,MATCH('Interior Lighting'!D41,LightingSpaceType,0)))","v":{"$error":"#N/A"}},0,{"$error":"#N/A"},{"$error":"#N/A"},{"$error":"#N/A"},0,"",null,null,1,null,{"$error":"#N/A"},{"$error":"#N/A"},{"$f":"INDEX(Lookup!$O$9:$O$24,MATCH('Interior Lighting'!Z41,Lookup!$K$9:$K$24,0))","v":{"$error":"#N/A"}},{"$f":"IF(E41=\"A\",INDEX(Lookup!$L$9:$L$24,MATCH(Z41,Lookup!$K$9:$K$24,0)),IF(E41=\"B\",INDEX(Lookup!$M$9:$M$24,MATCH(Z41,Lookup!$K$9:$K$24,0)),IF(E41=\"C\",INDEX(Lookup!$N$9:$N$24,MATCH(Z41,Lookup!$K$9:$K$24,0)),\"N/A\")))","v":{"$error":"#N/A"}}]
[null,null,null,null,{"$f":"INDEX(Lookup!$I$9:$I$24,MATCH('Interior Lighting'!D42,Lookup!$C$9:$C$24,0))","v":{"$error":"#N/A"}},null,null,null,{"$error":"#N/A"},null,0,{"$error":"#DIV/0!"},"N/A",{"$f":"IF($D$20=\"Space-By-Space (90.1-2010)\",INDEX(LPD2010SS,MATCH('Interior Lighting'!D42,LightingSpaceType,0)*W42),INDEX(LPD2010WB,MATCH('Interior Lighting'!D42,LightingSpaceType,0)))","v":{"$error":"#N/A"}},0,{"$error":"#N/A"},{"$error":"#N/A"},{"$error":"#N/A"},0,"",null,null,1,null,{"$error":"#N/A"},{"$error":"#N/A"},{"$f":"INDEX(Lookup!$O$9:$O$24,MATCH('Interior Lighting'!Z42,Lookup!$K$9:$K$24,0))","v":{"$error":"#N/A"}},{"$f":"IF(E42=\"A\",INDEX(Lookup!$L$9:$L$24,MATCH(Z42,Lookup!$K$9:$K$24,0)),IF(E42=\"B\",INDEX(Lookup!$M$9:$M$24,MATCH(Z42,Lookup!$K$9:$K$24,0)),IF(E42=\"C\",INDEX(Lookup!$N$9:$N$24,MATCH(Z42,Lookup!$K$9:$K$24,0)),\"N/A\")))","v":{"$error":"#N/A"}}]
[null,null,null,null,{"$f":"INDEX(Lookup!$I$9:$I$24,MATCH('Interior Lighting'!D43,Lookup!$C$9:$C$24,0))","v":{"$error":"#N/A"}},null,null,null,{"$error":"#N/A"},null,0,{"$error":"#DIV/0!"},"N/A",{"$f":"IF($D$20=\"Space-By-Space (90.1-2010)\",INDEX(LPD2010SS,MATCH('Interior Lighting'!D43,LightingSpaceType,0)*W43),INDEX(LPD2010WB,MATCH('Interior Lighting'!D43,LightingSpaceType,0)))","v":{"$error":"#N/A"}},0,{"$error":"#N/A"},{"$error":"#N/A"},{"$error":"#N/A"},0,"",null,null,1,null,{"$error":"#N/A"},{"$error":"#N/A"},{"$f":"INDEX(Lookup!$O$9:$O$24,MATCH('Interior Lighting'!Z43,Lookup!$K$9:$K$24,0))","v":{"$error":"#N/A"}},{"$f":"IF(E43=\"A\",INDEX(Lookup!$L$9:$L$24,MATCH(Z43,Lookup!$K$9:$K$24,0)),IF(E43=\"B\",INDEX(Lookup!$M$9:$M$24,MATCH(Z43,Lookup!$K$9:$K$24,0)),IF(E43=\"C\",INDEX(Lookup!$N$9:$N$24,MATCH(Z43,Lookup!$K$9:$K$24,0)),\"N/A\")))","v":{"$error":"#N/A"}}]
[null,null,null,null,{"$f":"INDEX(Lookup!$I$9:$I$24,MATCH('Interior Lighting'!D44,Lookup!$C$9:$C$24,0))","v":{"$error":"#N/A"}},null,null,null,{"$error":"#N/A"},null,0,{"$error":"#DIV/0!"},"N/A",{"$f":"IF($D$20=\"Space-By-Space (90.1-2010)\",INDEX(LPD2010SS,MATCH('Interior Lighting'!D44,LightingSpaceType,0)*W44),INDEX(LPD2010WB,MATCH('Interior Lighting'!D44,LightingSpaceType,0)))","v":{"$error":"#N/A"}},0,{"$error":"#N/A"},{"$error":"#N/A"},{"$error":"#N/A"},0,"",null,null,1,null,{"$error":"#N/A"},{"$error":"#N/A"},{"$f":"INDEX(Lookup!$O$9:$O$24,MATCH('Interior Lighting'!Z44,Lookup!$K$9:$K$24,0))","v":{"$error":"#N/A"}},{"$f":"IF(E44=\"A\",INDEX(Lookup!$L$9:$L$24,MATCH(Z44,Lookup!$K$9:$K$24,0)),IF(E44=\"B\",INDEX(Lookup!$M$9:$M$24,MATCH(Z44,Lookup!$K$9:$K$24,0)),IF(E44=\"C\",INDEX(Lookup!$N$9:$N$24,MATCH(Z44,Lookup!$K$9:$K$24,0)),\"N/A\")))","v":{"$error":"#N/A"}}]
[null,null,null,null,{"$f":"INDEX(Lookup!$I$9:$I$24,MATCH('Interior Lighting'!D45,Lookup!$C$9:$C$24,0))","v":{"$error":"#N/A"}},null,null,null,{"$error":"#N/A"},null,0,{"$error":"#DIV/0!"},"N/A",{"$f":"IF($D$20=\"Space-By-Space (90.1-2010)\",INDEX(LPD2010SS,MATCH('Interior Lighting'!D45,LightingSpaceType,0)*W45),INDEX(LPD2010WB,MATCH('Interior Lighting'!D45,LightingSpaceType,0)))","v":{"$error":"#N/A"}},0,{"$error":"#N/A"},{"$error":"#N/A"},{"$error":"#N/A"},0,"",null,null,1,null,{"$error":"#N/A"},{"$error":"#N/A"},{"$f":"INDEX(Lookup!$O$9:$O$24,MATCH('Interior Lighting'!Z45,Lookup!$K$9:$K$24,0))","v":{"$error":"#N/A"}},{"$f":"IF(E45=\"A\",INDEX(Lookup!$L$9:$L$24,MATCH(Z45,Lookup!$K$9:$K$24,0)),IF(E45=\"B\",INDEX(Lookup!$M$9:$M$24,MATCH(Z45,Lookup!$K$9:$K$24,0)),IF(E45=\"C\",INDEX(Lookup!$N$9:$N$24,MATCH(Z45,Lookup!$K$9:$K$24,0)),\"N/A\")))","v":{"$error":"#N/A"}}]
[null,null,null,null,{"$f":"INDEX(Lookup!$I$9:$I$24,MATCH('Interior Lighting'!D46,Lookup!$C$9:$C$24,0))","v":{"$error":"#N/A"}},null,null,null,{"$error":"#N/A"},null,0,{"$error":"#DIV/0!"},"N/A",{"$f":"IF($D$20=\"Space-By-Space (90.1-2010)\",INDEX(LPD2010SS,MATCH('Interior Lighting'!D46,LightingSpaceType,0)*W46),INDEX(LPD2010WB,MATCH('Interior Lighting'!D46,LightingSpaceType,0)))","v":{"$error":"#N/A"}},0,{"$error":"#N/A"},{"$error":"#N/A"},{"$error":"#N/A"},0,"",null,null,1,null,{"$error":"#N/A"},{"$error":"#N/A"},{"$f":"INDEX(Lookup!$O$9:$O$24,MATCH('Interior Lighting'!Z46,Lookup!$K$9:$K$24,0))","v":{"$error":"#N/A"}},{"$f":"IF(E46=\"A\",INDEX(Lookup!$L$9:$L$24,MATCH(Z46,Lookup!$K$9:$K$24,0)),IF(E46=\"B\",INDEX(Lookup!$M$9:$M$24,MATCH(Z46,Lookup!$K$9:$K$24,0)),IF(E46=\"C\",INDEX(Lookup!$N$9:$N$24,MATCH(Z46,Lookup!$K$9:$K$24,0)),\"N/A\")))","v":{"$error":"#N/A"}}]
[null,null,null,null,{"$f":"INDEX(Lookup!$I$9:$I$24,MATCH('Interior Lighting'!D47,Lookup!$C$9:$C$24,0))","v":{"$error":"#N/A"}},null,null,null,{"$error":"#N/A"},null,0,{"$error":"#DIV/0!"},"N/A",{"$f":"IF($D$20=\"Space-By-Space (90.1-2010)\",INDEX(LPD2010SS,MATCH('Interior Lighting'!D47,LightingSpaceType,0)*W47),INDEX(LPD2010WB,MATCH('Interior Lighting'!D47,LightingSpaceType,0)))","v":{"$error":"#N/A"}},0,{"$error":"#N/A"},{"$error":"#N/A"},{"$error":"#N/A"},0,"",null,null,1,null,{"$error":"#N/A"},{"$error":"#N/A"},{"$f":"INDEX(Lookup!$O$9:$O$24,MATCH('Interior Lighting'!Z47,Lookup!$K$9:$K$24,0))","v":{"$error":"#N/A"}},{"$f":"IF(E47=\"A\",INDEX(Lookup!$L$9:$L$24,MATCH(Z47,Lookup!$K$9:$K$24,0)),IF(E47=\"B\",INDEX(Lookup!$M$9:$M$24,MATCH(Z47,Lookup!$K$9:$K$24,0)),IF(E47=\"C\",INDEX(Lookup!$N$9:$N$24,MATCH(Z47,Lookup!$K$9:$K$24,0)),\"N/A\")))","v":{"$error":"#N/A"}}]
[null,null,null,null,{"$f":"INDEX(Lookup!$I$9:$I$24,MATCH('Interior Lighting'!D48,Lookup!$C$9:$C$24,0))","v":{"$error":"#N/A"}},null,null,null,{"$error":"#N/A"},null,0,{"$error":"#DIV/0!"},"N/A",{"$f":"IF($D$20=\"Space-By-Space (90.1-2010)\",INDEX(LPD2010SS,MATCH('Interior Lighting'!D48,LightingSpaceType,0)*W48),INDEX(LPD2010WB,MATCH('Interior Lighting'!D48,LightingSpaceType,0)))","v":{"$error":"#N/A"}},0,{"$error":"#N/A"},{"$error":"#N/A"},{"$error":"#N/A"},0,"",null,null,1,null,{"$error":"#N/A"},{"$error":"#N/A"},{"$f":"INDEX(Lookup!$O$9:$O$24,MATCH('Interior Lighting'!Z48,Lookup!$K$9:$K$24,0))","v":{"$error":"#N/A"}},{"$f":"IF(E48=\"A\",INDEX(Lookup!$L$9:$L$24,MATCH(Z48,Lookup!$K$9:$K$24,0)),IF(E48=\"B\",INDEX(Lookup!$M$9:$M$24,MATCH(Z48,Lookup!$K$9:$K$24,0)),IF(E48=\"C\",INDEX(Lookup!$N$9:$N$24,MATCH(Z48,Lookup!$K$9:$K$24,0)),\"N/A\")))","v":{"$error":"#N/A"}}]
[null,null,null,null,{"$f":"INDEX(Lookup!$I$9:$I$24,MATCH('Interior Lighting'!D49,Lookup!$C$9:$C$24,0))","v":{"$error":"#N/A"}},null,null,null,{"$error":"#N/A"},null,0,{"$error":"#DIV/0!"},"N/A",{"$f":"IF($D$20=\"Space-By-Space (90.1-2010)\",INDEX(LPD2010SS,MATCH('Interior Lighting'!D49,LightingSpaceType,0)*W49),INDEX(LPD2010WB,MATCH('Interior Lighting'!D49,LightingSpaceType,0)))","v":{"$error":"#N/A"}},0,{"$error":"#N/A"},{"$error":"#N/A"},{"$error":"#N/A"},0,"",null,null,1,null,{"$error":"#N/A"},{"$error":"#N/A"},{"$f":"INDEX(Lookup!$O$9:$O$24,MATCH('Interior Lighting'!Z49,Lookup!$K$9:$K$24,0))","v":{"$error":"#N/A"}},{"$f":"IF(E49=\"A\",INDEX(Lookup!$L$9:$L$24,MATCH(Z49,Lookup!$K$9:$K$24,0)),IF(E49=\"B\",INDEX(Lookup!$M$9:$M$24,MATCH(Z49,Lookup!$K$9:$K$24,0)),IF(E49=\"C\",INDEX(Lookup!$N$9:$N$24,MATCH(Z49,Lookup!$K$9:$K$24,0)),\"N/A\")))","v":{"$error":"#N/A"}}]
[null,null,null,null,{"$f":"INDEX(Lookup!$I$9:$I$24,MATCH('Interior Lighting'!D50,Lookup!$C$9:$C$24,0))","v":{"$error":"#N/A"}},null,null,null,{"$error":"#N/A"},null,0,{"$error":"#DIV/0!"},"N/A",{"$f":"IF($D$20=\"Space-By-Space (90.1-2010)\",INDEX(LPD2010SS,MATCH('Interior Lighting'!D50,LightingSpaceType,0)*W50),INDEX(LPD2010WB,MATCH('Interior Lighting'!D50,LightingSpaceType,0)))","v":{"$error":"#N/A"}},0,{"$error":"#N/A"},{"$error":"#N/A"},{"$error":"#N/A"},0,"",null,null,1,null,{"$error":"#N/A"},{"$error":"#N/A"},{"$f":"INDEX(Lookup!$O$9:$O$24,MATCH('Interior Lighting'!Z50,Lookup!$K$9:$K$24,0))","v":{"$error":"#N/A"}},{"$f":"IF(E50=\"A\",INDEX(Lookup!$L$9:$L$24,MATCH(Z50,Lookup!$K$9:$K$24,0)),IF(E50=\"B\",INDEX(Lookup!$M$9:$M$24,MATCH(Z50,Lookup!$K$9:$K$24,0)),IF(E50=\"C\",INDEX(Lookup!$N$9:$N$24,MATCH(Z50,Lookup!$K$9:$K$24,0)),\"N/A\")))","v":{"$error":"#N/A"}}]
[null,null,null,null,{"$f":"INDEX(Lookup!$I$9:$I$24,MATCH('Interior Lighting'!D51,Lookup!$C$9:$C$24,0))","v":{"$error":"#N/A"}},null,null,null,{"$error":"#N/A"},null,0,{"$error":"#DIV/0!"},"N/A",{"$f":"IF($D$20=\"Space-By-Space (90.1-2010)\",INDEX(LPD2010SS,MATCH('Interior Lighting'!D51,LightingSpaceType,0)*W51),INDEX(LPD2010WB,MATCH('Interior Lighting'!D51,LightingSpaceType,0)))","v":{"$error":"#N/A"}},0,{"$error":"#N/A"},{"$error":"#N/A"},{"$error":"#N/A"},0,"",null,null,1,null,{"$error":"#N/A"},{"$error":"#N/A"},{"$f":"INDEX(Lookup!$O$9:$O$24,MATCH('Interior Lighting'!Z51,Lookup!$K$9:$K$24,0))","v":{"$error":"#N/A"}},{"$f":"IF(E51=\"A\",INDEX(Lookup!$L$9:$L$24,MATCH(Z51,Lookup!$K$9:$K$24,0)),IF(E51=\"B\",INDEX(Lookup!$M$9:$M$24,MATCH(Z51,Lookup!$K$9:$K$24,0)),IF(E51=\"C\",INDEX(Lookup!$N$9:$N$24,MATCH(Z51,Lookup!$K$9:$K$24,0)),\"N/A\")))","v":{"$error":"#N/A"}}]
[null,null,null,null,{"$f":"INDEX(Lookup!$I$9:$I$24,MATCH('Interior Lighting'!D52,Lookup!$C$9:$C$24,0))","v":{"$error":"#N/A"}},null,null,null,{"$error":"#N/A"},null,0,{"$error":"#DIV/0!"},"N/A",{"$f":"IF($D$20=\"Space-By-Space (90.1-2010)\",INDEX(LPD2010SS,MATCH('Interior Lighting'!D52,LightingSpaceType,0)*W52),INDEX(LPD2010WB,MATCH('Interior Lighting'!D52,LightingSpaceType,0)))","v":{"$error":"#N/A"}},0,{"$error":"#N/A"},{"$error":"#N/A"},{"$error":"#N/A"},0,"",null,null,1,null,{"$error":"#N/A"},{"$error":"#N/A"},{"$f":"INDEX(Lookup!$O$9:$O$24,MATCH('Interior Lighting'!Z52,Lookup!$K$9:$K$24,0))","v":{"$error":"#N/A"}},{"$f":"IF(E52=\"A\",INDEX(Lookup!$L$9:$L$24,MATCH(Z52,Lookup!$K$9:$K$24,0)),IF(E52=\"B\",INDEX(Lookup!$M$9:$M$24,MATCH(Z52,Lookup!$K$9:$K$24,0)),IF(E52=\"C\",INDEX(Lookup!$N$9:$N$24,MATCH(Z52,Lookup!$K$9:$K$24,0)),\"N/A\")))","v":{"$error":"#N/A"}}]
[null,null,null,null,{"$f":"INDEX(Lookup!$I$9:$I$24,MATCH('Interior Lighting'!D53,Lookup!$C$9:$C$24,0))","v":{"$error":"#N/A"}},null,null,null,{"$error":"#N/A"},null,0,{"$error":"#DIV/0!"},"N/A",{"$f":"IF($D$20=\"Space-By-Space (90.1-2010)\",INDEX(LPD2010SS,MATCH('Interior Lighting'!D53,LightingSpaceType,0)*W53),INDEX(LPD2010WB,MATCH('Interior Lighting'!D53,LightingSpaceType,0)))","v":{"$error":"#N/A"}},0,{"$error":"#N/A"},{"$error":"#N/A"},{"$error":"#N/A"},0,"",null,null,1,null,{"$error":"#N/A"},{"$error":"#N/A"},{"$f":"INDEX(Lookup!$O$9:$O$24,MATCH('Interior Lighting'!Z53,Lookup!$K$9:$K$24,0))","v":{"$error":"#N/A"}},{"$f":"IF(E53=\"A\",INDEX(Lookup!$L$9:$L$24,MATCH(Z53,Lookup!$K$9:$K$24,0)),IF(E53=\"B\",INDEX(Lookup!$M$9:$M$24,MATCH(Z53,Lookup!$K$9:$K$24,0)),IF(E53=\"C\",INDEX(Lookup!$N$9:$N$24,MATCH(Z53,Lookup!$K$9:$K$24,0)),\"N/A\")))","v":{"$error":"#N/A"}}]
[null,null,null,null,{"$f":"INDEX(Lookup!$I$9:$I$24,MATCH('Interior Lighting'!D54,Lookup!$C$9:$C$24,0))","v":{"$error":"#N/A"}},null,null,null,{"$error":"#N/A"},null,0,{"$error":"#DIV/0!"},"N/A",{"$f":"IF($D$20=\"Space-By-Space (90.1-2010)\",INDEX(LPD2010SS,MATCH('Interior Lighting'!D54,LightingSpaceType,0)*W54),INDEX(LPD2010WB,MATCH('Interior Lighting'!D54,LightingSpaceType,0)))","v":{"$error":"#N/A"}},0,{"$error":"#N/A"},{"$error":"#N/A"},{"$error":"#N/A"},0,"",null,null,1,null,{"$error":"#N/A"},{"$error":"#N/A"},{"$f":"INDEX(Lookup!$O$9:$O$24,MATCH('Interior Lighting'!Z54,Lookup!$K$9:$K$24,0))","v":{"$error":"#N/A"}},{"$f":"IF(E54=\"A\",INDEX(Lookup!$L$9:$L$24,MATCH(Z54,Lookup!$K$9:$K$24,0)),IF(E54=\"B\",INDEX(Lookup!$M$9:$M$24,MATCH(Z54,Lookup!$K$9:$K$24,0)),IF(E54=\"C\",INDEX(Lookup!$N$9:$N$24,MATCH(Z54,Lookup!$K$9:$K$24,0)),\"N/A\")))","v":{"$error":"#N/A"}}]
[null,null,null,null,{"$f":"INDEX(Lookup!$I$9:$I$24,MATCH('Interior Lighting'!D55,Lookup!$C$9:$C$24,0))","v":{"$error":"#N/A"}},null,null,null,{"$error":"#N/A"},null,0,{"$error":"#DIV/0!"},"N/A",{"$f":"IF($D$20=\"Space-By-Space (90.1-2010)\",INDEX(LPD2010SS,MATCH('Interior Lighting'!D55,LightingSpaceType,0)*W55),INDEX(LPD2010WB,MATCH('Interior Lighting'!D55,LightingSpaceType,0)))","v":{"$error":"#N/A"}},0,{"$error":"#N/A"},{"$error":"#N/A"},{"$error":"#N/A"},0,"",null,null,1,null,{"$error":"#N/A"},{"$error":"#N/A"},{"$f":"INDEX(Lookup!$O$9:$O$24,MATCH('Interior Lighting'!Z55,Lookup!$K$9:$K$24,0))","v":{"$error":"#N/A"}},{"$f":"IF(E55=\"A\",INDEX(Lookup!$L$9:$L$24,MATCH(Z55,Lookup!$K$9:$K$24,0)),IF(E55=\"B\",INDEX(Lookup!$M$9:$M$24,MATCH(Z55,Lookup!$K$9:$K$24,0)),IF(E55=\"C\",INDEX(Lookup!$N$9:$N$24,MATCH(Z55,Lookup!$K$9:$K$24,0)),\"N/A\")))","v":{"$error":"#N/A"}}]
[null,null,null,null,{"$f":"INDEX(Lookup!$I$9:$I$24,MATCH('Interior Lighting'!D56,Lookup!$C$9:$C$24,0))","v":{"$error":"#N/A"}},null,null,null,{"$error":"#N/A"},null,0,{"$error":"#DIV/0!"},"N/A",{"$f":"IF($D$20=\"Space-By-Space (90.1-2010)\",INDEX(LPD2010SS,MATCH('Interior Lighting'!D56,LightingSpaceType,0)*W56),INDEX(LPD2010WB,MATCH('Interior Lighting'!D56,LightingSpaceType,0)))","v":{"$error":"#N/A"}},0,{"$error":"#N/A"},{"$error":"#N/A"},{"$error":"#N/A"},0,"",null,null,1,null,{"$error":"#N/A"},{"$error":"#N/A"},{"$f":"INDEX(Lookup!$O$9:$O$24,MATCH('Interior Lighting'!Z56,Lookup!$K$9:$K$24,0))","v":{"$error":"#N/A"}},{"$f":"IF(E56=\"A\",INDEX(Lookup!$L$9:$L$24,MATCH(Z56,Lookup!$K$9:$K$24,0)),IF(E56=\"B\",INDEX(Lookup!$M$9:$M$24,MATCH(Z56,Lookup!$K$9:$K$24,0)),IF(E56=\"C\",INDEX(Lookup!$N$9:$N$24,MATCH(Z56,Lookup!$K$9:$K$24,0)),\"N/A\")))","v":{"$error":"#N/A"}}]
[null,null,null,null,{"$f":"INDEX(Lookup!$I$9:$I$24,MATCH('Interior Lighting'!D57,Lookup!$C$9:$C$24,0))","v":{"$error":"#N/A"}},null,null,null,{"$error":"#N/A"},null,0,{"$error":"#DIV/0!"},"N/A",{"$f":"IF($D$20=\"Space-By-Space (90.1-2010)\",INDEX(LPD2010SS,MATCH('Interior Lighting'!D57,LightingSpaceType,0)*W57),INDEX(LPD2010WB,MATCH('Interior Lighting'!D57,LightingSpaceType,0)))","v":{"$error":"#N/A"}},0,{"$error":"#N/A"},{"$error":"#N/A"},{"$error":"#N/A"},0,"",null,null,1,null,{"$error":"#N/A"},{"$error":"#N/A"},{"$f":"INDEX(Lookup!$O$9:$O$24,MATCH('Interior Lighting'!Z57,Lookup!$K$9:$K$24,0))","v":{"$error":"#N/A"}},{"$f":"IF(E57=\"A\",INDEX(Lookup!$L$9:$L$24,MATCH(Z57,Lookup!$K$9:$K$24,0)),IF(E57=\"B\",INDEX(Lookup!$M$9:$M$24,MATCH(Z57,Lookup!$K$9:$K$24,0)),IF(E57=\"C\",INDEX(Lookup!$N$9:$N$24,MATCH(Z57,Lookup!$K$9:$K$24,0)),\"N/A\")))","v":{"$error":"#N/A"}}]
[null,null,null,null,{"$f":"INDEX(Lookup!$I$9:$I$24,MATCH('Interior Lighting'!D58,Lookup!$C$9:$C$24,0))","v":{"$error":"#N/A"}},null,null,null,{"$error":"#N/A"},null,0,{"$error":"#DIV/0!"},"N/A",{"$f":"IF($D$20=\"Space-By-Space (90.1-2010)\",INDEX(LPD2010SS,MATCH('Interior Lighting'!D58,LightingSpaceType,0)*W58),INDEX(LPD2010WB,MATCH('Interior Lighting'!D58,LightingSpaceType,0)))","v":{"$error":"#N/A"}},0,{"$error":"#N/A"},{"$error":"#N/A"},{"$error":"#N/A"},0,"",null,null,1,null,{"$error":"#N/A"},{"$error":"#N/A"},{"$f":"INDEX(Lookup!$O$9:$O$24,MATCH('Interior Lighting'!Z58,Lookup!$K$9:$K$24,0))","v":{"$error":"#N/A"}},{"$f":"IF(E58=\"A\",INDEX(Lookup!$L$9:$L$24,MATCH(Z58,Lookup!$K$9:$K$24,0)),IF(E58=\"B\",INDEX(Lookup!$M$9:$M$24,MATCH(Z58,Lookup!$K$9:$K$24,0)),IF(E58=\"C\",INDEX(Lookup!$N$9:$N$24,MATCH(Z58,Lookup!$K$9:$K$24,0)),\"N/A\")))","v":{"$error":"#N/A"}}]
[null,null,null,null,{"$f":"INDEX(Lookup!$I$9:$I$24,MATCH('Interior Lighting'!D59,Lookup!$C$9:$C$24,0))","v":{"$error":"#N/A"}},null,null,null,{"$error":"#N/A"},null,0,{"$error":"#DIV/0!"},"N/A",{"$f":"IF($D$20=\"Space-By-Space (90.1-2010)\",INDEX(LPD2010SS,MATCH('Interior Lighting'!D59,LightingSpaceType,0)*W59),INDEX(LPD2010WB,MATCH('Interior Lighting'!D59,LightingSpaceType,0)))","v":{"$error":"#N/A"}},0,{"$error":"#N/A"},{"$error":"#N/A"},{"$error":"#N/A"},0,"",null,null,1,null,{"$error":"#N/A"},{"$error":"#N/A"},{"$f":"INDEX(Lookup!$O$9:$O$24,MATCH('Interior Lighting'!Z59,Lookup!$K$9:$K$24,0))","v":{"$error":"#N/A"}},{"$f":"IF(E59=\"A\",INDEX(Lookup!$L$9:$L$24,MATCH(Z59,Lookup!$K$9:$K$24,0)),IF(E59=\"B\",INDEX(Lookup!$M$9:$M$24,MATCH(Z59,Lookup!$K$9:$K$24,0)),IF(E59=\"C\",INDEX(Lookup!$N$9:$N$24,MATCH(Z59,Lookup!$K$9:$K$24,0)),\"N/A\")))","v":{"$error":"#N/A"}}]
[null,null,null,null,{"$f":"INDEX(Lookup!$I$9:$I$24,MATCH('Interior Lighting'!D60,Lookup!$C$9:$C$24,0))","v":{"$error":"#N/A"}},null,null,null,{"$error":"#N/A"},null,0,{"$error":"#DIV/0!"},"N/A",{"$f":"IF($D$20=\"Space-By-Space (90.1-2010)\",INDEX(LPD2010SS,MATCH('Interior Lighting'!D60,LightingSpaceType,0)*W60),INDEX(LPD2010WB,MATCH('Interior Lighting'!D60,LightingSpaceType,0)))","v":{"$error":"#N/A"}},0,{"$error":"#N/A"},{"$error":"#N/A"},{"$error":"#N/A"},0,"",null,null,1,null,{"$error":"#N/A"},{"$error":"#N/A"},{"$f":"INDEX(Lookup!$O$9:$O$24,MATCH('Interior Lighting'!Z60,Lookup!$K$9:$K$24,0))","v":{"$error":"#N/A"}},{"$f":"IF(E60=\"A\",INDEX(Lookup!$L$9:$L$24,MATCH(Z60,Lookup!$K$9:$K$24,0)),IF(E60=\"B\",INDEX(Lookup!$M$9:$M$24,MATCH(Z60,Lookup!$K$9:$K$24,0)),IF(E60=\"C\",INDEX(Lookup!$N$9:$N$24,MATCH(Z60,Lookup!$K$9:$K$24,0)),\"N/A\")))","v":{"$error":"#N/A"}}]
[null,null,null,null,{"$f":"INDEX(Lookup!$I$9:$I$24,MATCH('Interior Lighting'!D61,Lookup!$C$9:$C$24,0))","v":{"$error":"#N/A"}},null,null,null,{"$error":"#N/A"},null,0,{"$error":"#DIV/0!"},"N/A",{"$f":"IF($D$20=\"Space-By-Space (90.1-2010)\",INDEX(LPD2010SS,MATCH('Interior Lighting'!D61,LightingSpaceType,0)*W61),INDEX(LPD2010WB,MATCH('Interior Lighting'!D61,LightingSpaceType,0)))","v":{"$error":"#N/A"}},0,{"$error":"#N/A"},{"$error":"#N/A"},{"$error":"#N/A"},0,"",null,null,1,null,{"$error":"#N/A"},{"$error":"#N/A"},{"$f":"INDEX(Lookup!$O$9:$O$24,MATCH('Interior Lighting'!Z61,Lookup!$K$9:$K$24,0))","v":{"$error":"#N/A"}},{"$f":"IF(E61=\"A\",INDEX(Lookup!$L$9:$L$24,MATCH(Z61,Lookup!$K$9:$K$24,0)),IF(E61=\"B\",INDEX(Lookup!$M$9:$M$24,MATCH(Z61,Lookup!$K$9:$K$24,0)),IF(E61=\"C\",INDEX(Lookup!$N$9:$N$24,MATCH(Z61,Lookup!$K$9:$K$24,0)),\"N/A\")))","v":{"$error":"#N/A"}}]
[null,null,null,null,{"$f":"INDEX(Lookup!$I$9:$I$24,MATCH('Interior Lighting'!D62,Lookup!$C$9:$C$24,0))","v":{"$error":"#N/A"}},null,null,null,{"$error":"#N/A"},null,0,{"$error":"#DIV/0!"},"N/A",{"$f":"IF($D$20=\"Space-By-Space (90.1-2010)\",INDEX(LPD2010SS,MATCH('Interior Lighting'!D62,LightingSpaceType,0)*W62),INDEX(LPD2010WB,MATCH('Interior Lighting'!D62,LightingSpaceType,0)))","v":{"$error":"#N/A"}},0,{"$error":"#N/A"},{"$error":"#N/A"},{"$error":"#N/A"},0,"",null,null,1,null,{"$error":"#N/A"},{"$error":"#N/A"},{"$f":"INDEX(Lookup!$O$9:$O$24,MATCH('Interior Lighting'!Z62,Lookup!$K$9:$K$24,0))","v":{"$error":"#N/A"}},{"$f":"IF(E62=\"A\",INDEX(Lookup!$L$9:$L$24,MATCH(Z62,Lookup!$K$9:$K$24,0)),IF(E62=\"B\",INDEX(Lookup!$M$9:$M$24,MATCH(Z62,Lookup!$K$9:$K$24,0)),IF(E62=\"C\",INDEX(Lookup!$N$9:$N$24,MATCH(Z62,Lookup!$K$9:$K$24,0)),\"N/A\")))","v":{"$error":"#N/A"}}]
[null,null,null,null,{"$f":"INDEX(Lookup!$I$9:$I$24,MATCH('Interior Lighting'!D63,Lookup!$C$9:$C$24,0))","v":{"$error":"#N/A"}},null,null,null,{"$error":"#N/A"},null,0,{"$error":"#DIV/0!"},"N/A",{"$f":"IF($D$20=\"Space-By-Space (90.1-2010)\",INDEX(LPD2010SS,MATCH('Interior Lighting'!D63,LightingSpaceType,0)*W63),INDEX(LPD2010WB,MATCH('Interior Lighting'!D63,LightingSpaceType,0)))","v":{"$error":"#N/A"}},0,{"$error":"#N/A"},{"$error":"#N/A"},{"$error":"#N/A"},0,"",null,null,1,null,{"$error":"#N/A"},{"$error":"#N/A"},{"$f":"INDEX(Lookup!$O$9:$O$24,MATCH('Interior Lighting'!Z63,Lookup!$K$9:$K$24,0))","v":{"$error":"#N/A"}},{"$f":"IF(E63=\"A\",INDEX(Lookup!$L$9:$L$24,MATCH(Z63,Lookup!$K$9:$K$24,0)),IF(E63=\"B\",INDEX(Lookup!$M$9:$M$24,MATCH(Z63,Lookup!$K$9:$K$24,0)),IF(E63=\"C\",INDEX(Lookup!$N$9:$N$24,MATCH(Z63,Lookup!$K$9:$K$24,0)),\"N/A\")))","v":{"$error":"#N/A"}}]
[null,null,null,null,{"$f":"INDEX(Lookup!$I$9:$I$24,MATCH('Interior Lighting'!D64,Lookup!$C$9:$C$24,0))","v":{"$error":"#N/A"}},null,null,null,{"$error":"#N/A"},null,0,{"$error":"#DIV/0!"},"N/A",{"$f":"IF($D$20=\"Space-By-Space (90.1-2010)\",INDEX(LPD2010SS,MATCH('Interior Lighting'!D64,LightingSpaceType,0)*W64),INDEX(LPD2010WB,MATCH('Interior Lighting'!D64,LightingSpaceType,0)))","v":{"$error":"#N/A"}},0,{"$error":"#N/A"},{"$error":"#N/A"},{"$error":"#N/A"},0,"",null,null,1,null,{"$error":"#N/A"},{"$error":"#N/A"},{"$f":"INDEX(Lookup!$O$9:$O$24,MATCH('Interior Lighting'!Z64,Lookup!$K$9:$K$24,0))","v":{"$error":"#N/A"}},{"$f":"IF(E64=\"A\",INDEX(Lookup!$L$9:$L$24,MATCH(Z64,Lookup!$K$9:$K$24,0)),IF(E64=\"B\",INDEX(Lookup!$M$9:$M$24,MATCH(Z64,Lookup!$K$9:$K$24,0)),IF(E64=\"C\",INDEX(Lookup!$N$9:$N$24,MATCH(Z64,Lookup!$K$9:$K$24,0)),\"N/A\")))","v":{"$error":"#N/A"}}]
[null,null,null,null,{"$f":"INDEX(Lookup!$I$9:$I$24,MATCH('Interior Lighting'!D65,Lookup!$C$9:$C$24,0))","v":{"$error":"#N/A"}},null,null,null,{"$error":"#N/A"},null,0,{"$error":"#DIV/0!"},"N/A",{"$f":"IF($D$20=\"Space-By-Space (90.1-2010)\",INDEX(LPD2010SS,MATCH('Interior Lighting'!D65,LightingSpaceType,0)*W65),INDEX(LPD2010WB,MATCH('Interior Lighting'!D65,LightingSpaceType,0)))","v":{"$error":"#N/A"}},0,{"$error":"#N/A"},{"$error":"#N/A"},{"$error":"#N/A"},0,"",null,null,1,null,{"$error":"#N/A"},{"$error":"#N/A"},{"$f":"INDEX(Lookup!$O$9:$O$24,MATCH('Interior Lighting'!Z65,Lookup!$K$9:$K$24,0))","v":{"$error":"#N/A"}},{"$f":"IF(E65=\"A\",INDEX(Lookup!$L$9:$L$24,MATCH(Z65,Lookup!$K$9:$K$24,0)),IF(E65=\"B\",INDEX(Lookup!$M$9:$M$24,MATCH(Z65,Lookup!$K$9:$K$24,0)),IF(E65=\"C\",INDEX(Lookup!$N$9:$N$24,MATCH(Z65,Lookup!$K$9:$K$24,0)),\"N/A\")))","v":{"$error":"#N/A"}}]
[null,null,null,null,{"$f":"INDEX(Lookup!$I$9:$I$24,MATCH('Interior Lighting'!D66,Lookup!$C$9:$C$24,0))","v":{"$error":"#N/A"}},null,null,null,{"$error":"#N/A"},null,0,{"$error":"#DIV/0!"},"N/A",{"$f":"IF($D$20=\"Space-By-Space (90.1-2010)\",INDEX(LPD2010SS,MATCH('Interior Lighting'!D66,LightingSpaceType,0)*W66),INDEX(LPD2010WB,MATCH('Interior Lighting'!D66,LightingSpaceType,0)))","v":{"$error":"#N/A"}},0,{"$error":"#N/A"},{"$error":"#N/A"},{"$error":"#N/A"},0,"",null,null,1,null,{"$error":"#N/A"},{"$error":"#N/A"},{"$f":"INDEX(Lookup!$O$9:$O$24,MATCH('Interior Lighting'!Z66,Lookup!$K$9:$K$24,0))","v":{"$error":"#N/A"}},{"$f":"IF(E66=\"A\",INDEX(Lookup!$L$9:$L$24,MATCH(Z66,Lookup!$K$9:$K$24,0)),IF(E66=\"B\",INDEX(Lookup!$M$9:$M$24,MATCH(Z66,Lookup!$K$9:$K$24,0)),IF(E66=\"C\",INDEX(Lookup!$N$9:$N$24,MATCH(Z66,Lookup!$K$9:$K$24,0)),\"N/A\")))","v":{"$error":"#N/A"}}]
[null,null,null,null,{"$f":"INDEX(Lookup!$I$9:$I$24,MATCH('Interior Lighting'!D67,Lookup!$C$9:$C$24,0))","v":{"$error":"#N/A"}},null,null,null,{"$error":"#N/A"},null,0,{"$error":"#DIV/0!"},"N/A",{"$f":"IF($D$20=\"Space-By-Space (90.1-2010)\",INDEX(LPD2010SS,MATCH('Interior Lighting'!D67,LightingSpaceType,0)*W67),INDEX(LPD2010WB,MATCH('Interior Lighting'!D67,LightingSpaceType,0)))","v":{"$error":"#N/A"}},0,{"$error":"#N/A"},{"$error":"#N/A"},{"$error":"#N/A"},0,"",null,null,1,null,{"$error":"#N/A"},{"$error":"#N/A"},{"$f":"INDEX(Lookup!$O$9:$O$24,MATCH('Interior Lighting'!Z67,Lookup!$K$9:$K$24,0))","v":{"$error":"#N/A"}},{"$f":"IF(E67=\"A\",INDEX(Lookup!$L$9:$L$24,MATCH(Z67,Lookup!$K$9:$K$24,0)),IF(E67=\"B\",INDEX(Lookup!$M$9:$M$24,MATCH(Z67,Lookup!$K$9:$K$24,0)),IF(E67=\"C\",INDEX(Lookup!$N$9:$N$24,MATCH(Z67,Lookup!$K$9:$K$24,0)),\"N/A\")))","v":{"$error":"#N/A"}}]
[null,null,null,null,{"$f":"INDEX(Lookup!$I$9:$I$24,MATCH('Interior Lighting'!D68,Lookup!$C$9:$C$24,0))","v":{"$error":"#N/A"}},null,null,null,{"$error":"#N/A"},null,0,{"$error":"#DIV/0!"},"N/A",{"$f":"IF($D$20=\"Space-By-Space (90.1-2010)\",INDEX(LPD2010SS,MATCH('Interior Lighting'!D68,LightingSpaceType,0)*W68),INDEX(LPD2010WB,MATCH('Interior Lighting'!D68,LightingSpaceType,0)))","v":{"$error":"#N/A"}},0,{"$error":"#N/A"},{"$error":"#N/A"},{"$error":"#N/A"},0,"",null,null,1,null,{"$error":"#N/A"},{"$error":"#N/A"},{"$f":"INDEX(Lookup!$O$9:$O$24,MATCH('Interior Lighting'!Z68,Lookup!$K$9:$K$24,0))","v":{"$error":"#N/A"}},{"$f":"IF(E68=\"A\",INDEX(Lookup!$L$9:$L$24,MATCH(Z68,Lookup!$K$9:$K$24,0)),IF(E68=\"B\",INDEX(Lookup!$M$9:$M$24,MATCH(Z68,Lookup!$K$9:$K$24,0)),IF(E68=\"C\",INDEX(Lookup!$N$9:$N$24,MATCH(Z68,Lookup!$K$9:$K$24,0)),\"N/A\")))","v":{"$error":"#N/A"}}]
[null,null,null,null,{"$f":"INDEX(Lookup!$I$9:$I$24,MATCH('Interior Lighting'!D69,Lookup!$C$9:$C$24,0))","v":{"$error":"#N/A"}},null,null,null,{"$error":"#N/A"},null,0,{"$error":"#DIV/0!"},"N/A",{"$f":"IF($D$20=\"Space-By-Space (90.1-2010)\",INDEX(LPD2010SS,MATCH('Interior Lighting'!D69,LightingSpaceType,0)*W69),INDEX(LPD2010WB,MATCH('Interior Lighting'!D69,LightingSpaceType,0)))","v":{"$error":"#N/A"}},0,{"$error":"#N/A"},{"$error":"#N/A"},{"$error":"#N/A"},0,"",null,null,1,null,{"$error":"#N/A"},{"$error":"#N/A"},{"$f":"INDEX(Lookup!$O$9:$O$24,MATCH('Interior Lighting'!Z69,Lookup!$K$9:$K$24,0))","v":{"$error":"#N/A"}},{"$f":"IF(E69=\"A\",INDEX(Lookup!$L$9:$L$24,MATCH(Z69,Lookup!$K$9:$K$24,0)),IF(E69=\"B\",INDEX(Lookup!$M$9:$M$24,MATCH(Z69,Lookup!$K$9:$K$24,0)),IF(E69=\"C\",INDEX(Lookup!$N$9:$N$24,MATCH(Z69,Lookup!$K$9:$K$24,0)),\"N/A\")))","v":{"$error":"#N/A"}}]
[null,null,null,null,{"$f":"INDEX(Lookup!$I$9:$I$24,MATCH('Interior Lighting'!D70,Lookup!$C$9:$C$24,0))","v":{"$error":"#N/A"}},null,null,null,{"$error":"#N/A"},null,0,{"$error":"#DIV/0!"},"N/A",{"$f":"IF($D$20=\"Space-By-Space (90.1-2010)\",INDEX(LPD2010SS,MATCH('Interior Lighting'!D70,LightingSpaceType,0)*W70),INDEX(LPD2010WB,MATCH('Interior Lighting'!D70,LightingSpaceType,0)))","v":{"$error":"#N/A"}},0,{"$error":"#N/A"},{"$error":"#N/A"},{"$error":"#N/A"},0,"",null,null,1,null,{"$error":"#N/A"},{"$error":"#N/A"},{"$f":"INDEX(Lookup!$O$9:$O$24,MATCH('Interior Lighting'!Z70,Lookup!$K$9:$K$24,0))","v":{"$error":"#N/A"}},{"$f":"IF(E70=\"A\",INDEX(Lookup!$L$9:$L$24,MATCH(Z70,Lookup!$K$9:$K$24,0)),IF(E70=\"B\",INDEX(Lookup!$M$9:$M$24,MATCH(Z70,Lookup!$K$9:$K$24,0)),IF(E70=\"C\",INDEX(Lookup!$N$9:$N$24,MATCH(Z70,Lookup!$K$9:$K$24,0)),\"N/A\")))","v":{"$error":"#N/A"}}]
[null,null,null,null,{"$f":"INDEX(Lookup!$I$9:$I$24,MATCH('Interior Lighting'!D71,Lookup!$C$9:$C$24,0))","v":{"$error":"#N/A"}},null,null,null,{"$error":"#N/A"},null,0,{"$error":"#DIV/0!"},"N/A",{"$f":"IF($D$20=\"Space-By-Space (90.1-2010)\",INDEX(LPD2010SS,MATCH('Interior Lighting'!D71,LightingSpaceType,0)*W71),INDEX(LPD2010WB,MATCH('Interior Lighting'!D71,LightingSpaceType,0)))","v":{"$error":"#N/A"}},0,{"$error":"#N/A"},{"$error":"#N/A"},{"$error":"#N/A"},0,"",null,null,1,null,{"$error":"#N/A"},{"$error":"#N/A"},{"$f":"INDEX(Lookup!$O$9:$O$24,MATCH('Interior Lighting'!Z71,Lookup!$K$9:$K$24,0))","v":{"$error":"#N/A"}},{"$f":"IF(E71=\"A\",INDEX(Lookup!$L$9:$L$24,MATCH(Z71,Lookup!$K$9:$K$24,0)),IF(E71=\"B\",INDEX(Lookup!$M$9:$M$24,MATCH(Z71,Lookup!$K$9:$K$24,0)),IF(E71=\"C\",INDEX(Lookup!$N$9:$N$24,MATCH(Z71,Lookup!$K$9:$K$24,0)),\"N/A\")))","v":{"$error":"#N/A"}}]
[null,null,null,null,{"$f":"INDEX(Lookup!$I$9:$I$24,MATCH('Interior Lighting'!D72,Lookup!$C$9:$C$24,0))","v":{"$error":"#N/A"}},null,null,null,{"$error":"#N/A"},null,0,{"$error":"#DIV/0!"},"N/A",{"$f":"IF($D$20=\"Space-By-Space (90.1-2010)\",INDEX(LPD2010SS,MATCH('Interior Lighting'!D72,LightingSpaceType,0)*W72),INDEX(LPD2010WB,MATCH('Interior Lighting'!D72,LightingSpaceType,0)))","v":{"$error":"#N/A"}},0,{"$error":"#N/A"},{"$error":"#N/A"},{"$error":"#N/A"},0,"",null,null,1,null,{"$error":"#N/A"},{"$error":"#N/A"},{"$f":"INDEX(Lookup!$O$9:$O$24,MATCH('Interior Lighting'!Z72,Lookup!$K$9:$K$24,0))","v":{"$error":"#N/A"}},{"$f":"IF(E72=\"A\",INDEX(Lookup!$L$9:$L$24,MATCH(Z72,Lookup!$K$9:$K$24,0)),IF(E72=\"B\",INDEX(Lookup!$M$9:$M$24,MATCH(Z72,Lookup!$K$9:$K$24,0)),IF(E72=\"C\",INDEX(Lookup!$N$9:$N$24,MATCH(Z72,Lookup!$K$9:$K$24,0)),\"N/A\")))","v":{"$error":"#N/A"}}]
[null,null,null,null,{"$f":"INDEX(Lookup!$I$9:$I$24,MATCH('Interior Lighting'!D73,Lookup!$C$9:$C$24,0))","v":{"$error":"#N/A"}},null,null,null,{"$error":"#N/A"},null,0,{"$error":"#DIV/0!"},"N/A",{"$f":"IF($D$20=\"Space-By-Space (90.1-2010)\",INDEX(LPD2010SS,MATCH('Interior Lighting'!D73,LightingSpaceType,0)*W73),INDEX(LPD2010WB,MATCH('Interior Lighting'!D73,LightingSpaceType,0)))","v":{"$error":"#N/A"}},0,{"$error":"#N/A"},{"$error":"#N/A"},{"$error":"#N/A"},0,"",null,null,1,null,{"$error":"#N/A"},{"$error":"#N/A"},{"$f":"INDEX(Lookup!$O$9:$O$24,MATCH('Interior Lighting'!Z73,Lookup!$K$9:$K$24,0))","v":{"$error":"#N/A"}},{"$f":"IF(E73=\"A\",INDEX(Lookup!$L$9:$L$24,MATCH(Z73,Lookup!$K$9:$K$24,0)),IF(E73=\"B\",INDEX(Lookup!$M$9:$M$24,MATCH(Z73,Lookup!$K$9:$K$24,0)),IF(E73=\"C\",INDEX(Lookup!$N$9:$N$24,MATCH(Z73,Lookup!$K$9:$K$24,0)),\"N/A\")))","v":{"$error":"#N/A"}}]
[null,null,null,null,{"$f":"INDEX(Lookup!$I$9:$I$24,MATCH('Interior Lighting'!D74,Lookup!$C$9:$C$24,0))","v":{"$error":"#N/A"}},null,null,null,{"$error":"#N/A"},null,0,{"$error":"#DIV/0!"},"N/A",{"$f":"IF($D$20=\"Space-By-Space (90.1-2010)\",INDEX(LPD2010SS,MATCH('Interior Lighting'!D74,LightingSpaceType,0)*W74),INDEX(LPD2010WB,MATCH('Interior Lighting'!D74,LightingSpaceType,0)))","v":{"$error":"#N/A"}},0,{"$error":"#N/A"},{"$error":"#N/A"},{"$error":"#N/A"},0,"",null,null,1,null,{"$error":"#N/A"},{"$error":"#N/A"},{"$f":"INDEX(Lookup!$O$9:$O$24,MATCH('Interior Lighting'!Z74,Lookup!$K$9:$K$24,0))","v":{"$error":"#N/A"}},{"$f":"IF(E74=\"A\",INDEX(Lookup!$L$9:$L$24,MATCH(Z74,Lookup!$K$9:$K$24,0)),IF(E74=\"B\",INDEX(Lookup!$M$9:$M$24,MATCH(Z74,Lookup!$K$9:$K$24,0)),IF(E74=\"C\",INDEX(Lookup!$N$9:$N$24,MATCH(Z74,Lookup!$K$9:$K$24,0)),\"N/A\")))","v":{"$error":"#N/A"}}]
[null,null,null,null,{"$f":"INDEX(Lookup!$I$9:$I$24,MATCH('Interior Lighting'!D75,Lookup!$C$9:$C$24,0))","v":{"$error":"#N/A"}},null,null,null,{"$error":"#N/A"},null,0,{"$error":"#DIV/0!"},"N/A",{"$f":"IF($D$20=\"Space-By-Space (90.1-2010)\",INDEX(LPD2010SS,MATCH('Interior Lighting'!D75,LightingSpaceType,0)*W75),INDEX(LPD2010WB,MATCH('Interior Lighting'!D75,LightingSpaceType,0)))","v":{"$error":"#N/A"}},0,{"$error":"#N/A"},{"$error":"#N/A"},{"$error":"#N/A"},0,"",null,null,1,null,{"$error":"#N/A"},{"$error":"#N/A"},{"$f":"INDEX(Lookup!$O$9:$O$24,MATCH('Interior Lighting'!Z75,Lookup!$K$9:$K$24,0))","v":{"$error":"#N/A"}},{"$f":"IF(E75=\"A\",INDEX(Lookup!$L$9:$L$24,MATCH(Z75,Lookup!$K$9:$K$24,0)),IF(E75=\"B\",INDEX(Lookup!$M$9:$M$24,MATCH(Z75,Lookup!$K$9:$K$24,0)),IF(E75=\"C\",INDEX(Lookup!$N$9:$N$24,MATCH(Z75,Lookup!$K$9:$K$24,0)),\"N/A\")))","v":{"$error":"#N/A"}}]
[null,null,null,null,{"$f":"INDEX(Lookup!$I$9:$I$24,MATCH('Interior Lighting'!D76,Lookup!$C$9:$C$24,0))","v":{"$error":"#N/A"}},null,null,null,{"$error":"#N/A"},null,0,{"$error":"#DIV/0!"},"N/A",{"$f":"IF($D$20=\"Space-By-Space (90.1-2010)\",INDEX(LPD2010SS,MATCH('Interior Lighting'!D76,LightingSpaceType,0)*W76),INDEX(LPD2010WB,MATCH('Interior Lighting'!D76,LightingSpaceType,0)))","v":{"$error":"#N/A"}},0,{"$error":"#N/A"},{"$error":"#N/A"},{"$error":"#N/A"},0,"",null,null,1,null,{"$error":"#N/A"},{"$error":"#N/A"},{"$f":"INDEX(Lookup!$O$9:$O$24,MATCH('Interior Lighting'!Z76,Lookup!$K$9:$K$24,0))","v":{"$error":"#N/A"}},{"$f":"IF(E76=\"A\",INDEX(Lookup!$L$9:$L$24,MATCH(Z76,Lookup!$K$9:$K$24,0)),IF(E76=\"B\",INDEX(Lookup!$M$9:$M$24,MATCH(Z76,Lookup!$K$9:$K$24,0)),IF(E76=\"C\",INDEX(Lookup!$N$9:$N$24,MATCH(Z76,Lookup!$K$9:$K$24,0)),\"N/A\")))","v":{"$error":"#N/A"}}]
[null,null,null,null,{"$f":"INDEX(Lookup!$I$9:$I$24,MATCH('Interior Lighting'!D77,Lookup!$C$9:$C$24,0))","v":{"$error":"#N/A"}},null,null,null,{"$error":"#N/A"},null,0,{"$error":"#DIV/0!"},"N/A",{"$f":"IF($D$20=\"Space-By-Space (90.1-2010)\",INDEX(LPD2010SS,MATCH('Interior Lighting'!D77,LightingSpaceType,0)*W77),INDEX(LPD2010WB,MATCH('Interior Lighting'!D77,LightingSpaceType,0)))","v":{"$error":"#N/A"}},0,{"$error":"#N/A"},{"$error":"#N/A"},{"$error":"#N/A"},0,"",null,null,1,null,{"$error":"#N/A"},{"$error":"#N/A"},{"$f":"INDEX(Lookup!$O$9:$O$24,MATCH('Interior Lighting'!Z77,Lookup!$K$9:$K$24,0))","v":{"$error":"#N/A"}},{"$f":"IF(E77=\"A\",INDEX(Lookup!$L$9:$L$24,MATCH(Z77,Lookup!$K$9:$K$24,0)),IF(E77=\"B\",INDEX(Lookup!$M$9:$M$24,MATCH(Z77,Lookup!$K$9:$K$24,0)),IF(E77=\"C\",INDEX(Lookup!$N$9:$N$24,MATCH(Z77,Lookup!$K$9:$K$24,0)),\"N/A\")))","v":{"$error":"#N/A"}}]
[null,null,null,null,{"$f":"INDEX(Lookup!$I$9:$I$24,MATCH('Interior Lighting'!D78,Lookup!$C$9:$C$24,0))","v":{"$error":"#N/A"}},null,null,null,{"$error":"#N/A"},null,0,{"$error":"#DIV/0!"},"N/A",{"$f":"IF($D$20=\"Space-By-Space (90.1-2010)\",INDEX(LPD2010SS,MATCH('Interior Lighting'!D78,LightingSpaceType,0)*W78),INDEX(LPD2010WB,MATCH('Interior Lighting'!D78,LightingSpaceType,0)))","v":{"$error":"#N/A"}},0,{"$error":"#N/A"},{"$error":"#N/A"},{"$error":"#N/A"},0,"",null,null,1,null,{"$error":"#N/A"},{"$error":"#N/A"},{"$f":"INDEX(Lookup!$O$9:$O$24,MATCH('Interior Lighting'!Z78,Lookup!$K$9:$K$24,0))","v":{"$error":"#N/A"}},{"$f":"IF(E78=\"A\",INDEX(Lookup!$L$9:$L$24,MATCH(Z78,Lookup!$K$9:$K$24,0)),IF(E78=\"B\",INDEX(Lookup!$M$9:$M$24,MATCH(Z78,Lookup!$K$9:$K$24,0)),IF(E78=\"C\",INDEX(Lookup!$N$9:$N$24,MATCH(Z78,Lookup!$K$9:$K$24,0)),\"N/A\")))","v":{"$error":"#N/A"}}]
[null,null,null,null,{"$f":"INDEX(Lookup!$I$9:$I$24,MATCH('Interior Lighting'!D79,Lookup!$C$9:$C$24,0))","v":{"$error":"#N/A"}},null,null,null,{"$error":"#N/A"},null,0,{"$error":"#DIV/0!"},"N/A",{"$f":"IF($D$20=\"Space-By-Space (90.1-2010)\",INDEX(LPD2010SS,MATCH('Interior Lighting'!D79,LightingSpaceType,0)*W79),INDEX(LPD2010WB,MATCH('Interior Lighting'!D79,LightingSpaceType,0)))","v":{"$error":"#N/A"}},0,{"$error":"#N/A"},{"$error":"#N/A"},{"$error":"#N/A"},0,"",null,null,1,null,{"$error":"#N/A"},{"$error":"#N/A"},{"$f":"INDEX(Lookup!$O$9:$O$24,MATCH('Interior Lighting'!Z79,Lookup!$K$9:$K$24,0))","v":{"$error":"#N/A"}},{"$f":"IF(E79=\"A\",INDEX(Lookup!$L$9:$L$24,MATCH(Z79,Lookup!$K$9:$K$24,0)),IF(E79=\"B\",INDEX(Lookup!$M$9:$M$24,MATCH(Z79,Lookup!$K$9:$K$24,0)),IF(E79=\"C\",INDEX(Lookup!$N$9:$N$24,MATCH(Z79,Lookup!$K$9:$K$24,0)),\"N/A\")))","v":{"$error":"#N/A"}}]
[null,null,null,null,{"$f":"INDEX(Lookup!$I$9:$I$24,MATCH('Interior Lighting'!D80,Lookup!$C$9:$C$24,0))","v":{"$error":"#N/A"}},null,null,null,{"$error":"#N/A"},null,0,{"$error":"#DIV/0!"},"N/A",{"$f":"IF($D$20=\"Space-By-Space (90.1-2010)\",INDEX(LPD2010SS,MATCH('Interior Lighting'!D80,LightingSpaceType,0)*W80),INDEX(LPD2010WB,MATCH('Interior Lighting'!D80,LightingSpaceType,0)))","v":{"$error":"#N/A"}},0,{"$error":"#N/A"},{"$error":"#N/A"},{"$error":"#N/A"},0,"",null,null,1,null,{"$error":"#N/A"},{"$error":"#N/A"},{"$f":"INDEX(Lookup!$O$9:$O$24,MATCH('Interior Lighting'!Z80,Lookup!$K$9:$K$24,0))","v":{"$error":"#N/A"}},{"$f":"IF(E80=\"A\",INDEX(Lookup!$L$9:$L$24,MATCH(Z80,Lookup!$K$9:$K$24,0)),IF(E80=\"B\",INDEX(Lookup!$M$9:$M$24,MATCH(Z80,Lookup!$K$9:$K$24,0)),IF(E80=\"C\",INDEX(Lookup!$N$9:$N$24,MATCH(Z80,Lookup!$K$9:$K$24,0)),\"N/A\")))","v":{"$error":"#N/A"}}]
[null,null,null,null,{"$f":"INDEX(Lookup!$I$9:$I$24,MATCH('Interior Lighting'!D81,Lookup!$C$9:$C$24,0))","v":{"$error":"#N/A"}},null,null,null,{"$error":"#N/A"},null,0,{"$error":"#DIV/0!"},"N/A",{"$f":"IF($D$20=\"Space-By-Space (90.1-2010)\",INDEX(LPD2010SS,MATCH('Interior Lighting'!D81,LightingSpaceType,0)*W81),INDEX(LPD2010WB,MATCH('Interior Lighting'!D81,LightingSpaceType,0)))","v":{"$error":"#N/A"}},0,{"$error":"#N/A"},{"$error":"#N/A"},{"$error":"#N/A"},0,"",null,null,1,null,{"$error":"#N/A"},{"$error":"#N/A"},{"$f":"INDEX(Lookup!$O$9:$O$24,MATCH('Interior Lighting'!Z81,Lookup!$K$9:$K$24,0))","v":{"$error":"#N/A"}},{"$f":"IF(E81=\"A\",INDEX(Lookup!$L$9:$L$24,MATCH(Z81,Lookup!$K$9:$K$24,0)),IF(E81=\"B\",INDEX(Lookup!$M$9:$M$24,MATCH(Z81,Lookup!$K$9:$K$24,0)),IF(E81=\"C\",INDEX(Lookup!$N$9:$N$24,MATCH(Z81,Lookup!$K$9:$K$24,0)),\"N/A\")))","v":{"$error":"#N/A"}}]
[null,null,null,null,{"$f":"INDEX(Lookup!$I$9:$I$24,MATCH('Interior Lighting'!D82,Lookup!$C$9:$C$24,0))","v":{"$error":"#N/A"}},null,null,null,{"$error":"#N/A"},null,0,{"$error":"#DIV/0!"},"N/A",{"$f":"IF($D$20=\"Space-By-Space (90.1-2010)\",INDEX(LPD2010SS,MATCH('Interior Lighting'!D82,LightingSpaceType,0)*W82),INDEX(LPD2010WB,MATCH('Interior Lighting'!D82,LightingSpaceType,0)))","v":{"$error":"#N/A"}},0,{"$error":"#N/A"},{"$error":"#N/A"},{"$error":"#N/A"},0,"",null,null,1,null,{"$error":"#N/A"},{"$error":"#N/A"},{"$f":"INDEX(Lookup!$O$9:$O$24,MATCH('Interior Lighting'!Z82,Lookup!$K$9:$K$24,0))","v":{"$error":"#N/A"}},{"$f":"IF(E82=\"A\",INDEX(Lookup!$L$9:$L$24,MATCH(Z82,Lookup!$K$9:$K$24,0)),IF(E82=\"B\",INDEX(Lookup!$M$9:$M$24,MATCH(Z82,Lookup!$K$9:$K$24,0)),IF(E82=\"C\",INDEX(Lookup!$N$9:$N$24,MATCH(Z82,Lookup!$K$9:$K$24,0)),\"N/A\")))","v":{"$error":"#N/A"}}]
[null,null,null,null,{"$f":"INDEX(Lookup!$I$9:$I$24,MATCH('Interior Lighting'!D83,Lookup!$C$9:$C$24,0))","v":{"$error":"#N/A"}},null,null,null,{"$error":"#N/A"},null,0,{"$error":"#DIV/0!"},"N/A",{"$f":"IF($D$20=\"Space-By-Space (90.1-2010)\",INDEX(LPD2010SS,MATCH('Interior Lighting'!D83,LightingSpaceType,0)*W83),INDEX(LPD2010WB,MATCH('Interior Lighting'!D83,LightingSpaceType,0)))","v":{"$error":"#N/A"}},0,{"$error":"#N/A"},{"$error":"#N/A"},{"$error":"#N/A"},0,"",null,null,1,null,{"$error":"#N/A"},{"$error":"#N/A"},{"$f":"INDEX(Lookup!$O$9:$O$24,MATCH('Interior Lighting'!Z83,Lookup!$K$9:$K$24,0))","v":{"$error":"#N/A"}},{"$f":"IF(E83=\"A\",INDEX(Lookup!$L$9:$L$24,MATCH(Z83,Lookup!$K$9:$K$24,0)),IF(E83=\"B\",INDEX(Lookup!$M$9:$M$24,MATCH(Z83,Lookup!$K$9:$K$24,0)),IF(E83=\"C\",INDEX(Lookup!$N$9:$N$24,MATCH(Z83,Lookup!$K$9:$K$24,0)),\"N/A\")))","v":{"$error":"#N/A"}}]
[null,null,null,null,{"$f":"INDEX(Lookup!$I$9:$I$24,MATCH('Interior Lighting'!D84,Lookup!$C$9:$C$24,0))","v":{"$error":"#N/A"}},null,null,null,{"$error":"#N/A"},null,0,{"$error":"#DIV/0!"},"N/A",{"$f":"IF($D$20=\"Space-By-Space (90.1-2010)\",INDEX(LPD2010SS,MATCH('Interior Lighting'!D84,LightingSpaceType,0)*W84),INDEX(LPD2010WB,MATCH('Interior Lighting'!D84,LightingSpaceType,0)))","v":{"$error":"#N/A"}},0,{"$error":"#N/A"},{"$error":"#N/A"},{"$error":"#N/A"},0,"",null,null,1,null,{"$error":"#N/A"},{"$error":"#N/A"},{"$f":"INDEX(Lookup!$O$9:$O$24,MATCH('Interior Lighting'!Z84,Lookup!$K$9:$K$24,0))","v":{"$error":"#N/A"}},{"$f":"IF(E84=\"A\",INDEX(Lookup!$L$9:$L$24,MATCH(Z84,Lookup!$K$9:$K$24,0)),IF(E84=\"B\",INDEX(Lookup!$M$9:$M$24,MATCH(Z84,Lookup!$K$9:$K$24,0)),IF(E84=\"C\",INDEX(Lookup!$N$9:$N$24,MATCH(Z84,Lookup!$K$9:$K$24,0)),\"N/A\")))","v":{"$error":"#N/A"}}]
[null,null,null,null,{"$f":"INDEX(Lookup!$I$9:$I$24,MATCH('Interior Lighting'!D85,Lookup!$C$9:$C$24,0))","v":{"$error":"#N/A"}},null,null,null,{"$error":"#N/A"},null,0,{"$error":"#DIV/0!"},"N/A",{"$f":"IF($D$20=\"Space-By-Space (90.1-2010)\",INDEX(LPD2010SS,MATCH('Interior Lighting'!D85,LightingSpaceType,0)*W85),INDEX(LPD2010WB,MATCH('Interior Lighting'!D85,LightingSpaceType,0)))","v":{"$error":"#N/A"}},0,{"$error":"#N/A"},{"$error":"#N/A"},{"$error":"#N/A"},0,"",null,null,1,null,{"$error":"#N/A"},{"$error":"#N/A"},{"$f":"INDEX(Lookup!$O$9:$O$24,MATCH('Interior Lighting'!Z85,Lookup!$K$9:$K$24,0))","v":{"$error":"#N/A"}},{"$f":"IF(E85=\"A\",INDEX(Lookup!$L$9:$L$24,MATCH(Z85,Lookup!$K$9:$K$24,0)),IF(E85=\"B\",INDEX(Lookup!$M$9:$M$24,MATCH(Z85,Lookup!$K$9:$K$24,0)),IF(E85=\"C\",INDEX(Lookup!$N$9:$N$24,MATCH(Z85,Lookup!$K$9:$K$24,0)),\"N/A\")))","v":{"$error":"#N/A"}}]
[null,null,null,null,{"$f":"INDEX(Lookup!$I$9:$I$24,MATCH('Interior Lighting'!D86,Lookup!$C$9:$C$24,0))","v":{"$error":"#N/A"}},null,null,null,{"$error":"#N/A"},null,0,{"$error":"#DIV/0!"},"N/A",{"$f":"IF($D$20=\"Space-By-Space (90.1-2010)\",INDEX(LPD2010SS,MATCH('Interior Lighting'!D86,LightingSpaceType,0)*W86),INDEX(LPD2010WB,MATCH('Interior Lighting'!D86,LightingSpaceType,0)))","v":{"$error":"#N/A"}},0,{"$error":"#N/A"},{"$error":"#N/A"},{"$error":"#N/A"},0,"",null,null,1,null,{"$error":"#N/A"},{"$error":"#N/A"},{"$f":"INDEX(Lookup!$O$9:$O$24,MATCH('Interior Lighting'!Z86,Lookup!$K$9:$K$24,0))","v":{"$error":"#N/A"}},{"$f":"IF(E86=\"A\",INDEX(Lookup!$L$9:$L$24,MATCH(Z86,Lookup!$K$9:$K$24,0)),IF(E86=\"B\",INDEX(Lookup!$M$9:$M$24,MATCH(Z86,Lookup!$K$9:$K$24,0)),IF(E86=\"C\",INDEX(Lookup!$N$9:$N$24,MATCH(Z86,Lookup!$K$9:$K$24,0)),\"N/A\")))","v":{"$error":"#N/A"}}]
[null,null,null,null,{"$f":"INDEX(Lookup!$I$9:$I$24,MATCH('Interior Lighting'!D87,Lookup!$C$9:$C$24,0))","v":{"$error":"#N/A"}},null,null,null,{"$error":"#N/A"},null,0,{"$error":"#DIV/0!"},"N/A",{"$f":"IF($D$20=\"Space-By-Space (90.1-2010)\",INDEX(LPD2010SS,MATCH('Interior Lighting'!D87,LightingSpaceType,0)*W87),INDEX(LPD2010WB,MATCH('Interior Lighting'!D87,LightingSpaceType,0)))","v":{"$error":"#N/A"}},0,{"$error":"#N/A"},{"$error":"#N/A"},{"$error":"#N/A"},0,"",null,null,1,null,{"$error":"#N/A"},{"$error":"#N/A"},{"$f":"INDEX(Lookup!$O$9:$O$24,MATCH('Interior Lighting'!Z87,Lookup!$K$9:$K$24,0))","v":{"$error":"#N/A"}},{"$f":"IF(E87=\"A\",INDEX(Lookup!$L$9:$L$24,MATCH(Z87,Lookup!$K$9:$K$24,0)),IF(E87=\"B\",INDEX(Lookup!$M$9:$M$24,MATCH(Z87,Lookup!$K$9:$K$24,0)),IF(E87=\"C\",INDEX(Lookup!$N$9:$N$24,MATCH(Z87,Lookup!$K$9:$K$24,0)),\"N/A\")))","v":{"$error":"#N/A"}}]
[null,null,null,null,{"$f":"INDEX(Lookup!$I$9:$I$24,MATCH('Interior Lighting'!D88,Lookup!$C$9:$C$24,0))","v":{"$error":"#N/A"}},null,null,null,{"$error":"#N/A"},null,0,{"$error":"#DIV/0!"},"N/A",{"$f":"IF($D$20=\"Space-By-Space (90.1-2010)\",INDEX(LPD2010SS,MATCH('Interior Lighting'!D88,LightingSpaceType,0)*W88),INDEX(LPD2010WB,MATCH('Interior Lighting'!D88,LightingSpaceType,0)))","v":{"$error":"#N/A"}},0,{"$error":"#N/A"},{"$error":"#N/A"},{"$error":"#N/A"},0,"",null,null,1,null,{"$error":"#N/A"},{"$error":"#N/A"},{"$f":"INDEX(Lookup!$O$9:$O$24,MATCH('Interior Lighting'!Z88,Lookup!$K$9:$K$24,0))","v":{"$error":"#N/A"}},{"$f":"IF(E88=\"A\",INDEX(Lookup!$L$9:$L$24,MATCH(Z88,Lookup!$K$9:$K$24,0)),IF(E88=\"B\",INDEX(Lookup!$M$9:$M$24,MATCH(Z88,Lookup!$K$9:$K$24,0)),IF(E88=\"C\",INDEX(Lookup!$N$9:$N$24,MATCH(Z88,Lookup!$K$9:$K$24,0)),\"N/A\")))","v":{"$error":"#N/A"}}]
[null,null,null,null,{"$f":"INDEX(Lookup!$I$9:$I$24,MATCH('Interior Lighting'!D89,Lookup!$C$9:$C$24,0))","v":{"$error":"#N/A"}},null,null,null,{"$error":"#N/A"},null,0,{"$error":"#DIV/0!"},"N/A",{"$f":"IF($D$20=\"Space-By-Space (90.1-2010)\",INDEX(LPD2010SS,MATCH('Interior Lighting'!D89,LightingSpaceType,0)*W89),INDEX(LPD2010WB,MATCH('Interior Lighting'!D89,LightingSpaceType,0)))","v":{"$error":"#N/A"}},0,{"$error":"#N/A"},{"$error":"#N/A"},{"$error":"#N/A"},0,"",null,null,1,null,{"$error":"#N/A"},{"$error":"#N/A"},{"$f":"INDEX(Lookup!$O$9:$O$24,MATCH('Interior Lighting'!Z89,Lookup!$K$9:$K$24,0))","v":{"$error":"#N/A"}},{"$f":"IF(E89=\"A\",INDEX(Lookup!$L$9:$L$24,MATCH(Z89,Lookup!$K$9:$K$24,0)),IF(E89=\"B\",INDEX(Lookup!$M$9:$M$24,MATCH(Z89,Lookup!$K$9:$K$24,0)),IF(E89=\"C\",INDEX(Lookup!$N$9:$N$24,MATCH(Z89,Lookup!$K$9:$K$24,0)),\"N/A\")))","v":{"$error":"#N/A"}}]
[null,null,null,null,{"$f":"INDEX(Lookup!$I$9:$I$24,MATCH('Interior Lighting'!D90,Lookup!$C$9:$C$24,0))","v":{"$error":"#N/A"}},null,null,null,{"$error":"#N/A"},null,0,{"$error":"#DIV/0!"},"N/A",{"$f":"IF($D$20=\"Space-By-Space (90.1-2010)\",INDEX(LPD2010SS,MATCH('Interior Lighting'!D90,LightingSpaceType,0)*W90),INDEX(LPD2010WB,MATCH('Interior Lighting'!D90,LightingSpaceType,0)))","v":{"$error":"#N/A"}},0,{"$error":"#N/A"},{"$error":"#N/A"},{"$error":"#N/A"},0,"",null,null,1,null,{"$error":"#N/A"},{"$error":"#N/A"},{"$f":"INDEX(Lookup!$O$9:$O$24,MATCH('Interior Lighting'!Z90,Lookup!$K$9:$K$24,0))","v":{"$error":"#N/A"}},{"$f":"IF(E90=\"A\",INDEX(Lookup!$L$9:$L$24,MATCH(Z90,Lookup!$K$9:$K$24,0)),IF(E90=\"B\",INDEX(Lookup!$M$9:$M$24,MATCH(Z90,Lookup!$K$9:$K$24,0)),IF(E90=\"C\",INDEX(Lookup!$N$9:$N$24,MATCH(Z90,Lookup!$K$9:$K$24,0)),\"N/A\")))","v":{"$error":"#N/A"}}]
[null,null,null,null,{"$f":"INDEX(Lookup!$I$9:$I$24,MATCH('Interior Lighting'!D91,Lookup!$C$9:$C$24,0))","v":{"$error":"#N/A"}},null,null,null,{"$error":"#N/A"},null,0,{"$error":"#DIV/0!"},"N/A",{"$f":"IF($D$20=\"Space-By-Space (90.1-2010)\",INDEX(LPD2010SS,MATCH('Interior Lighting'!D91,LightingSpaceType,0)*W91),INDEX(LPD2010WB,MATCH('Interior Lighting'!D91,LightingSpaceType,0)))","v":{"$error":"#N/A"}},0,{"$error":"#N/A"},{"$error":"#N/A"},{"$error":"#N/A"},0,"",null,null,1,null,{"$error":"#N/A"},{"$error":"#N/A"},{"$f":"INDEX(Lookup!$O$9:$O$24,MATCH('Interior Lighting'!Z91,Lookup!$K$9:$K$24,0))","v":{"$error":"#N/A"}},{"$f":"IF(E91=\"A\",INDEX(Lookup!$L$9:$L$24,MATCH(Z91,Lookup!$K$9:$K$24,0)),IF(E91=\"B\",INDEX(Lookup!$M$9:$M$24,MATCH(Z91,Lookup!$K$9:$K$24,0)),IF(E91=\"C\",INDEX(Lookup!$N$9:$N$24,MATCH(Z91,Lookup!$K$9:$K$24,0)),\"N/A\")))","v":{"$error":"#N/A"}}]
[null,null,null,null,{"$f":"INDEX(Lookup!$I$9:$I$24,MATCH('Interior Lighting'!D92,Lookup!$C$9:$C$24,0))","v":{"$error":"#N/A"}},null,null,null,{"$error":"#N/A"},null,0,{"$error":"#DIV/0!"},"N/A",{"$f":"IF($D$20=\"Space-By-Space (90.1-2010)\",INDEX(LPD2010SS,MATCH('Interior Lighting'!D92,LightingSpaceType,0)*W92),INDEX(LPD2010WB,MATCH('Interior Lighting'!D92,LightingSpaceType,0)))","v":{"$error":"#N/A"}},0,{"$error":"#N/A"},{"$error":"#N/A"},{"$error":"#N/A"},0,"",null,null,1,null,{"$error":"#N/A"},{"$error":"#N/A"},{"$f":"INDEX(Lookup!$O$9:$O$24,MATCH('Interior Lighting'!Z92,Lookup!$K$9:$K$24,0))","v":{"$error":"#N/A"}},{"$f":"IF(E92=\"A\",INDEX(Lookup!$L$9:$L$24,MATCH(Z92,Lookup!$K$9:$K$24,0)),IF(E92=\"B\",INDEX(Lookup!$M$9:$M$24,MATCH(Z92,Lookup!$K$9:$K$24,0)),IF(E92=\"C\",INDEX(Lookup!$N$9:$N$24,MATCH(Z92,Lookup!$K$9:$K$24,0)),\"N/A\")))","v":{"$error":"#N/A"}}]
[null,null,null,null,{"$f":"INDEX(Lookup!$I$9:$I$24,MATCH('Interior Lighting'!D93,Lookup!$C$9:$C$24,0))","v":{"$error":"#N/A"}},null,null,null,{"$error":"#N/A"},null,0,{"$error":"#DIV/0!"},"N/A",{"$f":"IF($D$20=\"Space-By-Space (90.1-2010)\",INDEX(LPD2010SS,MATCH('Interior Lighting'!D93,LightingSpaceType,0)*W93),INDEX(LPD2010WB,MATCH('Interior Lighting'!D93,LightingSpaceType,0)))","v":{"$error":"#N/A"}},0,{"$error":"#N/A"},{"$error":"#N/A"},{"$error":"#N/A"},0,"",null,null,1,null,{"$error":"#N/A"},{"$error":"#N/A"},{"$f":"INDEX(Lookup!$O$9:$O$24,MATCH('Interior Lighting'!Z93,Lookup!$K$9:$K$24,0))","v":{"$error":"#N/A"}},{"$f":"IF(E93=\"A\",INDEX(Lookup!$L$9:$L$24,MATCH(Z93,Lookup!$K$9:$K$24,0)),IF(E93=\"B\",INDEX(Lookup!$M$9:$M$24,MATCH(Z93,Lookup!$K$9:$K$24,0)),IF(E93=\"C\",INDEX(Lookup!$N$9:$N$24,MATCH(Z93,Lookup!$K$9:$K$24,0)),\"N/A\")))","v":{"$error":"#N/A"}}]
[null,null,null,null,{"$f":"INDEX(Lookup!$I$9:$I$24,MATCH('Interior Lighting'!D94,Lookup!$C$9:$C$24,0))","v":{"$error":"#N/A"}},null,null,null,{"$error":"#N/A"},null,0,{"$error":"#DIV/0!"},"N/A",{"$f":"IF($D$20=\"Space-By-Space (90.1-2010)\",INDEX(LPD2010SS,MATCH('Interior Lighting'!D94,LightingSpaceType,0)*W94),INDEX(LPD2010WB,MATCH('Interior Lighting'!D94,LightingSpaceType,0)))","v":{"$error":"#N/A"}},0,{"$f":"Y94*AA94*AB94","v":{"$error":"#N/A"}},{"$error":"#N/A"},{"$f":"INDEX(Footcandles,MATCH(D94,LightingSpaceType,0))","v":{"$error":"#N/A"}},{"$f":"J94*B94","v":0},{"$f":"IF(F94>0, IF(Q94<R94, \"Insufficient lighting to meet IESNA footcandle recommendations.\", \"\"), \"\")","v":""},null,null,{"$f":"IF(A94=\"Yes\",1.2,1)","v":1},null,{"$f":"INDEX($M$4:$M$27,MATCH(G94,$J$4:$J$27,0))","v":{"$error":"#N/A"}},{"$f":"INDEX($K$4:$K$27,MATCH(G94,$J$4:$J$27,0))","v":{"$error":"#N/A"}},{"$f":"INDEX(Lookup!$O$9:$O$24,MATCH('Interior Lighting'!Z94,Lookup!$K$9:$K$24,0))","v":{"$error":"#N/A"}},{"$f":"IF(E94=\"A\",INDEX(Lookup!$L$9:$L$24,MATCH(Z94,Lookup!$K$9:$K$24,0)),IF(E94=\"B\",INDEX(Lookup!$M$9:$M$24,MATCH(Z94,Lookup!$K$9:$K$24,0)),IF(E94=\"C\",INDEX(Lookup!$N$9:$N$24,MATCH(Z94,Lookup!$K$9:$K$24,0)),\"N/A\")))","v":{"$error":"#N/A"}}]
[null,null,null,null,{"$f":"INDEX(Lookup!$I$9:$I$24,MATCH('Interior Lighting'!D95,Lookup!$C$9:$C$24,0))","v":{"$error":"#N/A"}},null,null,null,{"$f":"INDEX($L$4:$L$27,MATCH(G95,$J$4:$J$27,0))","v":{"$error":"#N/A"}},null,{"$f":"IF(F95>0, F95*I95*J95, 0)","v":0},{"$f":"IF(D95=\"Exit Signs\",\"convert to kW\", K95/S95)","v":{"$error":"#DIV/0!"}},{"$f":"IF(H95=\"Yes\",IF(D95=\"Corridor/Transition\",0.75*L95,1*L95),\"N/A\")","v":"N/A"},{"$f":"IF($D$20=\"Space-By-Space (90.1-2010)\",INDEX(LPD2010SS,MATCH('Interior Lighting'!D95,LightingSpaceType,0)*W95),INDEX(LPD2010WB,MATCH('Interior Lighting'!D95,LightingSpaceType,0)))","v":{"$error":"#N/A"}},{"$f":"IF(D95=\"Exit Signs\", 5*F95*J95, IF(B95>0, N95*S95, 0))","v":0},{"$error":"#N/A"},{"$f":"IF(D95=\"Exit Signs\",\"NA\", K95*P95/S95)","v":{"$error":"#N/A"}},{"$error":"#N/A"},0,"",null,null,1,null,{"$error":"#N/A"},{"$error":"#N/A"},{"$f":"INDEX(Lookup!$O$9:$O$24,MATCH('Interior Lighting'!Z95,Lookup!$K$9:$K$24,0))","v":{"$error":"#N/A"}},{"$f":"IF(E95=\"A\",INDEX(Lookup!$L$9:$L$24,MATCH(Z95,Lookup!$K$9:$K$24,0)),IF(E95=\"B\",INDEX(Lookup!$M$9:$M$24,MATCH(Z95,Lookup!$K$9:$K$24,0)),IF(E95=\"C\",INDEX(Lookup!$N$9:$N$24,MATCH(Z95,Lookup!$K$9:$K$24,0)),\"N/A\")))","v":{"$error":"#N/A"}}]
[null,null,null,null,{"$f":"INDEX(Lookup!$I$9:$I$24,MATCH('Interior Lighting'!D96,Lookup!$C$9:$C$24,0))","v":{"$error":"#N/A"}},null,null,null,{"$error":"#N/A"},null,0,{"$error":"#DIV/0!"},"N/A",{"$f":"IF($D$20=\"Space-By-Space (90.1-2010)\",INDEX(LPD2010SS,MATCH('Interior Lighting'!D96,LightingSpaceType,0)*W96),INDEX(LPD2010WB,MATCH('Interior Lighting'!D96,LightingSpaceType,0)))","v":{"$error":"#N/A"}},0,{"$error":"#N/A"},{"$error":"#N/A"},{"$error":"#N/A"},0,"",null,null,1,null,{"$error":"#N/A"},{"$error":"#N/A"},{"$f":"INDEX(Lookup!$O$9:$O$24,MATCH('Interior Lighting'!Z96,Lookup!$K$9:$K$24,0))","v":{"$error":"#N/A"}},{"$f":"IF(E96=\"A\",INDEX(Lookup!$L$9:$L$24,MATCH(Z96,Lookup!$K$9:$K$24,0)),IF(E96=\"B\",INDEX(Lookup!$M$9:$M$24,MATCH(Z96,Lookup!$K$9:$K$24,0)),IF(E96=\"C\",INDEX(Lookup!$N$9:$N$24,MATCH(Z96,Lookup!$K$9:$K$24,0)),\"N/A\")))","v":{"$error":"#N/A"}}]
[null,null,null,null,{"$f":"INDEX(Lookup!$I$9:$I$24,MATCH('Interior Lighting'!D97,Lookup!$C$9:$C$24,0))","v":{"$error":"#N/A"}},null,null,null,{"$error":"#N/A"},null,0,{"$error":"#DIV/0!"},"N/A",{"$f":"IF($D$20=\"Space-By-Space (90.1-2010)\",INDEX(LPD2010SS,MATCH('Interior Lighting'!D97,LightingSpaceType,0)*W97),INDEX(LPD2010WB,MATCH('Interior Lighting'!D97,LightingSpaceType,0)))","v":{"$error":"#N/A"}},0,{"$error":"#N/A"},{"$error":"#N/A"},{"$error":"#N/A"},0,"",null,null,1,null,{"$error":"#N/A"},{"$error":"#N/A"},{"$f":"INDEX(Lookup!$O$9:$O$24,MATCH('Interior Lighting'!Z97,Lookup!$K$9:$K$24,0))","v":{"$error":"#N/A"}},{"$f":"IF(E97=\"A\",INDEX(Lookup!$L$9:$L$24,MATCH(Z97,Lookup!$K$9:$K$24,0)),IF(E97=\"B\",INDEX(Lookup!$M$9:$M$24,MATCH(Z97,Lookup!$K$9:$K$24,0)),IF(E97=\"C\",INDEX(Lookup!$N$9:$N$24,MATCH(Z97,Lookup!$K$9:$K$24,0)),\"N/A\")))","v":{"$error":"#N/A"}}]
[null,null,null,null,{"$f":"INDEX(Lookup!$I$9:$I$24,MATCH('Interior Lighting'!D98,Lookup!$C$9:$C$24,0))","v":{"$error":"#N/A"}},null,null,null,{"$error":"#N/A"},null,0,{"$error":"#DIV/0!"},"N/A",{"$f":"IF($D$20=\"Space-By-Space (90.1-2010)\",INDEX(LPD2010SS,MATCH('Interior Lighting'!D98,LightingSpaceType,0)*W98),INDEX(LPD2010WB,MATCH('Interior Lighting'!D98,LightingSpaceType,0)))","v":{"$error":"#N/A"}},0,{"$error":"#N/A"},{"$error":"#N/A"},{"$error":"#N/A"},0,"",null,null,1,null,{"$error":"#N/A"},{"$error":"#N/A"},{"$f":"INDEX(Lookup!$O$9:$O$24,MATCH('Interior Lighting'!Z98,Lookup!$K$9:$K$24,0))","v":{"$error":"#N/A"}},{"$f":"IF(E98=\"A\",INDEX(Lookup!$L$9:$L$24,MATCH(Z98,Lookup!$K$9:$K$24,0)),IF(E98=\"B\",INDEX(Lookup!$M$9:$M$24,MATCH(Z98,Lookup!$K$9:$K$24,0)),IF(E98=\"C\",INDEX(Lookup!$N$9:$N$24,MATCH(Z98,Lookup!$K$9:$K$24,0)),\"N/A\")))","v":{"$error":"#N/A"}}]
[null,null,null,null,{"$f":"INDEX(Lookup!$I$9:$I$24,MATCH('Interior Lighting'!D99,Lookup!$C$9:$C$24,0))","v":{"$error":"#N/A"}},null,null,null,{"$error":"#N/A"},null,0,{"$error":"#DIV/0!"},"N/A",{"$f":"IF($D$20=\"Space-By-Space (90.1-2010)\",INDEX(LPD2010SS,MATCH('Interior Lighting'!D99,LightingSpaceType,0)*W99),INDEX(LPD2010WB,MATCH('Interior Lighting'!D99,LightingSpaceType,0)))","v":{"$error":"#N/A"}},0,{"$error":"#N/A"},{"$error":"#N/A"},{"$error":"#N/A"},0,"",null,null,1,null,{"$error":"#N/A"},{"$error":"#N/A"},{"$f":"INDEX(Lookup!$O$9:$O$24,MATCH('Interior Lighting'!Z99,Lookup!$K$9:$K$24,0))","v":{"$error":"#N/A"}},{"$f":"IF(E99=\"A\",INDEX(Lookup!$L$9:$L$24,MATCH(Z99,Lookup!$K$9:$K$24,0)),IF(E99=\"B\",INDEX(Lookup!$M$9:$M$24,MATCH(Z99,Lookup!$K$9:$K$24,0)),IF(E99=\"C\",INDEX(Lookup!$N$9:$N$24,MATCH(Z99,Lookup!$K$9:$K$24,0)),\"N/A\")))","v":{"$error":"#N/A"}}]
[null,null,null,null,{"$f":"INDEX(Lookup!$I$9:$I$24,MATCH('Interior Lighting'!D100,Lookup!$C$9:$C$24,0))","v":{"$error":"#N/A"}},null,null,null,{"$error":"#N/A"},null,0,{"$error":"#DIV/0!"},"N/A",{"$f":"IF($D$20=\"Space-By-Space (90.1-2010)\",INDEX(LPD2010SS,MATCH('Interior Lighting'!D100,LightingSpaceType,0)*W100),INDEX(LPD2010WB,MATCH('Interior Lighting'!D100,LightingSpaceType,0)))","v":{"$error":"#N/A"}},0,{"$error":"#N/A"},{"$error":"#N/A"},{"$error":"#N/A"},0,"",null,null,1,null,{"$error":"#N/A"},{"$error":"#N/A"},{"$f":"INDEX(Lookup!$O$9:$O$24,MATCH('Interior Lighting'!Z100,Lookup!$K$9:$K$24,0))","v":{"$error":"#N/A"}},{"$f":"IF(E100=\"A\",INDEX(Lookup!$L$9:$L$24,MATCH(Z100,Lookup!$K$9:$K$24,0)),IF(E100=\"B\",INDEX(Lookup!$M$9:$M$24,MATCH(Z100,Lookup!$K$9:$K$24,0)),IF(E100=\"C\",INDEX(Lookup!$N$9:$N$24,MATCH(Z100,Lookup!$K$9:$K$24,0)),\"N/A\")))","v":{"$error":"#N/A"}}]
[null,null,null,null,{"$f":"INDEX(Lookup!$I$9:$I$24,MATCH('Interior Lighting'!D101,Lookup!$C$9:$C$24,0))","v":{"$error":"#N/A"}},null,null,null,{"$error":"#N/A"},null,0,{"$error":"#DIV/0!"},"N/A",{"$f":"IF($D$20=\"Space-By-Space (90.1-2010)\",INDEX(LPD2010SS,MATCH('Interior Lighting'!D101,LightingSpaceType,0)*W101),INDEX(LPD2010WB,MATCH('Interior Lighting'!D101,LightingSpaceType,0)))","v":{"$error":"#N/A"}},0,{"$error":"#N/A"},{"$error":"#N/A"},{"$error":"#N/A"},0,"",null,null,1,null,{"$error":"#N/A"},{"$error":"#N/A"},{"$f":"INDEX(Lookup!$O$9:$O$24,MATCH('Interior Lighting'!Z101,Lookup!$K$9:$K$24,0))","v":{"$error":"#N/A"}},{"$f":"IF(E101=\"A\",INDEX(Lookup!$L$9:$L$24,MATCH(Z101,Lookup!$K$9:$K$24,0)),IF(E101=\"B\",INDEX(Lookup!$M$9:$M$24,MATCH(Z101,Lookup!$K$9:$K$24,0)),IF(E101=\"C\",INDEX(Lookup!$N$9:$N$24,MATCH(Z101,Lookup!$K$9:$K$24,0)),\"N/A\")))","v":{"$error":"#N/A"}}]
[null,null,null,null,{"$f":"INDEX(Lookup!$I$9:$I$24,MATCH('Interior Lighting'!D102,Lookup!$C$9:$C$24,0))","v":{"$error":"#N/A"}},null,null,null,{"$error":"#N/A"},null,0,{"$error":"#DIV/0!"},"N/A",{"$f":"IF($D$20=\"Space-By-Space (90.1-2010)\",INDEX(LPD2010SS,MATCH('Interior Lighting'!D102,LightingSpaceType,0)*W102),INDEX(LPD2010WB,MATCH('Interior Lighting'!D102,LightingSpaceType,0)))","v":{"$error":"#N/A"}},0,{"$error":"#N/A"},{"$error":"#N/A"},{"$error":"#N/A"},0,"",null,null,1,null,{"$error":"#N/A"},{"$error":"#N/A"},{"$f":"INDEX(Lookup!$O$9:$O$24,MATCH('Interior Lighting'!Z102,Lookup!$K$9:$K$24,0))","v":{"$error":"#N/A"}},{"$f":"IF(E102=\"A\",INDEX(Lookup!$L$9:$L$24,MATCH(Z102,Lookup!$K$9:$K$24,0)),IF(E102=\"B\",INDEX(Lookup!$M$9:$M$24,MATCH(Z102,Lookup!$K$9:$K$24,0)),IF(E102=\"C\",INDEX(Lookup!$N$9:$N$24,MATCH(Z102,Lookup!$K$9:$K$24,0)),\"N/A\")))","v":{"$error":"#N/A"}}]
[null,null,null,null,{"$f":"INDEX(Lookup!$I$9:$I$24,MATCH('Interior Lighting'!D103,Lookup!$C$9:$C$24,0))","v":{"$error":"#N/A"}},null,null,null,{"$error":"#N/A"},null,0,{"$error":"#DIV/0!"},"N/A",{"$f":"IF($D$20=\"Space-By-Space (90.1-2010)\",INDEX(LPD2010SS,MATCH('Interior Lighting'!D103,LightingSpaceType,0)*W103),INDEX(LPD2010WB,MATCH('Interior Lighting'!D103,LightingSpaceType,0)))","v":{"$error":"#N/A"}},0,{"$error":"#N/A"},{"$error":"#N/A"},{"$error":"#N/A"},0,"",null,null,1,null,{"$error":"#N/A"},{"$error":"#N/A"},{"$f":"INDEX(Lookup!$O$9:$O$24,MATCH('Interior Lighting'!Z103,Lookup!$K$9:$K$24,0))","v":{"$error":"#N/A"}},{"$f":"IF(E103=\"A\",INDEX(Lookup!$L$9:$L$24,MATCH(Z103,Lookup!$K$9:$K$24,0)),IF(E103=\"B\",INDEX(Lookup!$M$9:$M$24,MATCH(Z103,Lookup!$K$9:$K$24,0)),IF(E103=\"C\",INDEX(Lookup!$N$9:$N$24,MATCH(Z103,Lookup!$K$9:$K$24,0)),\"N/A\")))","v":{"$error":"#N/A"}}]
[null,null,null,null,{"$f":"INDEX(Lookup!$I$9:$I$24,MATCH('Interior Lighting'!D104,Lookup!$C$9:$C$24,0))","v":{"$error":"#N/A"}},null,null,null,{"$error":"#N/A"},null,0,{"$error":"#DIV/0!"},"N/A",{"$f":"IF($D$20=\"Space-By-Space (90.1-2010)\",INDEX(LPD2010SS,MATCH('Interior Lighting'!D104,LightingSpaceType,0)*W104),INDEX(LPD2010WB,MATCH('Interior Lighting'!D104,LightingSpaceType,0)))","v":{"$error":"#N/A"}},0,{"$error":"#N/A"},{"$error":"#N/A"},{"$error":"#N/A"},0,"",null,null,1,null,{"$error":"#N/A"},{"$error":"#N/A"},{"$f":"INDEX(Lookup!$O$9:$O$24,MATCH('Interior Lighting'!Z104,Lookup!$K$9:$K$24,0))","v":{"$error":"#N/A"}},{"$f":"IF(E104=\"A\",INDEX(Lookup!$L$9:$L$24,MATCH(Z104,Lookup!$K$9:$K$24,0)),IF(E104=\"B\",INDEX(Lookup!$M$9:$M$24,MATCH(Z104,Lookup!$K$9:$K$24,0)),IF(E104=\"C\",INDEX(Lookup!$N$9:$N$24,MATCH(Z104,Lookup!$K$9:$K$24,0)),\"N/A\")))","v":{"$error":"#N/A"}}]
[null,null,null,null,{"$f":"INDEX(Lookup!$I$9:$I$24,MATCH('Interior Lighting'!D105,Lookup!$C$9:$C$24,0))","v":{"$error":"#N/A"}},null,null,null,{"$error":"#N/A"},null,0,{"$error":"#DIV/0!"},"N/A",{"$f":"IF($D$20=\"Space-By-Space (90.1-2010)\",INDEX(LPD2010SS,MATCH('Interior Lighting'!D105,LightingSpaceType,0)*W105),INDEX(LPD2010WB,MATCH('Interior Lighting'!D105,LightingSpaceType,0)))","v":{"$error":"#N/A"}},0,{"$error":"#N/A"},{"$error":"#N/A"},{"$error":"#N/A"},0,"",null,null,1,null,{"$error":"#N/A"},{"$error":"#N/A"},{"$f":"INDEX(Lookup!$O$9:$O$24,MATCH('Interior Lighting'!Z105,Lookup!$K$9:$K$24,0))","v":{"$error":"#N/A"}},{"$f":"IF(E105=\"A\",INDEX(Lookup!$L$9:$L$24,MATCH(Z105,Lookup!$K$9:$K$24,0)),IF(E105=\"B\",INDEX(Lookup!$M$9:$M$24,MATCH(Z105,Lookup!$K$9:$K$24,0)),IF(E105=\"C\",INDEX(Lookup!$N$9:$N$24,MATCH(Z105,Lookup!$K$9:$K$24,0)),\"N/A\")))","v":{"$error":"#N/A"}}]
[null,null,null,null,{"$f":"INDEX(Lookup!$I$9:$I$24,MATCH('Interior Lighting'!D106,Lookup!$C$9:$C$24,0))","v":{"$error":"#N/A"}},null,null,null,{"$error":"#N/A"},null,0,{"$error":"#DIV/0!"},"N/A",{"$f":"IF($D$20=\"Space-By-Space (90.1-2010)\",INDEX(LPD2010SS,MATCH('Interior Lighting'!D106,LightingSpaceType,0)*W106),INDEX(LPD2010WB,MATCH('Interior Lighting'!D106,LightingSpaceType,0)))","v":{"$error":"#N/A"}},0,{"$error":"#N/A"},{"$error":"#N/A"},{"$error":"#N/A"},0,"",null,null,1,null,{"$error":"#N/A"},{"$error":"#N/A"},{"$f":"INDEX(Lookup!$O$9:$O$24,MATCH('Interior Lighting'!Z106,Lookup!$K$9:$K$24,0))","v":{"$error":"#N/A"}},{"$f":"IF(E106=\"A\",INDEX(Lookup!$L$9:$L$24,MATCH(Z106,Lookup!$K$9:$K$24,0)),IF(E106=\"B\",INDEX(Lookup!$M$9:$M$24,MATCH(Z106,Lookup!$K$9:$K$24,0)),IF(E106=\"C\",INDEX(Lookup!$N$9:$N$24,MATCH(Z106,Lookup!$K$9:$K$24,0)),\"N/A\")))","v":{"$error":"#N/A"}}]
[null,null,null,null,{"$f":"INDEX(Lookup!$I$9:$I$24,MATCH('Interior Lighting'!D107,Lookup!$C$9:$C$24,0))","v":{"$error":"#N/A"}},null,null,null,{"$error":"#N/A"},null,0,{"$error":"#DIV/0!"},"N/A",{"$f":"IF($D$20=\"Space-By-Space (90.1-2010)\",INDEX(LPD2010SS,MATCH('Interior Lighting'!D107,LightingSpaceType,0)*W107),INDEX(LPD2010WB,MATCH('Interior Lighting'!D107,LightingSpaceType,0)))","v":{"$error":"#N/A"}},0,{"$error":"#N/A"},{"$error":"#N/A"},{"$error":"#N/A"},0,"",null,null,1,null,{"$error":"#N/A"},{"$error":"#N/A"},{"$f":"INDEX(Lookup!$O$9:$O$24,MATCH('Interior Lighting'!Z107,Lookup!$K$9:$K$24,0))","v":{"$error":"#N/A"}},{"$f":"IF(E107=\"A\",INDEX(Lookup!$L$9:$L$24,MATCH(Z107,Lookup!$K$9:$K$24,0)),IF(E107=\"B\",INDEX(Lookup!$M$9:$M$24,MATCH(Z107,Lookup!$K$9:$K$24,0)),IF(E107=\"C\",INDEX(Lookup!$N$9:$N$24,MATCH(Z107,Lookup!$K$9:$K$24,0)),\"N/A\")))","v":{"$error":"#N/A"}}]
[null,null,null,null,{"$f":"INDEX(Lookup!$I$9:$I$24,MATCH('Interior Lighting'!D108,Lookup!$C$9:$C$24,0))","v":{"$error":"#N/A"}},null,null,null,{"$error":"#N/A"},null,0,{"$error":"#DIV/0!"},"N/A",{"$f":"IF($D$20=\"Space-By-Space (90.1-2010)\",INDEX(LPD2010SS,MATCH('Interior Lighting'!D108,LightingSpaceType,0)*W108),INDEX(LPD2010WB,MATCH('Interior Lighting'!D108,LightingSpaceType,0)))","v":{"$error":"#N/A"}},0,{"$error":"#N/A"},{"$error":"#N/A"},{"$error":"#N/A"},0,"",null,null,1,null,{"$error":"#N/A"},{"$error":"#N/A"},{"$f":"INDEX(Lookup!$O$9:$O$24,MATCH('Interior Lighting'!Z108,Lookup!$K$9:$K$24,0))","v":{"$error":"#N/A"}},{"$f":"IF(E108=\"A\",INDEX(Lookup!$L$9:$L$24,MATCH(Z108,Lookup!$K$9:$K$24,0)),IF(E108=\"B\",INDEX(Lookup!$M$9:$M$24,MATCH(Z108,Lookup!$K$9:$K$24,0)),IF(E108=\"C\",INDEX(Lookup!$N$9:$N$24,MATCH(Z108,Lookup!$K$9:$K$24,0)),\"N/A\")))","v":{"$error":"#N/A"}}]
[null,null,null,null,{"$f":"INDEX(Lookup!$I$9:$I$24,MATCH('Interior Lighting'!D109,Lookup!$C$9:$C$24,0))","v":{"$error":"#N/A"}},null,null,null,{"$error":"#N/A"},null,0,{"$error":"#DIV/0!"},"N/A",{"$f":"IF($D$20=\"Space-By-Space (90.1-2010)\",INDEX(LPD2010SS,MATCH('Interior Lighting'!D109,LightingSpaceType,0)*W109),INDEX(LPD2010WB,MATCH('Interior Lighting'!D109,LightingSpaceType,0)))","v":{"$error":"#N/A"}},0,{"$error":"#N/A"},{"$error":"#N/A"},{"$error":"#N/A"},0,"",null,null,1,null,{"$error":"#N/A"},{"$error":"#N/A"},{"$f":"INDEX(Lookup!$O$9:$O$24,MATCH('Interior Lighting'!Z109,Lookup!$K$9:$K$24,0))","v":{"$error":"#N/A"}},{"$f":"IF(E109=\"A\",INDEX(Lookup!$L$9:$L$24,MATCH(Z109,Lookup!$K$9:$K$24,0)),IF(E109=\"B\",INDEX(Lookup!$M$9:$M$24,MATCH(Z109,Lookup!$K$9:$K$24,0)),IF(E109=\"C\",INDEX(Lookup!$N$9:$N$24,MATCH(Z109,Lookup!$K$9:$K$24,0)),\"N/A\")))","v":{"$error":"#N/A"}}]
[null,null,null,null,{"$f":"INDEX(Lookup!$I$9:$I$24,MATCH('Interior Lighting'!D110,Lookup!$C$9:$C$24,0))","v":{"$error":"#N/A"}},null,null,null,{"$error":"#N/A"},null,0,{"$error":"#DIV/0!"},"N/A",{"$f":"IF($D$20=\"Space-By-Space (90.1-2010)\",INDEX(LPD2010SS,MATCH('Interior Lighting'!D110,LightingSpaceType,0)*W110),INDEX(LPD2010WB,MATCH('Interior Lighting'!D110,LightingSpaceType,0)))","v":{"$error":"#N/A"}},0,{"$error":"#N/A"},{"$error":"#N/A"},{"$error":"#N/A"},0,"",null,null,1,null,{"$error":"#N/A"},{"$error":"#N/A"},{"$f":"INDEX(Lookup!$O$9:$O$24,MATCH('Interior Lighting'!Z110,Lookup!$K$9:$K$24,0))","v":{"$error":"#N/A"}},{"$f":"IF(E110=\"A\",INDEX(Lookup!$L$9:$L$24,MATCH(Z110,Lookup!$K$9:$K$24,0)),IF(E110=\"B\",INDEX(Lookup!$M$9:$M$24,MATCH(Z110,Lookup!$K$9:$K$24,0)),IF(E110=\"C\",INDEX(Lookup!$N$9:$N$24,MATCH(Z110,Lookup!$K$9:$K$24,0)),\"N/A\")))","v":{"$error":"#N/A"}}]
[null,null,null,null,{"$f":"INDEX(Lookup!$I$9:$I$24,MATCH('Interior Lighting'!D111,Lookup!$C$9:$C$24,0))","v":{"$error":"#N/A"}},null,null,null,{"$error":"#N/A"},null,0,{"$error":"#DIV/0!"},"N/A",{"$f":"IF($D$20=\"Space-By-Space (90.1-2010)\",INDEX(LPD2010SS,MATCH('Interior Lighting'!D111,LightingSpaceType,0)*W111),INDEX(LPD2010WB,MATCH('Interior Lighting'!D111,LightingSpaceType,0)))","v":{"$error":"#N/A"}},0,{"$error":"#N/A"},{"$error":"#N/A"},{"$error":"#N/A"},0,"",null,null,1,null,{"$error":"#N/A"},{"$error":"#N/A"},{"$f":"INDEX(Lookup!$O$9:$O$24,MATCH('Interior Lighting'!Z111,Lookup!$K$9:$K$24,0))","v":{"$error":"#N/A"}},{"$f":"IF(E111=\"A\",INDEX(Lookup!$L$9:$L$24,MATCH(Z111,Lookup!$K$9:$K$24,0)),IF(E111=\"B\",INDEX(Lookup!$M$9:$M$24,MATCH(Z111,Lookup!$K$9:$K$24,0)),IF(E111=\"C\",INDEX(Lookup!$N$9:$N$24,MATCH(Z111,Lookup!$K$9:$K$24,0)),\"N/A\")))","v":{"$error":"#N/A"}}]
[null,null,null,null,{"$f":"INDEX(Lookup!$I$9:$I$24,MATCH('Interior Lighting'!D112,Lookup!$C$9:$C$24,0))","v":{"$error":"#N/A"}},null,null,null,{"$error":"#N/A"},null,0,{"$error":"#DIV/0!"},"N/A",{"$f":"IF($D$20=\"Space-By-Space (90.1-2010)\",INDEX(LPD2010SS,MATCH('Interior Lighting'!D112,LightingSpaceType,0)*W112),INDEX(LPD2010WB,MATCH('Interior Lighting'!D112,LightingSpaceType,0)))","v":{"$error":"#N/A"}},0,{"$error":"#N/A"},{"$error":"#N/A"},{"$error":"#N/A"},0,"",null,null,1,null,{"$error":"#N/A"},{"$error":"#N/A"},{"$f":"INDEX(Lookup!$O$9:$O$24,MATCH('Interior Lighting'!Z112,Lookup!$K$9:$K$24,0))","v":{"$error":"#N/A"}},{"$f":"IF(E112=\"A\",INDEX(Lookup!$L$9:$L$24,MATCH(Z112,Lookup!$K$9:$K$24,0)),IF(E112=\"B\",INDEX(Lookup!$M$9:$M$24,MATCH(Z112,Lookup!$K$9:$K$24,0)),IF(E112=\"C\",INDEX(Lookup!$N$9:$N$24,MATCH(Z112,Lookup!$K$9:$K$24,0)),\"N/A\")))","v":{"$error":"#N/A"}}]
[null,null,null,null,{"$f":"INDEX(Lookup!$I$9:$I$24,MATCH('Interior Lighting'!D113,Lookup!$C$9:$C$24,0))","v":{"$error":"#N/A"}},null,null,null,{"$error":"#N/A"},null,0,{"$error":"#DIV/0!"},"N/A",{"$f":"IF($D$20=\"Space-By-Space (90.1-2010)\",INDEX(LPD2010SS,MATCH('Interior Lighting'!D113,LightingSpaceType,0)*W113),INDEX(LPD2010WB,MATCH('Interior Lighting'!D113,LightingSpaceType,0)))","v":{"$error":"#N/A"}},0,{"$error":"#N/A"},{"$error":"#N/A"},{"$error":"#N/A"},0,"",null,null,1,null,{"$error":"#N/A"},{"$error":"#N/A"},{"$f":"INDEX(Lookup!$O$9:$O$24,MATCH('Interior Lighting'!Z113,Lookup!$K$9:$K$24,0))","v":{"$error":"#N/A"}},{"$f":"IF(E113=\"A\",INDEX(Lookup!$L$9:$L$24,MATCH(Z113,Lookup!$K$9:$K$24,0)),IF(E113=\"B\",INDEX(Lookup!$M$9:$M$24,MATCH(Z113,Lookup!$K$9:$K$24,0)),IF(E113=\"C\",INDEX(Lookup!$N$9:$N$24,MATCH(Z113,Lookup!$K$9:$K$24,0)),\"N/A\")))","v":{"$error":"#N/A"}}]
[null,null,null,null,{"$f":"INDEX(Lookup!$I$9:$I$24,MATCH('Interior Lighting'!D114,Lookup!$C$9:$C$24,0))","v":{"$error":"#N/A"}},null,null,null,{"$error":"#N/A"},null,0,{"$error":"#DIV/0!"},"N/A",{"$f":"IF($D$20=\"Space-By-Space (90.1-2010)\",INDEX(LPD2010SS,MATCH('Interior Lighting'!D114,LightingSpaceType,0)*W114),INDEX(LPD2010WB,MATCH('Interior Lighting'!D114,LightingSpaceType,0)))","v":{"$error":"#N/A"}},0,{"$error":"#N/A"},{"$error":"#N/A"},{"$error":"#N/A"},0,"",null,null,1,null,{"$error":"#N/A"},{"$error":"#N/A"},{"$f":"INDEX(Lookup!$O$9:$O$24,MATCH('Interior Lighting'!Z114,Lookup!$K$9:$K$24,0))","v":{"$error":"#N/A"}},{"$f":"IF(E114=\"A\",INDEX(Lookup!$L$9:$L$24,MATCH(Z114,Lookup!$K$9:$K$24,0)),IF(E114=\"B\",INDEX(Lookup!$M$9:$M$24,MATCH(Z114,Lookup!$K$9:$K$24,0)),IF(E114=\"C\",INDEX(Lookup!$N$9:$N$24,MATCH(Z114,Lookup!$K$9:$K$24,0)),\"N/A\")))","v":{"$error":"#N/A"}}]
[null,null,null,null,{"$f":"INDEX(Lookup!$I$9:$I$24,MATCH('Interior Lighting'!D115,Lookup!$C$9:$C$24,0))","v":{"$error":"#N/A"}},null,null,null,{"$error":"#N/A"},null,0,{"$error":"#DIV/0!"},"N/A",{"$f":"IF($D$20=\"Space-By-Space (90.1-2010)\",INDEX(LPD2010SS,MATCH('Interior Lighting'!D115,LightingSpaceType,0)*W115),INDEX(LPD2010WB,MATCH('Interior Lighting'!D115,LightingSpaceType,0)))","v":{"$error":"#N/A"}},0,{"$error":"#N/A"},{"$error":"#N/A"},{"$error":"#N/A"},0,"",null,null,1,null,{"$error":"#N/A"},{"$error":"#N/A"},{"$f":"INDEX(Lookup!$O$9:$O$24,MATCH('Interior Lighting'!Z115,Lookup!$K$9:$K$24,0))","v":{"$error":"#N/A"}},{"$f":"IF(E115=\"A\",INDEX(Lookup!$L$9:$L$24,MATCH(Z115,Lookup!$K$9:$K$24,0)),IF(E115=\"B\",INDEX(Lookup!$M$9:$M$24,MATCH(Z115,Lookup!$K$9:$K$24,0)),IF(E115=\"C\",INDEX(Lookup!$N$9:$N$24,MATCH(Z115,Lookup!$K$9:$K$24,0)),\"N/A\")))","v":{"$error":"#N/A"}}]
[null,null,null,null,{"$f":"INDEX(Lookup!$I$9:$I$24,MATCH('Interior Lighting'!D116,Lookup!$C$9:$C$24,0))","v":{"$error":"#N/A"}},null,null,null,{"$error":"#N/A"},null,0,{"$error":"#DIV/0!"},"N/A",{"$f":"IF($D$20=\"Space-By-Space (90.1-2010)\",INDEX(LPD2010SS,MATCH('Interior Lighting'!D116,LightingSpaceType,0)*W116),INDEX(LPD2010WB,MATCH('Interior Lighting'!D116,LightingSpaceType,0)))","v":{"$error":"#N/A"}},0,{"$error":"#N/A"},{"$error":"#N/A"},{"$error":"#N/A"},0,"",null,null,1,null,{"$error":"#N/A"},{"$error":"#N/A"},{"$f":"INDEX(Lookup!$O$9:$O$24,MATCH('Interior Lighting'!Z116,Lookup!$K$9:$K$24,0))","v":{"$error":"#N/A"}},{"$f":"IF(E116=\"A\",INDEX(Lookup!$L$9:$L$24,MATCH(Z116,Lookup!$K$9:$K$24,0)),IF(E116=\"B\",INDEX(Lookup!$M$9:$M$24,MATCH(Z116,Lookup!$K$9:$K$24,0)),IF(E116=\"C\",INDEX(Lookup!$N$9:$N$24,MATCH(Z116,Lookup!$K$9:$K$24,0)),\"N/A\")))","v":{"$error":"#N/A"}}]
[null,null,null,null,{"$f":"INDEX(Lookup!$I$9:$I$24,MATCH('Interior Lighting'!D117,Lookup!$C$9:$C$24,0))","v":{"$error":"#N/A"}},null,null,null,{"$error":"#N/A"},null,0,{"$error":"#DIV/0!"},"N/A",{"$f":"IF($D$20=\"Space-By-Space (90.1-2010)\",INDEX(LPD2010SS,MATCH('Interior Lighting'!D117,LightingSpaceType,0)*W117),INDEX(LPD2010WB,MATCH('Interior Lighting'!D117,LightingSpaceType,0)))","v":{"$error":"#N/A"}},0,{"$error":"#N/A"},{"$error":"#N/A"},{"$error":"#N/A"},0,"",null,null,1,null,{"$error":"#N/A"},{"$error":"#N/A"},{"$f":"INDEX(Lookup!$O$9:$O$24,MATCH('Interior Lighting'!Z117,Lookup!$K$9:$K$24,0))","v":{"$error":"#N/A"}},{"$f":"IF(E117=\"A\",INDEX(Lookup!$L$9:$L$24,MATCH(Z117,Lookup!$K$9:$K$24,0)),IF(E117=\"B\",INDEX(Lookup!$M$9:$M$24,MATCH(Z117,Lookup!$K$9:$K$24,0)),IF(E117=\"C\",INDEX(Lookup!$N$9:$N$24,MATCH(Z117,Lookup!$K$9:$K$24,0)),\"N/A\")))","v":{"$error":"#N/A"}}]
[null,null,null,null,{"$f":"INDEX(Lookup!$I$9:$I$24,MATCH('Interior Lighting'!D118,Lookup!$C$9:$C$24,0))","v":{"$error":"#N/A"}},null,null,null,{"$error":"#N/A"},null,0,{"$error":"#DIV/0!"},"N/A",{"$f":"IF($D$20=\"Space-By-Space (90.1-2010)\",INDEX(LPD2010SS,MATCH('Interior Lighting'!D118,LightingSpaceType,0)*W118),INDEX(LPD2010WB,MATCH('Interior Lighting'!D118,LightingSpaceType,0)))","v":{"$error":"#N/A"}},0,{"$error":"#N/A"},{"$error":"#N/A"},{"$error":"#N/A"},0,"",null,null,1,null,{"$error":"#N/A"},{"$error":"#N/A"},{"$f":"INDEX(Lookup!$O$9:$O$24,MATCH('Interior Lighting'!Z118,Lookup!$K$9:$K$24,0))","v":{"$error":"#N/A"}},{"$f":"IF(E118=\"A\",INDEX(Lookup!$L$9:$L$24,MATCH(Z118,Lookup!$K$9:$K$24,0)),IF(E118=\"B\",INDEX(Lookup!$M$9:$M$24,MATCH(Z118,Lookup!$K$9:$K$24,0)),IF(E118=\"C\",INDEX(Lookup!$N$9:$N$24,MATCH(Z118,Lookup!$K$9:$K$24,0)),\"N/A\")))","v":{"$error":"#N/A"}}]
[null,null,null,null,{"$f":"INDEX(Lookup!$I$9:$I$24,MATCH('Interior Lighting'!D119,Lookup!$C$9:$C$24,0))","v":{"$error":"#N/A"}},null,null,null,{"$error":"#N/A"},null,0,{"$error":"#DIV/0!"},"N/A",{"$f":"IF($D$20=\"Space-By-Space (90.1-2010)\",INDEX(LPD2010SS,MATCH('Interior Lighting'!D119,LightingSpaceType,0)*W119),INDEX(LPD2010WB,MATCH('Interior Lighting'!D119,LightingSpaceType,0)))","v":{"$error":"#N/A"}},0,{"$error":"#N/A"},{"$error":"#N/A"},{"$error":"#N/A"},0,"",null,null,1,null,{"$error":"#N/A"},{"$error":"#N/A"},{"$f":"INDEX(Lookup!$O$9:$O$24,MATCH('Interior Lighting'!Z119,Lookup!$K$9:$K$24,0))","v":{"$error":"#N/A"}},{"$f":"IF(E119=\"A\",INDEX(Lookup!$L$9:$L$24,MATCH(Z119,Lookup!$K$9:$K$24,0)),IF(E119=\"B\",INDEX(Lookup!$M$9:$M$24,MATCH(Z119,Lookup!$K$9:$K$24,0)),IF(E119=\"C\",INDEX(Lookup!$N$9:$N$24,MATCH(Z119,Lookup!$K$9:$K$24,0)),\"N/A\")))","v":{"$error":"#N/A"}}]
[null,null,null,null,{"$f":"INDEX(Lookup!$I$9:$I$24,MATCH('Interior Lighting'!D120,Lookup!$C$9:$C$24,0))","v":{"$error":"#N/A"}},null,null,null,{"$error":"#N/A"},null,0,{"$error":"#DIV/0!"},"N/A",{"$f":"IF($D$20=\"Space-By-Space (90.1-2010)\",INDEX(LPD2010SS,MATCH('Interior Lighting'!D120,LightingSpaceType,0)*W120),INDEX(LPD2010WB,MATCH('Interior Lighting'!D120,LightingSpaceType,0)))","v":{"$error":"#N/A"}},0,{"$error":"#N/A"},{"$error":"#N/A"},{"$error":"#N/A"},0,"",null,null,1,null,{"$error":"#N/A"},{"$error":"#N/A"},{"$f":"INDEX(Lookup!$O$9:$O$24,MATCH('Interior Lighting'!Z120,Lookup!$K$9:$K$24,0))","v":{"$error":"#N/A"}},{"$f":"IF(E120=\"A\",INDEX(Lookup!$L$9:$L$24,MATCH(Z120,Lookup!$K$9:$K$24,0)),IF(E120=\"B\",INDEX(Lookup!$M$9:$M$24,MATCH(Z120,Lookup!$K$9:$K$24,0)),IF(E120=\"C\",INDEX(Lookup!$N$9:$N$24,MATCH(Z120,Lookup!$K$9:$K$24,0)),\"N/A\")))","v":{"$error":"#N/A"}}]
[null,null,null,null,{"$f":"INDEX(Lookup!$I$9:$I$24,MATCH('Interior Lighting'!D121,Lookup!$C$9:$C$24,0))","v":{"$error":"#N/A"}},null,null,null,{"$error":"#N/A"},null,0,{"$error":"#DIV/0!"},"N/A",{"$f":"IF($D$20=\"Space-By-Space (90.1-2010)\",INDEX(LPD2010SS,MATCH('Interior Lighting'!D121,LightingSpaceType,0)*W121),INDEX(LPD2010WB,MATCH('Interior Lighting'!D121,LightingSpaceType,0)))","v":{"$error":"#N/A"}},0,{"$error":"#N/A"},{"$error":"#N/A"},{"$error":"#N/A"},0,"",null,null,1,null,{"$error":"#N/A"},{"$error":"#N/A"},{"$f":"INDEX(Lookup!$O$9:$O$24,MATCH('Interior Lighting'!Z121,Lookup!$K$9:$K$24,0))","v":{"$error":"#N/A"}},{"$f":"IF(E121=\"A\",INDEX(Lookup!$L$9:$L$24,MATCH(Z121,Lookup!$K$9:$K$24,0)),IF(E121=\"B\",INDEX(Lookup!$M$9:$M$24,MATCH(Z121,Lookup!$K$9:$K$24,0)),IF(E121=\"C\",INDEX(Lookup!$N$9:$N$24,MATCH(Z121,Lookup!$K$9:$K$24,0)),\"N/A\")))","v":{"$error":"#N/A"}}]
[null,null,null,null,{"$f":"INDEX(Lookup!$I$9:$I$24,MATCH('Interior Lighting'!D122,Lookup!$C$9:$C$24,0))","v":{"$error":"#N/A"}},null,null,null,{"$error":"#N/A"},null,0,{"$error":"#DIV/0!"},"N/A",{"$f":"IF($D$20=\"Space-By-Space (90.1-2010)\",INDEX(LPD2010SS,MATCH('Interior Lighting'!D122,LightingSpaceType,0)*W122),INDEX(LPD2010WB,MATCH('Interior Lighting'!D122,LightingSpaceType,0)))","v":{"$error":"#N/A"}},0,{"$error":"#N/A"},{"$error":"#N/A"},{"$error":"#N/A"},0,"",null,null,1,null,{"$error":"#N/A"},{"$error":"#N/A"},{"$f":"INDEX(Lookup!$O$9:$O$24,MATCH('Interior Lighting'!Z122,Lookup!$K$9:$K$24,0))","v":{"$error":"#N/A"}},{"$f":"IF(E122=\"A\",INDEX(Lookup!$L$9:$L$24,MATCH(Z122,Lookup!$K$9:$K$24,0)),IF(E122=\"B\",INDEX(Lookup!$M$9:$M$24,MATCH(Z122,Lookup!$K$9:$K$24,0)),IF(E122=\"C\",INDEX(Lookup!$N$9:$N$24,MATCH(Z122,Lookup!$K$9:$K$24,0)),\"N/A\")))","v":{"$error":"#N/A"}}]
[null,null,null,null,{"$f":"INDEX(Lookup!$I$9:$I$24,MATCH('Interior Lighting'!D123,Lookup!$C$9:$C$24,0))","v":{"$error":"#N/A"}},null,null,null,{"$error":"#N/A"},null,0,{"$error":"#DIV/0!"},"N/A",{"$f":"IF($D$20=\"Space-By-Space (90.1-2010)\",INDEX(LPD2010SS,MATCH('Interior Lighting'!D123,LightingSpaceType,0)*W123),INDEX(LPD2010WB,MATCH('Interior Lighting'!D123,LightingSpaceType,0)))","v":{"$error":"#N/A"}},0,{"$error":"#N/A"},{"$error":"#N/A"},{"$error":"#N/A"},0,"",null,null,1,null,{"$error":"#N/A"},{"$error":"#N/A"},{"$f":"INDEX(Lookup!$O$9:$O$24,MATCH('Interior Lighting'!Z123,Lookup!$K$9:$K$24,0))","v":{"$error":"#N/A"}},{"$f":"IF(E123=\"A\",INDEX(Lookup!$L$9:$L$24,MATCH(Z123,Lookup!$K$9:$K$24,0)),IF(E123=\"B\",INDEX(Lookup!$M$9:$M$24,MATCH(Z123,Lookup!$K$9:$K$24,0)),IF(E123=\"C\",INDEX(Lookup!$N$9:$N$24,MATCH(Z123,Lookup!$K$9:$K$24,0)),\"N/A\")))","v":{"$error":"#N/A"}}]
[null,null,null,null,{"$f":"INDEX(Lookup!$I$9:$I$24,MATCH('Interior Lighting'!D124,Lookup!$C$9:$C$24,0))","v":{"$error":"#N/A"}},null,null,null,{"$error":"#N/A"},null,0,{"$error":"#DIV/0!"},"N/A",{"$f":"IF($D$20=\"Space-By-Space (90.1-2010)\",INDEX(LPD2010SS,MATCH('Interior Lighting'!D124,LightingSpaceType,0)*W124),INDEX(LPD2010WB,MATCH('Interior Lighting'!D124,LightingSpaceType,0)))","v":{"$error":"#N/A"}},0,{"$error":"#N/A"},{"$error":"#N/A"},{"$error":"#N/A"},0,"",null,null,1,null,{"$error":"#N/A"},{"$error":"#N/A"},{"$f":"INDEX(Lookup!$O$9:$O$24,MATCH('Interior Lighting'!Z124,Lookup!$K$9:$K$24,0))","v":{"$error":"#N/A"}},{"$f":"IF(E124=\"A\",INDEX(Lookup!$L$9:$L$24,MATCH(Z124,Lookup!$K$9:$K$24,0)),IF(E124=\"B\",INDEX(Lookup!$M$9:$M$24,MATCH(Z124,Lookup!$K$9:$K$24,0)),IF(E124=\"C\",INDEX(Lookup!$N$9:$N$24,MATCH(Z124,Lookup!$K$9:$K$24,0)),\"N/A\")))","v":{"$error":"#N/A"}}]
[null,null,null,null,{"$f":"INDEX(Lookup!$I$9:$I$24,MATCH('Interior Lighting'!D125,Lookup!$C$9:$C$24,0))","v":{"$error":"#N/A"}},null,null,null,{"$error":"#N/A"},null,0,{"$error":"#DIV/0!"},"N/A",{"$f":"IF($D$20=\"Space-By-Space (90.1-2010)\",INDEX(LPD2010SS,MATCH('Interior Lighting'!D125,LightingSpaceType,0)*W125),INDEX(LPD2010WB,MATCH('Interior Lighting'!D125,LightingSpaceType,0)))","v":{"$error":"#N/A"}},0,{"$error":"#N/A"},{"$error":"#N/A"},{"$error":"#N/A"},0,"",null,null,1,null,{"$error":"#N/A"},{"$error":"#N/A"},{"$f":"INDEX(Lookup!$O$9:$O$24,MATCH('Interior Lighting'!Z125,Lookup!$K$9:$K$24,0))","v":{"$error":"#N/A"}},{"$f":"IF(E125=\"A\",INDEX(Lookup!$L$9:$L$24,MATCH(Z125,Lookup!$K$9:$K$24,0)),IF(E125=\"B\",INDEX(Lookup!$M$9:$M$24,MATCH(Z125,Lookup!$K$9:$K$24,0)),IF(E125=\"C\",INDEX(Lookup!$N$9:$N$24,MATCH(Z125,Lookup!$K$9:$K$24,0)),\"N/A\")))","v":{"$error":"#N/A"}}]
[null,null,null,null,{"$f":"INDEX(Lookup!$I$9:$I$24,MATCH('Interior Lighting'!D126,Lookup!$C$9:$C$24,0))","v":{"$error":"#N/A"}},null,null,null,{"$error":"#N/A"},null,0,{"$error":"#DIV/0!"},"N/A",{"$f":"IF($D$20=\"Space-By-Space (90.1-2010)\",INDEX(LPD2010SS,MATCH('Interior Lighting'!D126,LightingSpaceType,0)*W126),INDEX(LPD2010WB,MATCH('Interior Lighting'!D126,LightingSpaceType,0)))","v":{"$error":"#N/A"}},0,{"$error":"#N/A"},{"$error":"#N/A"},{"$error":"#N/A"},0,"",null,null,1,null,{"$error":"#N/A"},{"$error":"#N/A"},{"$f":"INDEX(Lookup!$O$9:$O$24,MATCH('Interior Lighting'!Z126,Lookup!$K$9:$K$24,0))","v":{"$error":"#N/A"}},{"$f":"IF(E126=\"A\",INDEX(Lookup!$L$9:$L$24,MATCH(Z126,Lookup!$K$9:$K$24,0)),IF(E126=\"B\",INDEX(Lookup!$M$9:$M$24,MATCH(Z126,Lookup!$K$9:$K$24,0)),IF(E126=\"C\",INDEX(Lookup!$N$9:$N$24,MATCH(Z126,Lookup!$K$9:$K$24,0)),\"N/A\")))","v":{"$error":"#N/A"}}]
[null,null,null,null,{"$f":"INDEX(Lookup!$I$9:$I$24,MATCH('Interior Lighting'!D127,Lookup!$C$9:$C$24,0))","v":{"$error":"#N/A"}},null,null,null,{"$error":"#N/A"},null,0,{"$error":"#DIV/0!"},"N/A",{"$f":"IF($D$20=\"Space-By-Space (90.1-2010)\",INDEX(LPD2010SS,MATCH('Interior Lighting'!D127,LightingSpaceType,0)*W127),INDEX(LPD2010WB,MATCH('Interior Lighting'!D127,LightingSpaceType,0)))","v":{"$error":"#N/A"}},0,{"$error":"#N/A"},{"$error":"#N/A"},{"$error":"#N/A"},0,"",null,null,1,null,{"$error":"#N/A"},{"$error":"#N/A"},{"$f":"INDEX(Lookup!$O$9:$O$24,MATCH('Interior Lighting'!Z127,Lookup!$K$9:$K$24,0))","v":{"$error":"#N/A"}},{"$f":"IF(E127=\"A\",INDEX(Lookup!$L$9:$L$24,MATCH(Z127,Lookup!$K$9:$K$24,0)),IF(E127=\"B\",INDEX(Lookup!$M$9:$M$24,MATCH(Z127,Lookup!$K$9:$K$24,0)),IF(E127=\"C\",INDEX(Lookup!$N$9:$N$24,MATCH(Z127,Lookup!$K$9:$K$24,0)),\"N/A\")))","v":{"$error":"#N/A"}}]
[null,null,null,null,{"$f":"INDEX(Lookup!$I$9:$I$24,MATCH('Interior Lighting'!D128,Lookup!$C$9:$C$24,0))","v":{"$error":"#N/A"}},null,null,null,{"$error":"#N/A"},null,0,{"$error":"#DIV/0!"},"N/A",{"$f":"IF($D$20=\"Space-By-Space (90.1-2010)\",INDEX(LPD2010SS,MATCH('Interior Lighting'!D128,LightingSpaceType,0)*W128),INDEX(LPD2010WB,MATCH('Interior Lighting'!D128,LightingSpaceType,0)))","v":{"$error":"#N/A"}},0,{"$error":"#N/A"},{"$error":"#N/A"},{"$error":"#N/A"},0,"",null,null,1,null,{"$error":"#N/A"},{"$error":"#N/A"},{"$f":"INDEX(Lookup!$O$9:$O$24,MATCH('Interior Lighting'!Z128,Lookup!$K$9:$K$24,0))","v":{"$error":"#N/A"}},{"$f":"IF(E128=\"A\",INDEX(Lookup!$L$9:$L$24,MATCH(Z128,Lookup!$K$9:$K$24,0)),IF(E128=\"B\",INDEX(Lookup!$M$9:$M$24,MATCH(Z128,Lookup!$K$9:$K$24,0)),IF(E128=\"C\",INDEX(Lookup!$N$9:$N$24,MATCH(Z128,Lookup!$K$9:$K$24,0)),\"N/A\")))","v":{"$error":"#N/A"}}]
[null,null,null,null,{"$f":"INDEX(Lookup!$I$9:$I$24,MATCH('Interior Lighting'!D129,Lookup!$C$9:$C$24,0))","v":{"$error":"#N/A"}},null,null,null,{"$error":"#N/A"},null,0,{"$error":"#DIV/0!"},"N/A",{"$f":"IF($D$20=\"Space-By-Space (90.1-2010)\",INDEX(LPD2010SS,MATCH('Interior Lighting'!D129,LightingSpaceType,0)*W129),INDEX(LPD2010WB,MATCH('Interior Lighting'!D129,LightingSpaceType,0)))","v":{"$error":"#N/A"}},0,{"$error":"#N/A"},{"$error":"#N/A"},{"$error":"#N/A"},0,"",null,null,1,null,{"$error":"#N/A"},{"$error":"#N/A"},{"$f":"INDEX(Lookup!$O$9:$O$24,MATCH('Interior Lighting'!Z129,Lookup!$K$9:$K$24,0))","v":{"$error":"#N/A"}},{"$f":"IF(E129=\"A\",INDEX(Lookup!$L$9:$L$24,MATCH(Z129,Lookup!$K$9:$K$24,0)),IF(E129=\"B\",INDEX(Lookup!$M$9:$M$24,MATCH(Z129,Lookup!$K$9:$K$24,0)),IF(E129=\"C\",INDEX(Lookup!$N$9:$N$24,MATCH(Z129,Lookup!$K$9:$K$24,0)),\"N/A\")))","v":{"$error":"#N/A"}}]
[null,null,null,null,{"$f":"INDEX(Lookup!$I$9:$I$24,MATCH('Interior Lighting'!D130,Lookup!$C$9:$C$24,0))","v":{"$error":"#N/A"}},null,null,null,{"$error":"#N/A"},null,0,{"$error":"#DIV/0!"},"N/A",{"$f":"IF($D$20=\"Space-By-Space (90.1-2010)\",INDEX(LPD2010SS,MATCH('Interior Lighting'!D130,LightingSpaceType,0)*W130),INDEX(LPD2010WB,MATCH('Interior Lighting'!D130,LightingSpaceType,0)))","v":{"$error":"#N/A"}},0,{"$error":"#N/A"},{"$error":"#N/A"},{"$error":"#N/A"},0,"",null,null,1,null,{"$error":"#N/A"},{"$error":"#N/A"},{"$f":"INDEX(Lookup!$O$9:$O$24,MATCH('Interior Lighting'!Z130,Lookup!$K$9:$K$24,0))","v":{"$error":"#N/A"}},{"$f":"IF(E130=\"A\",INDEX(Lookup!$L$9:$L$24,MATCH(Z130,Lookup!$K$9:$K$24,0)),IF(E130=\"B\",INDEX(Lookup!$M$9:$M$24,MATCH(Z130,Lookup!$K$9:$K$24,0)),IF(E130=\"C\",INDEX(Lookup!$N$9:$N$24,MATCH(Z130,Lookup!$K$9:$K$24,0)),\"N/A\")))","v":{"$error":"#N/A"}}]
[null,null,null,null,{"$f":"INDEX(Lookup!$I$9:$I$24,MATCH('Interior Lighting'!D131,Lookup!$C$9:$C$24,0))","v":{"$error":"#N/A"}},null,null,null,{"$error":"#N/A"},null,0,{"$error":"#DIV/0!"},"N/A",{"$f":"IF($D$20=\"Space-By-Space (90.1-2010)\",INDEX(LPD2010SS,MATCH('Interior Lighting'!D131,LightingSpaceType,0)*W131),INDEX(LPD2010WB,MATCH('Interior Lighting'!D131,LightingSpaceType,0)))","v":{"$error":"#N/A"}},0,{"$error":"#N/A"},{"$error":"#N/A"},{"$error":"#N/A"},0,"",null,null,1,null,{"$error":"#N/A"},{"$error":"#N/A"},{"$f":"INDEX(Lookup!$O$9:$O$24,MATCH('Interior Lighting'!Z131,Lookup!$K$9:$K$24,0))","v":{"$error":"#N/A"}},{"$f":"IF(E131=\"A\",INDEX(Lookup!$L$9:$L$24,MATCH(Z131,Lookup!$K$9:$K$24,0)),IF(E131=\"B\",INDEX(Lookup!$M$9:$M$24,MATCH(Z131,Lookup!$K$9:$K$24,0)),IF(E131=\"C\",INDEX(Lookup!$N$9:$N$24,MATCH(Z131,Lookup!$K$9:$K$24,0)),\"N/A\")))","v":{"$error":"#N/A"}}]
[null,null,null,null,{"$f":"INDEX(Lookup!$I$9:$I$24,MATCH('Interior Lighting'!D132,Lookup!$C$9:$C$24,0))","v":{"$error":"#N/A"}},null,null,null,{"$error":"#N/A"},null,0,{"$error":"#DIV/0!"},"N/A",{"$f":"IF($D$20=\"Space-By-Space (90.1-2010)\",INDEX(LPD2010SS,MATCH('Interior Lighting'!D132,LightingSpaceType,0)*W132),INDEX(LPD2010WB,MATCH('Interior Lighting'!D132,LightingSpaceType,0)))","v":{"$error":"#N/A"}},0,{"$error":"#N/A"},{"$error":"#N/A"},{"$error":"#N/A"},0,"",null,null,1,null,{"$error":"#N/A"},{"$error":"#N/A"},{"$f":"INDEX(Lookup!$O$9:$O$24,MATCH('Interior Lighting'!Z132,Lookup!$K$9:$K$24,0))","v":{"$error":"#N/A"}},{"$f":"IF(E132=\"A\",INDEX(Lookup!$L$9:$L$24,MATCH(Z132,Lookup!$K$9:$K$24,0)),IF(E132=\"B\",INDEX(Lookup!$M$9:$M$24,MATCH(Z132,Lookup!$K$9:$K$24,0)),IF(E132=\"C\",INDEX(Lookup!$N$9:$N$24,MATCH(Z132,Lookup!$K$9:$K$24,0)),\"N/A\")))","v":{"$error":"#N/A"}}]
[null,null,null,null,{"$f":"INDEX(Lookup!$I$9:$I$24,MATCH('Interior Lighting'!D133,Lookup!$C$9:$C$24,0))","v":{"$error":"#N/A"}},null,null,null,{"$error":"#N/A"},null,0,{"$error":"#DIV/0!"},"N/A",{"$f":"IF($D$20=\"Space-By-Space (90.1-2010)\",INDEX(LPD2010SS,MATCH('Interior Lighting'!D133,LightingSpaceType,0)*W133),INDEX(LPD2010WB,MATCH('Interior Lighting'!D133,LightingSpaceType,0)))","v":{"$error":"#N/A"}},0,{"$error":"#N/A"},{"$error":"#N/A"},{"$error":"#N/A"},0,"",null,null,1,null,{"$error":"#N/A"},{"$error":"#N/A"},{"$f":"INDEX(Lookup!$O$9:$O$24,MATCH('Interior Lighting'!Z133,Lookup!$K$9:$K$24,0))","v":{"$error":"#N/A"}},{"$f":"IF(E133=\"A\",INDEX(Lookup!$L$9:$L$24,MATCH(Z133,Lookup!$K$9:$K$24,0)),IF(E133=\"B\",INDEX(Lookup!$M$9:$M$24,MATCH(Z133,Lookup!$K$9:$K$24,0)),IF(E133=\"C\",INDEX(Lookup!$N$9:$N$24,MATCH(Z133,Lookup!$K$9:$K$24,0)),\"N/A\")))","v":{"$error":"#N/A"}}]
[null,null,null,null,{"$f":"INDEX(Lookup!$I$9:$I$24,MATCH('Interior Lighting'!D134,Lookup!$C$9:$C$24,0))","v":{"$error":"#N/A"}},null,null,null,{"$error":"#N/A"},null,0,{"$error":"#DIV/0!"},"N/A",{"$f":"IF($D$20=\"Space-By-Space (90.1-2010)\",INDEX(LPD2010SS,MATCH('Interior Lighting'!D134,LightingSpaceType,0)*W134),INDEX(LPD2010WB,MATCH('Interior Lighting'!D134,LightingSpaceType,0)))","v":{"$error":"#N/A"}},0,{"$error":"#N/A"},{"$error":"#N/A"},{"$error":"#N/A"},0,"",null,null,1,null,{"$error":"#N/A"},{"$error":"#N/A"},{"$f":"INDEX(Lookup!$O$9:$O$24,MATCH('Interior Lighting'!Z134,Lookup!$K$9:$K$24,0))","v":{"$error":"#N/A"}},{"$f":"IF(E134=\"A\",INDEX(Lookup!$L$9:$L$24,MATCH(Z134,Lookup!$K$9:$K$24,0)),IF(E134=\"B\",INDEX(Lookup!$M$9:$M$24,MATCH(Z134,Lookup!$K$9:$K$24,0)),IF(E134=\"C\",INDEX(Lookup!$N$9:$N$24,MATCH(Z134,Lookup!$K$9:$K$24,0)),\"N/A\")))","v":{"$error":"#N/A"}}]
[null,null,null,null,{"$f":"INDEX(Lookup!$I$9:$I$24,MATCH('Interior Lighting'!D135,Lookup!$C$9:$C$24,0))","v":{"$error":"#N/A"}},null,null,null,{"$error":"#N/A"},null,0,{"$error":"#DIV/0!"},"N/A",{"$f":"IF($D$20=\"Space-By-Space (90.1-2010)\",INDEX(LPD2010SS,MATCH('Interior Lighting'!D135,LightingSpaceType,0)*W135),INDEX(LPD2010WB,MATCH('Interior Lighting'!D135,LightingSpaceType,0)))","v":{"$error":"#N/A"}},0,{"$error":"#N/A"},{"$error":"#N/A"},{"$error":"#N/A"},0,"",null,null,1,null,{"$error":"#N/A"},{"$error":"#N/A"},{"$f":"INDEX(Lookup!$O$9:$O$24,MATCH('Interior Lighting'!Z135,Lookup!$K$9:$K$24,0))","v":{"$error":"#N/A"}},{"$f":"IF(E135=\"A\",INDEX(Lookup!$L$9:$L$24,MATCH(Z135,Lookup!$K$9:$K$24,0)),IF(E135=\"B\",INDEX(Lookup!$M$9:$M$24,MATCH(Z135,Lookup!$K$9:$K$24,0)),IF(E135=\"C\",INDEX(Lookup!$N$9:$N$24,MATCH(Z135,Lookup!$K$9:$K$24,0)),\"N/A\")))","v":{"$error":"#N/A"}}]
[null,null,null,null,{"$f":"INDEX(Lookup!$I$9:$I$24,MATCH('Interior Lighting'!D136,Lookup!$C$9:$C$24,0))","v":{"$error":"#N/A"}},null,null,null,{"$error":"#N/A"},null,0,{"$error":"#DIV/0!"},"N/A",{"$f":"IF($D$20=\"Space-By-Space (90.1-2010)\",INDEX(LPD2010SS,MATCH('Interior Lighting'!D136,LightingSpaceType,0)*W136),INDEX(LPD2010WB,MATCH('Interior Lighting'!D136,LightingSpaceType,0)))","v":{"$error":"#N/A"}},0,{"$error":"#N/A"},{"$error":"#N/A"},{"$error":"#N/A"},0,"",null,null,1,null,{"$error":"#N/A"},{"$error":"#N/A"},{"$f":"INDEX(Lookup!$O$9:$O$24,MATCH('Interior Lighting'!Z136,Lookup!$K$9:$K$24,0))","v":{"$error":"#N/A"}},{"$f":"IF(E136=\"A\",INDEX(Lookup!$L$9:$L$24,MATCH(Z136,Lookup!$K$9:$K$24,0)),IF(E136=\"B\",INDEX(Lookup!$M$9:$M$24,MATCH(Z136,Lookup!$K$9:$K$24,0)),IF(E136=\"C\",INDEX(Lookup!$N$9:$N$24,MATCH(Z136,Lookup!$K$9:$K$24,0)),\"N/A\")))","v":{"$error":"#N/A"}}]
[null,null,null,null,{"$f":"INDEX(Lookup!$I$9:$I$24,MATCH('Interior Lighting'!D137,Lookup!$C$9:$C$24,0))","v":{"$error":"#N/A"}},null,null,null,{"$error":"#N/A"},null,0,{"$error":"#DIV/0!"},"N/A",{"$f":"IF($D$20=\"Space-By-Space (90.1-2010)\",INDEX(LPD2010SS,MATCH('Interior Lighting'!D137,LightingSpaceType,0)*W137),INDEX(LPD2010WB,MATCH('Interior Lighting'!D137,LightingSpaceType,0)))","v":{"$error":"#N/A"}},0,{"$error":"#N/A"},{"$error":"#N/A"},{"$error":"#N/A"},0,"",null,null,1,null,{"$error":"#N/A"},{"$error":"#N/A"},{"$f":"INDEX(Lookup!$O$9:$O$24,MATCH('Interior Lighting'!Z137,Lookup!$K$9:$K$24,0))","v":{"$error":"#N/A"}},{"$f":"IF(E137=\"A\",INDEX(Lookup!$L$9:$L$24,MATCH(Z137,Lookup!$K$9:$K$24,0)),IF(E137=\"B\",INDEX(Lookup!$M$9:$M$24,MATCH(Z137,Lookup!$K$9:$K$24,0)),IF(E137=\"C\",INDEX(Lookup!$N$9:$N$24,MATCH(Z137,Lookup!$K$9:$K$24,0)),\"N/A\")))","v":{"$error":"#N/A"}}]
[null,null,null,null,{"$f":"INDEX(Lookup!$I$9:$I$24,MATCH('Interior Lighting'!D138,Lookup!$C$9:$C$24,0))","v":{"$error":"#N/A"}},null,null,null,{"$error":"#N/A"},null,0,{"$error":"#DIV/0!"},"N/A",{"$f":"IF($D$20=\"Space-By-Space (90.1-2010)\",INDEX(LPD2010SS,MATCH('Interior Lighting'!D138,LightingSpaceType,0)*W138),INDEX(LPD2010WB,MATCH('Interior Lighting'!D138,LightingSpaceType,0)))","v":{"$error":"#N/A"}},0,{"$error":"#N/A"},{"$error":"#N/A"},{"$error":"#N/A"},0,"",null,null,1,null,{"$error":"#N/A"},{"$error":"#N/A"},{"$f":"INDEX(Lookup!$O$9:$O$24,MATCH('Interior Lighting'!Z138,Lookup!$K$9:$K$24,0))","v":{"$error":"#N/A"}},{"$f":"IF(E138=\"A\",INDEX(Lookup!$L$9:$L$24,MATCH(Z138,Lookup!$K$9:$K$24,0)),IF(E138=\"B\",INDEX(Lookup!$M$9:$M$24,MATCH(Z138,Lookup!$K$9:$K$24,0)),IF(E138=\"C\",INDEX(Lookup!$N$9:$N$24,MATCH(Z138,Lookup!$K$9:$K$24,0)),\"N/A\")))","v":{"$error":"#N/A"}}]
[null,null,null,null,{"$f":"INDEX(Lookup!$I$9:$I$24,MATCH('Interior Lighting'!D139,Lookup!$C$9:$C$24,0))","v":{"$error":"#N/A"}},null,null,null,{"$error":"#N/A"},null,0,{"$error":"#DIV/0!"},"N/A",{"$f":"IF($D$20=\"Space-By-Space (90.1-2010)\",INDEX(LPD2010SS,MATCH('Interior Lighting'!D139,LightingSpaceType,0)*W139),INDEX(LPD2010WB,MATCH('Interior Lighting'!D139,LightingSpaceType,0)))","v":{"$error":"#N/A"}},0,{"$error":"#N/A"},{"$error":"#N/A"},{"$error":"#N/A"},0,"",null,null,1,null,{"$error":"#N/A"},{"$error":"#N/A"},{"$f":"INDEX(Lookup!$O$9:$O$24,MATCH('Interior Lighting'!Z139,Lookup!$K$9:$K$24,0))","v":{"$error":"#N/A"}},{"$f":"IF(E139=\"A\",INDEX(Lookup!$L$9:$L$24,MATCH(Z139,Lookup!$K$9:$K$24,0)),IF(E139=\"B\",INDEX(Lookup!$M$9:$M$24,MATCH(Z139,Lookup!$K$9:$K$24,0)),IF(E139=\"C\",INDEX(Lookup!$N$9:$N$24,MATCH(Z139,Lookup!$K$9:$K$24,0)),\"N/A\")))","v":{"$error":"#N/A"}}]
[null,null,null,null,{"$f":"INDEX(Lookup!$I$9:$I$24,MATCH('Interior Lighting'!D140,Lookup!$C$9:$C$24,0))","v":{"$error":"#N/A"}},null,null,null,{"$error":"#N/A"},null,0,{"$error":"#DIV/0!"},"N/A",{"$f":"IF($D$20=\"Space-By-Space (90.1-2010)\",INDEX(LPD2010SS,MATCH('Interior Lighting'!D140,LightingSpaceType,0)*W140),INDEX(LPD2010WB,MATCH('Interior Lighting'!D140,LightingSpaceType,0)))","v":{"$error":"#N/A"}},0,{"$error":"#N/A"},{"$error":"#N/A"},{"$error":"#N/A"},0,"",null,null,1,null,{"$error":"#N/A"},{"$error":"#N/A"},{"$f":"INDEX(Lookup!$O$9:$O$24,MATCH('Interior Lighting'!Z140,Lookup!$K$9:$K$24,0))","v":{"$error":"#N/A"}},{"$f":"IF(E140=\"A\",INDEX(Lookup!$L$9:$L$24,MATCH(Z140,Lookup!$K$9:$K$24,0)),IF(E140=\"B\",INDEX(Lookup!$M$9:$M$24,MATCH(Z140,Lookup!$K$9:$K$24,0)),IF(E140=\"C\",INDEX(Lookup!$N$9:$N$24,MATCH(Z140,Lookup!$K$9:$K$24,0)),\"N/A\")))","v":{"$error":"#N/A"}}]
[null,null,null,null,{"$f":"INDEX(Lookup!$I$9:$I$24,MATCH('Interior Lighting'!D141,Lookup!$C$9:$C$24,0))","v":{"$error":"#N/A"}},null,null,null,{"$error":"#N/A"},null,0,{"$error":"#DIV/0!"},"N/A",{"$f":"IF($D$20=\"Space-By-Space (90.1-2010)\",INDEX(LPD2010SS,MATCH('Interior Lighting'!D141,LightingSpaceType,0)*W141),INDEX(LPD2010WB,MATCH('Interior Lighting'!D141,LightingSpaceType,0)))","v":{"$error":"#N/A"}},0,{"$error":"#N/A"},{"$error":"#N/A"},{"$error":"#N/A"},0,"",null,null,1,null,{"$error":"#N/A"},{"$error":"#N/A"},{"$f":"INDEX(Lookup!$O$9:$O$24,MATCH('Interior Lighting'!Z141,Lookup!$K$9:$K$24,0))","v":{"$error":"#N/A"}},{"$f":"IF(E141=\"A\",INDEX(Lookup!$L$9:$L$24,MATCH(Z141,Lookup!$K$9:$K$24,0)),IF(E141=\"B\",INDEX(Lookup!$M$9:$M$24,MATCH(Z141,Lookup!$K$9:$K$24,0)),IF(E141=\"C\",INDEX(Lookup!$N$9:$N$24,MATCH(Z141,Lookup!$K$9:$K$24,0)),\"N/A\")))","v":{"$error":"#N/A"}}]
[null,null,null,null,{"$f":"INDEX(Lookup!$I$9:$I$24,MATCH('Interior Lighting'!D142,Lookup!$C$9:$C$24,0))","v":{"$error":"#N/A"}},null,null,null,{"$error":"#N/A"},null,0,{"$error":"#DIV/0!"},"N/A",{"$f":"IF($D$20=\"Space-By-Space (90.1-2010)\",INDEX(LPD2010SS,MATCH('Interior Lighting'!D142,LightingSpaceType,0)*W142),INDEX(LPD2010WB,MATCH('Interior Lighting'!D142,LightingSpaceType,0)))","v":{"$error":"#N/A"}},0,{"$error":"#N/A"},{"$error":"#N/A"},{"$error":"#N/A"},0,"",null,null,1,null,{"$error":"#N/A"},{"$error":"#N/A"},{"$f":"INDEX(Lookup!$O$9:$O$24,MATCH('Interior Lighting'!Z142,Lookup!$K$9:$K$24,0))","v":{"$error":"#N/A"}},{"$f":"IF(E142=\"A\",INDEX(Lookup!$L$9:$L$24,MATCH(Z142,Lookup!$K$9:$K$24,0)),IF(E142=\"B\",INDEX(Lookup!$M$9:$M$24,MATCH(Z142,Lookup!$K$9:$K$24,0)),IF(E142=\"C\",INDEX(Lookup!$N$9:$N$24,MATCH(Z142,Lookup!$K$9:$K$24,0)),\"N/A\")))","v":{"$error":"#N/A"}}]
[null,null,null,null,{"$f":"INDEX(Lookup!$I$9:$I$24,MATCH('Interior Lighting'!D143,Lookup!$C$9:$C$24,0))","v":{"$error":"#N/A"}},null,null,null,{"$error":"#N/A"},null,0,{"$error":"#DIV/0!"},"N/A",{"$f":"IF($D$20=\"Space-By-Space (90.1-2010)\",INDEX(LPD2010SS,MATCH('Interior Lighting'!D143,LightingSpaceType,0)*W143),INDEX(LPD2010WB,MATCH('Interior Lighting'!D143,LightingSpaceType,0)))","v":{"$error":"#N/A"}},0,{"$error":"#N/A"},{"$error":"#N/A"},{"$error":"#N/A"},0,"",null,null,1,null,{"$error":"#N/A"},{"$error":"#N/A"},{"$f":"INDEX(Lookup!$O$9:$O$24,MATCH('Interior Lighting'!Z143,Lookup!$K$9:$K$24,0))","v":{"$error":"#N/A"}},{"$f":"IF(E143=\"A\",INDEX(Lookup!$L$9:$L$24,MATCH(Z143,Lookup!$K$9:$K$24,0)),IF(E143=\"B\",INDEX(Lookup!$M$9:$M$24,MATCH(Z143,Lookup!$K$9:$K$24,0)),IF(E143=\"C\",INDEX(Lookup!$N$9:$N$24,MATCH(Z143,Lookup!$K$9:$K$24,0)),\"N/A\")))","v":{"$error":"#N/A"}}]
[null,null,null,null,{"$f":"INDEX(Lookup!$I$9:$I$24,MATCH('Interior Lighting'!D144,Lookup!$C$9:$C$24,0))","v":{"$error":"#N/A"}},null,null,null,{"$error":"#N/A"},null,0,{"$error":"#DIV/0!"},"N/A",{"$f":"IF($D$20=\"Space-By-Space (90.1-2010)\",INDEX(LPD2010SS,MATCH('Interior Lighting'!D144,LightingSpaceType,0)*W144),INDEX(LPD2010WB,MATCH('Interior Lighting'!D144,LightingSpaceType,0)))","v":{"$error":"#N/A"}},0,{"$error":"#N/A"},{"$error":"#N/A"},{"$error":"#N/A"},0,"",null,null,1,null,{"$error":"#N/A"},{"$error":"#N/A"},{"$f":"INDEX(Lookup!$O$9:$O$24,MATCH('Interior Lighting'!Z144,Lookup!$K$9:$K$24,0))","v":{"$error":"#N/A"}},{"$f":"IF(E144=\"A\",INDEX(Lookup!$L$9:$L$24,MATCH(Z144,Lookup!$K$9:$K$24,0)),IF(E144=\"B\",INDEX(Lookup!$M$9:$M$24,MATCH(Z144,Lookup!$K$9:$K$24,0)),IF(E144=\"C\",INDEX(Lookup!$N$9:$N$24,MATCH(Z144,Lookup!$K$9:$K$24,0)),\"N/A\")))","v":{"$error":"#N/A"}}]
[null,null,null,null,{"$f":"INDEX(Lookup!$I$9:$I$24,MATCH('Interior Lighting'!D145,Lookup!$C$9:$C$24,0))","v":{"$error":"#N/A"}},null,null,null,{"$error":"#N/A"},null,0,{"$error":"#DIV/0!"},"N/A",{"$f":"IF($D$20=\"Space-By-Space (90.1-2010)\",INDEX(LPD2010SS,MATCH('Interior Lighting'!D145,LightingSpaceType,0)*W145),INDEX(LPD2010WB,MATCH('Interior Lighting'!D145,LightingSpaceType,0)))","v":{"$error":"#N/A"}},0,{"$error":"#N/A"},{"$error":"#N/A"},{"$error":"#N/A"},0,"",null,null,1,null,{"$error":"#N/A"},{"$error":"#N/A"},{"$f":"INDEX(Lookup!$O$9:$O$24,MATCH('Interior Lighting'!Z145,Lookup!$K$9:$K$24,0))","v":{"$error":"#N/A"}},{"$f":"IF(E145=\"A\",INDEX(Lookup!$L$9:$L$24,MATCH(Z145,Lookup!$K$9:$K$24,0)),IF(E145=\"B\",INDEX(Lookup!$M$9:$M$24,MATCH(Z145,Lookup!$K$9:$K$24,0)),IF(E145=\"C\",INDEX(Lookup!$N$9:$N$24,MATCH(Z145,Lookup!$K$9:$K$24,0)),\"N/A\")))","v":{"$error":"#N/A"}}]
[null,null,null,null,{"$f":"INDEX(Lookup!$I$9:$I$24,MATCH('Interior Lighting'!D146,Lookup!$C$9:$C$24,0))","v":{"$error":"#N/A"}},null,null,null,{"$error":"#N/A"},null,0,{"$error":"#DIV/0!"},"N/A",{"$f":"IF($D$20=\"Space-By-Space (90.1-2010)\",INDEX(LPD2010SS,MATCH('Interior Lighting'!D146,LightingSpaceType,0)*W146),INDEX(LPD2010WB,MATCH('Interior Lighting'!D146,LightingSpaceType,0)))","v":{"$error":"#N/A"}},0,{"$error":"#N/A"},{"$error":"#N/A"},{"$error":"#N/A"},0,"",null,null,1,null,{"$error":"#N/A"},{"$error":"#N/A"},{"$f":"INDEX(Lookup!$O$9:$O$24,MATCH('Interior Lighting'!Z146,Lookup!$K$9:$K$24,0))","v":{"$error":"#N/A"}},{"$f":"IF(E146=\"A\",INDEX(Lookup!$L$9:$L$24,MATCH(Z146,Lookup!$K$9:$K$24,0)),IF(E146=\"B\",INDEX(Lookup!$M$9:$M$24,MATCH(Z146,Lookup!$K$9:$K$24,0)),IF(E146=\"C\",INDEX(Lookup!$N$9:$N$24,MATCH(Z146,Lookup!$K$9:$K$24,0)),\"N/A\")))","v":{"$error":"#N/A"}}]
[null,null,null,null,{"$f":"INDEX(Lookup!$I$9:$I$24,MATCH('Interior Lighting'!D147,Lookup!$C$9:$C$24,0))","v":{"$error":"#N/A"}},null,null,null,{"$error":"#N/A"},null,0,{"$error":"#DIV/0!"},"N/A",{"$f":"IF($D$20=\"Space-By-Space (90.1-2010)\",INDEX(LPD2010SS,MATCH('Interior Lighting'!D147,LightingSpaceType,0)*W147),INDEX(LPD2010WB,MATCH('Interior Lighting'!D147,LightingSpaceType,0)))","v":{"$error":"#N/A"}},0,{"$error":"#N/A"},{"$error":"#N/A"},{"$error":"#N/A"},0,"",null,null,1,null,{"$error":"#N/A"},{"$error":"#N/A"},{"$f":"INDEX(Lookup!$O$9:$O$24,MATCH('Interior Lighting'!Z147,Lookup!$K$9:$K$24,0))","v":{"$error":"#N/A"}},{"$f":"IF(E147=\"A\",INDEX(Lookup!$L$9:$L$24,MATCH(Z147,Lookup!$K$9:$K$24,0)),IF(E147=\"B\",INDEX(Lookup!$M$9:$M$24,MATCH(Z147,Lookup!$K$9:$K$24,0)),IF(E147=\"C\",INDEX(Lookup!$N$9:$N$24,MATCH(Z147,Lookup!$K$9:$K$24,0)),\"N/A\")))","v":{"$error":"#N/A"}}]
[null,null,null,null,{"$f":"INDEX(Lookup!$I$9:$I$24,MATCH('Interior Lighting'!D148,Lookup!$C$9:$C$24,0))","v":{"$error":"#N/A"}},null,null,null,{"$error":"#N/A"},null,0,{"$error":"#DIV/0!"},"N/A",{"$f":"IF($D$20=\"Space-By-Space (90.1-2010)\",INDEX(LPD2010SS,MATCH('Interior Lighting'!D148,LightingSpaceType,0)*W148),INDEX(LPD2010WB,MATCH('Interior Lighting'!D148,LightingSpaceType,0)))","v":{"$error":"#N/A"}},0,{"$error":"#N/A"},{"$error":"#N/A"},{"$error":"#N/A"},0,"",null,null,1,null,{"$error":"#N/A"},{"$error":"#N/A"},{"$f":"INDEX(Lookup!$O$9:$O$24,MATCH('Interior Lighting'!Z148,Lookup!$K$9:$K$24,0))","v":{"$error":"#N/A"}},{"$f":"IF(E148=\"A\",INDEX(Lookup!$L$9:$L$24,MATCH(Z148,Lookup!$K$9:$K$24,0)),IF(E148=\"B\",INDEX(Lookup!$M$9:$M$24,MATCH(Z148,Lookup!$K$9:$K$24,0)),IF(E148=\"C\",INDEX(Lookup!$N$9:$N$24,MATCH(Z148,Lookup!$K$9:$K$24,0)),\"N/A\")))","v":{"$error":"#N/A"}}]
[null,null,null,null,{"$f":"INDEX(Lookup!$I$9:$I$24,MATCH('Interior Lighting'!D149,Lookup!$C$9:$C$24,0))","v":{"$error":"#N/A"}},null,null,null,{"$error":"#N/A"},null,0,{"$error":"#DIV/0!"},"N/A",{"$f":"IF($D$20=\"Space-By-Space (90.1-2010)\",INDEX(LPD2010SS,MATCH('Interior Lighting'!D149,LightingSpaceType,0)*W149),INDEX(LPD2010WB,MATCH('Interior Lighting'!D149,LightingSpaceType,0)))","v":{"$error":"#N/A"}},0,{"$error":"#N/A"},{"$error":"#N/A"},{"$error":"#N/A"},0,"",null,null,1,null,{"$error":"#N/A"},{"$error":"#N/A"},{"$f":"INDEX(Lookup!$O$9:$O$24,MATCH('Interior Lighting'!Z149,Lookup!$K$9:$K$24,0))","v":{"$error":"#N/A"}},{"$f":"IF(E149=\"A\",INDEX(Lookup!$L$9:$L$24,MATCH(Z149,Lookup!$K$9:$K$24,0)),IF(E149=\"B\",INDEX(Lookup!$M$9:$M$24,MATCH(Z149,Lookup!$K$9:$K$24,0)),IF(E149=\"C\",INDEX(Lookup!$N$9:$N$24,MATCH(Z149,Lookup!$K$9:$K$24,0)),\"N/A\")))","v":{"$error":"#N/A"}}]
[null,null,null,null,{"$f":"INDEX(Lookup!$I$9:$I$24,MATCH('Interior Lighting'!D150,Lookup!$C$9:$C$24,0))","v":{"$error":"#N/A"}},null,null,null,{"$error":"#N/A"},null,0,{"$error":"#DIV/0!"},"N/A",{"$f":"IF($D$20=\"Space-By-Space (90.1-2010)\",INDEX(LPD2010SS,MATCH('Interior Lighting'!D150,LightingSpaceType,0)*W150),INDEX(LPD2010WB,MATCH('Interior Lighting'!D150,LightingSpaceType,0)))","v":{"$error":"#N/A"}},0,{"$error":"#N/A"},{"$error":"#N/A"},{"$error":"#N/A"},0,"",null,null,1,null,{"$error":"#N/A"},{"$error":"#N/A"},{"$f":"INDEX(Lookup!$O$9:$O$24,MATCH('Interior Lighting'!Z150,Lookup!$K$9:$K$24,0))","v":{"$error":"#N/A"}},{"$f":"IF(E150=\"A\",INDEX(Lookup!$L$9:$L$24,MATCH(Z150,Lookup!$K$9:$K$24,0)),IF(E150=\"B\",INDEX(Lookup!$M$9:$M$24,MATCH(Z150,Lookup!$K$9:$K$24,0)),IF(E150=\"C\",INDEX(Lookup!$N$9:$N$24,MATCH(Z150,Lookup!$K$9:$K$24,0)),\"N/A\")))","v":{"$error":"#N/A"}}]
[null,null,null,null,{"$f":"INDEX(Lookup!$I$9:$I$24,MATCH('Interior Lighting'!D151,Lookup!$C$9:$C$24,0))","v":{"$error":"#N/A"}},null,null,null,{"$error":"#N/A"},null,0,{"$error":"#DIV/0!"},"N/A",{"$f":"IF($D$20=\"Space-By-Space (90.1-2010)\",INDEX(LPD2010SS,MATCH('Interior Lighting'!D151,LightingSpaceType,0)*W151),INDEX(LPD2010WB,MATCH('Interior Lighting'!D151,LightingSpaceType,0)))","v":{"$error":"#N/A"}},0,{"$error":"#N/A"},{"$error":"#N/A"},{"$error":"#N/A"},0,"",null,null,1,null,{"$error":"#N/A"},{"$error":"#N/A"},{"$f":"INDEX(Lookup!$O$9:$O$24,MATCH('Interior Lighting'!Z151,Lookup!$K$9:$K$24,0))","v":{"$error":"#N/A"}},{"$f":"IF(E151=\"A\",INDEX(Lookup!$L$9:$L$24,MATCH(Z151,Lookup!$K$9:$K$24,0)),IF(E151=\"B\",INDEX(Lookup!$M$9:$M$24,MATCH(Z151,Lookup!$K$9:$K$24,0)),IF(E151=\"C\",INDEX(Lookup!$N$9:$N$24,MATCH(Z151,Lookup!$K$9:$K$24,0)),\"N/A\")))","v":{"$error":"#N/A"}}]
[null,null,null,null,{"$f":"INDEX(Lookup!$I$9:$I$24,MATCH('Interior Lighting'!D152,Lookup!$C$9:$C$24,0))","v":{"$error":"#N/A"}},null,null,null,{"$error":"#N/A"},null,0,{"$error":"#DIV/0!"},"N/A",{"$f":"IF($D$20=\"Space-By-Space (90.1-2010)\",INDEX(LPD2010SS,MATCH('Interior Lighting'!D152,LightingSpaceType,0)*W152),INDEX(LPD2010WB,MATCH('Interior Lighting'!D152,LightingSpaceType,0)))","v":{"$error":"#N/A"}},0,{"$error":"#N/A"},{"$error":"#N/A"},{"$error":"#N/A"},0,"",null,null,1,null,{"$error":"#N/A"},{"$error":"#N/A"},{"$f":"INDEX(Lookup!$O$9:$O$24,MATCH('Interior Lighting'!Z152,Lookup!$K$9:$K$24,0))","v":{"$error":"#N/A"}},{"$f":"IF(E152=\"A\",INDEX(Lookup!$L$9:$L$24,MATCH(Z152,Lookup!$K$9:$K$24,0)),IF(E152=\"B\",INDEX(Lookup!$M$9:$M$24,MATCH(Z152,Lookup!$K$9:$K$24,0)),IF(E152=\"C\",INDEX(Lookup!$N$9:$N$24,MATCH(Z152,Lookup!$K$9:$K$24,0)),\"N/A\")))","v":{"$error":"#N/A"}}]
[null,null,null,null,{"$f":"INDEX(Lookup!$I$9:$I$24,MATCH('Interior Lighting'!D153,Lookup!$C$9:$C$24,0))","v":{"$error":"#N/A"}},null,null,null,{"$error":"#N/A"},null,0,{"$error":"#DIV/0!"},"N/A",{"$f":"IF($D$20=\"Space-By-Space (90.1-2010)\",INDEX(LPD2010SS,MATCH('Interior Lighting'!D153,LightingSpaceType,0)*W153),INDEX(LPD2010WB,MATCH('Interior Lighting'!D153,LightingSpaceType,0)))","v":{"$error":"#N/A"}},0,{"$error":"#N/A"},{"$error":"#N/A"},{"$error":"#N/A"},0,"",null,null,1,null,{"$error":"#N/A"},{"$error":"#N/A"},{"$f":"INDEX(Lookup!$O$9:$O$24,MATCH('Interior Lighting'!Z153,Lookup!$K$9:$K$24,0))","v":{"$error":"#N/A"}},{"$f":"IF(E153=\"A\",INDEX(Lookup!$L$9:$L$24,MATCH(Z153,Lookup!$K$9:$K$24,0)),IF(E153=\"B\",INDEX(Lookup!$M$9:$M$24,MATCH(Z153,Lookup!$K$9:$K$24,0)),IF(E153=\"C\",INDEX(Lookup!$N$9:$N$24,MATCH(Z153,Lookup!$K$9:$K$24,0)),\"N/A\")))","v":{"$error":"#N/A"}}]
[null,null,null,null,{"$f":"INDEX(Lookup!$I$9:$I$24,MATCH('Interior Lighting'!D154,Lookup!$C$9:$C$24,0))","v":{"$error":"#N/A"}},null,null,null,{"$error":"#N/A"},null,0,{"$error":"#DIV/0!"},"N/A",{"$f":"IF($D$20=\"Space-By-Space (90.1-2010)\",INDEX(LPD2010SS,MATCH('Interior Lighting'!D154,LightingSpaceType,0)*W154),INDEX(LPD2010WB,MATCH('Interior Lighting'!D154,LightingSpaceType,0)))","v":{"$error":"#N/A"}},0,{"$error":"#N/A"},{"$error":"#N/A"},{"$error":"#N/A"},0,"",null,null,1,null,{"$error":"#N/A"},{"$error":"#N/A"},{"$f":"INDEX(Lookup!$O$9:$O$24,MATCH('Interior Lighting'!Z154,Lookup!$K$9:$K$24,0))","v":{"$error":"#N/A"}},{"$f":"IF(E154=\"A\",INDEX(Lookup!$L$9:$L$24,MATCH(Z154,Lookup!$K$9:$K$24,0)),IF(E154=\"B\",INDEX(Lookup!$M$9:$M$24,MATCH(Z154,Lookup!$K$9:$K$24,0)),IF(E154=\"C\",INDEX(Lookup!$N$9:$N$24,MATCH(Z154,Lookup!$K$9:$K$24,0)),\"N/A\")))","v":{"$error":"#N/A"}}]
[null,null,null,null,{"$f":"INDEX(Lookup!$I$9:$I$24,MATCH('Interior Lighting'!D155,Lookup!$C$9:$C$24,0))","v":{"$error":"#N/A"}},null,null,null,{"$error":"#N/A"},null,0,{"$error":"#DIV/0!"},"N/A",{"$f":"IF($D$20=\"Space-By-Space (90.1-2010)\",INDEX(LPD2010SS,MATCH('Interior Lighting'!D155,LightingSpaceType,0)*W155),INDEX(LPD2010WB,MATCH('Interior Lighting'!D155,LightingSpaceType,0)))","v":{"$error":"#N/A"}},0,{"$error":"#N/A"},{"$error":"#N/A"},{"$error":"#N/A"},0,"",null,null,1,null,{"$error":"#N/A"},{"$error":"#N/A"},{"$f":"INDEX(Lookup!$O$9:$O$24,MATCH('Interior Lighting'!Z155,Lookup!$K$9:$K$24,0))","v":{"$error":"#N/A"}},{"$f":"IF(E155=\"A\",INDEX(Lookup!$L$9:$L$24,MATCH(Z155,Lookup!$K$9:$K$24,0)),IF(E155=\"B\",INDEX(Lookup!$M$9:$M$24,MATCH(Z155,Lookup!$K$9:$K$24,0)),IF(E155=\"C\",INDEX(Lookup!$N$9:$N$24,MATCH(Z155,Lookup!$K$9:$K$24,0)),\"N/A\")))","v":{"$error":"#N/A"}}]
[null,null,null,null,{"$f":"INDEX(Lookup!$I$9:$I$24,MATCH('Interior Lighting'!D156,Lookup!$C$9:$C$24,0))","v":{"$error":"#N/A"}},null,null,null,{"$error":"#N/A"},null,0,{"$error":"#DIV/0!"},"N/A",{"$f":"IF($D$20=\"Space-By-Space (90.1-2010)\",INDEX(LPD2010SS,MATCH('Interior Lighting'!D156,LightingSpaceType,0)*W156),INDEX(LPD2010WB,MATCH('Interior Lighting'!D156,LightingSpaceType,0)))","v":{"$error":"#N/A"}},0,{"$error":"#N/A"},{"$error":"#N/A"},{"$error":"#N/A"},0,"",null,null,1,null,{"$error":"#N/A"},{"$error":"#N/A"},{"$f":"INDEX(Lookup!$O$9:$O$24,MATCH('Interior Lighting'!Z156,Lookup!$K$9:$K$24,0))","v":{"$error":"#N/A"}},{"$f":"IF(E156=\"A\",INDEX(Lookup!$L$9:$L$24,MATCH(Z156,Lookup!$K$9:$K$24,0)),IF(E156=\"B\",INDEX(Lookup!$M$9:$M$24,MATCH(Z156,Lookup!$K$9:$K$24,0)),IF(E156=\"C\",INDEX(Lookup!$N$9:$N$24,MATCH(Z156,Lookup!$K$9:$K$24,0)),\"N/A\")))","v":{"$error":"#N/A"}}]
[null,null,null,null,{"$f":"INDEX(Lookup!$I$9:$I$24,MATCH('Interior Lighting'!D157,Lookup!$C$9:$C$24,0))","v":{"$error":"#N/A"}},null,null,null,{"$error":"#N/A"},null,0,{"$error":"#DIV/0!"},"N/A",{"$f":"IF($D$20=\"Space-By-Space (90.1-2010)\",INDEX(LPD2010SS,MATCH('Interior Lighting'!D157,LightingSpaceType,0)*W157),INDEX(LPD2010WB,MATCH('Interior Lighting'!D157,LightingSpaceType,0)))","v":{"$error":"#N/A"}},0,{"$error":"#N/A"},{"$error":"#N/A"},{"$error":"#N/A"},0,"",null,null,1,null,{"$error":"#N/A"},{"$error":"#N/A"},{"$f":"INDEX(Lookup!$O$9:$O$24,MATCH('Interior Lighting'!Z157,Lookup!$K$9:$K$24,0))","v":{"$error":"#N/A"}},{"$f":"IF(E157=\"A\",INDEX(Lookup!$L$9:$L$24,MATCH(Z157,Lookup!$K$9:$K$24,0)),IF(E157=\"B\",INDEX(Lookup!$M$9:$M$24,MATCH(Z157,Lookup!$K$9:$K$24,0)),IF(E157=\"C\",INDEX(Lookup!$N$9:$N$24,MATCH(Z157,Lookup!$K$9:$K$24,0)),\"N/A\")))","v":{"$error":"#N/A"}}]
[null,null,null,null,{"$f":"INDEX(Lookup!$I$9:$I$24,MATCH('Interior Lighting'!D158,Lookup!$C$9:$C$24,0))","v":{"$error":"#N/A"}},null,null,null,{"$error":"#N/A"},null,0,{"$error":"#DIV/0!"},"N/A",{"$f":"IF($D$20=\"Space-By-Space (90.1-2010)\",INDEX(LPD2010SS,MATCH('Interior Lighting'!D158,LightingSpaceType,0)*W158),INDEX(LPD2010WB,MATCH('Interior Lighting'!D158,LightingSpaceType,0)))","v":{"$error":"#N/A"}},0,{"$f":"Y158*AA158*AB158","v":{"$error":"#N/A"}},{"$error":"#N/A"},{"$f":"INDEX(Footcandles,MATCH(D158,LightingSpaceType,0))","v":{"$error":"#N/A"}},{"$f":"J158*B158","v":0},{"$f":"IF(F158>0, IF(Q158<R158, \"Insufficient lighting to meet IESNA footcandle recommendations.\", \"\"), \"\")","v":""},null,null,{"$f":"IF(A158=\"Yes\",1.2,1)","v":1},null,{"$f":"INDEX($M$4:$M$27,MATCH(G158,$J$4:$J$27,0))","v":{"$error":"#N/A"}},{"$f":"INDEX($K$4:$K$27,MATCH(G158,$J$4:$J$27,0))","v":{"$error":"#N/A"}},{"$f":"INDEX(Lookup!$O$9:$O$24,MATCH('Interior Lighting'!Z158,Lookup!$K$9:$K$24,0))","v":{"$error":"#N/A"}},{"$f":"IF(E158=\"A\",INDEX(Lookup!$L$9:$L$24,MATCH(Z158,Lookup!$K$9:$K$24,0)),IF(E158=\"B\",INDEX(Lookup!$M$9:$M$24,MATCH(Z158,Lookup!$K$9:$K$24,0)),IF(E158=\"C\",INDEX(Lookup!$N$9:$N$24,MATCH(Z158,Lookup!$K$9:$K$24,0)),\"N/A\")))","v":{"$error":"#N/A"}}]
[null,null,null,null,{"$f":"INDEX(Lookup!$I$9:$I$24,MATCH('Interior Lighting'!D159,Lookup!$C$9:$C$24,0))","v":{"$error":"#N/A"}},null,null,null,{"$f":"INDEX($L$4:$L$27,MATCH(G159,$J$4:$J$27,0))","v":{"$error":"#N/A"}},null,{"$f":"IF(F159>0, F159*I159*J159, 0)","v":0},{"$f":"IF(D159=\"Exit Signs\",\"convert to kW\", K159/S159)","v":{"$error":"#DIV/0!"}},{"$f":"IF(H159=\"Yes\",IF(D159=\"Corridor/Transition\",0.75*L159,1*L159),\"N/A\")","v":"N/A"},{"$f":"IF($D$20=\"Space-By-Space (90.1-2010)\",INDEX(LPD2010SS,MATCH('Interior Lighting'!D159,LightingSpaceType,0)*W159),INDEX(LPD2010WB,MATCH('Interior Lighting'!D159,LightingSpaceType,0)))","v":{"$error":"#N/A"}},{"$f":"IF(D159=\"Exit Signs\", 5*F159*J159, IF(B159>0, N159*S159, 0))","v":0},{"$error":"#N/A"},{"$f":"IF(D159=\"Exit Signs\",\"NA\", K159*P159/S159)","v":{"$error":"#N/A"}},{"$error":"#N/A"},0,"",null,null,1,null,{"$error":"#N/A"},{"$error":"#N/A"},{"$f":"INDEX(Lookup!$O$9:$O$24,MATCH('Interior Lighting'!Z159,Lookup!$K$9:$K$24,0))","v":{"$error":"#N/A"}},{"$f":"IF(E159=\"A\",INDEX(Lookup!$L$9:$L$24,MATCH(Z159,Lookup!$K$9:$K$24,0)),IF(E159=\"B\",INDEX(Lookup!$M$9:$M$24,MATCH(Z159,Lookup!$K$9:$K$24,0)),IF(E159=\"C\",INDEX(Lookup!$N$9:$N$24,MATCH(Z159,Lookup!$K$9:$K$24,0)),\"N/A\")))","v":{"$error":"#N/A"}}]
[null,null,null,null,{"$f":"INDEX(Lookup!$I$9:$I$24,MATCH('Interior Lighting'!D160,Lookup!$C$9:$C$24,0))","v":{"$error":"#N/A"}},null,null,null,{"$error":"#N/A"},null,0,{"$error":"#DIV/0!"},"N/A",{"$f":"IF($D$20=\"Space-By-Space (90.1-2010)\",INDEX(LPD2010SS,MATCH('Interior Lighting'!D160,LightingSpaceType,0)*W160),INDEX(LPD2010WB,MATCH('Interior Lighting'!D160,LightingSpaceType,0)))","v":{"$error":"#N/A"}},0,{"$error":"#N/A"},{"$error":"#N/A"},{"$error":"#N/A"},0,"",null,null,1,null,{"$error":"#N/A"},{"$error":"#N/A"},{"$f":"INDEX(Lookup!$O$9:$O$24,MATCH('Interior Lighting'!Z160,Lookup!$K$9:$K$24,0))","v":{"$error":"#N/A"}},{"$f":"IF(E160=\"A\",INDEX(Lookup!$L$9:$L$24,MATCH(Z160,Lookup!$K$9:$K$24,0)),IF(E160=\"B\",INDEX(Lookup!$M$9:$M$24,MATCH(Z160,Lookup!$K$9:$K$24,0)),IF(E160=\"C\",INDEX(Lookup!$N$9:$N$24,MATCH(Z160,Lookup!$K$9:$K$24,0)),\"N/A\")))","v":{"$error":"#N/A"}}]
[null,null,null,null,{"$f":"INDEX(Lookup!$I$9:$I$24,MATCH('Interior Lighting'!D161,Lookup!$C$9:$C$24,0))","v":{"$error":"#N/A"}},null,null,null,{"$error":"#N/A"},null,0,{"$error":"#DIV/0!"},"N/A",{"$f":"IF($D$20=\"Space-By-Space (90.1-2010)\",INDEX(LPD2010SS,MATCH('Interior Lighting'!D161,LightingSpaceType,0)*W161),INDEX(LPD2010WB,MATCH('Interior Lighting'!D161,LightingSpaceType,0)))","v":{"$error":"#N/A"}},0,{"$error":"#N/A"},{"$error":"#N/A"},{"$error":"#N/A"},0,"",null,null,1,null,{"$error":"#N/A"},{"$error":"#N/A"},{"$f":"INDEX(Lookup!$O$9:$O$24,MATCH('Interior Lighting'!Z161,Lookup!$K$9:$K$24,0))","v":{"$error":"#N/A"}},{"$f":"IF(E161=\"A\",INDEX(Lookup!$L$9:$L$24,MATCH(Z161,Lookup!$K$9:$K$24,0)),IF(E161=\"B\",INDEX(Lookup!$M$9:$M$24,MATCH(Z161,Lookup!$K$9:$K$24,0)),IF(E161=\"C\",INDEX(Lookup!$N$9:$N$24,MATCH(Z161,Lookup!$K$9:$K$24,0)),\"N/A\")))","v":{"$error":"#N/A"}}]
[null,null,null,null,{"$f":"INDEX(Lookup!$I$9:$I$24,MATCH('Interior Lighting'!D162,Lookup!$C$9:$C$24,0))","v":{"$error":"#N/A"}},null,null,null,{"$error":"#N/A"},null,0,{"$error":"#DIV/0!"},"N/A",{"$f":"IF($D$20=\"Space-By-Space (90.1-2010)\",INDEX(LPD2010SS,MATCH('Interior Lighting'!D162,LightingSpaceType,0)*W162),INDEX(LPD2010WB,MATCH('Interior Lighting'!D162,LightingSpaceType,0)))","v":{"$error":"#N/A"}},0,{"$error":"#N/A"},{"$error":"#N/A"},{"$error":"#N/A"},0,"",null,null,1,null,{"$error":"#N/A"},{"$error":"#N/A"},{"$f":"INDEX(Lookup!$O$9:$O$24,MATCH('Interior Lighting'!Z162,Lookup!$K$9:$K$24,0))","v":{"$error":"#N/A"}},{"$f":"IF(E162=\"A\",INDEX(Lookup!$L$9:$L$24,MATCH(Z162,Lookup!$K$9:$K$24,0)),IF(E162=\"B\",INDEX(Lookup!$M$9:$M$24,MATCH(Z162,Lookup!$K$9:$K$24,0)),IF(E162=\"C\",INDEX(Lookup!$N$9:$N$24,MATCH(Z162,Lookup!$K$9:$K$24,0)),\"N/A\")))","v":{"$error":"#N/A"}}]
[null,null,null,null,{"$f":"INDEX(Lookup!$I$9:$I$24,MATCH('Interior Lighting'!D163,Lookup!$C$9:$C$24,0))","v":{"$error":"#N/A"}},null,null,null,{"$error":"#N/A"},null,0,{"$error":"#DIV/0!"},"N/A",{"$f":"IF($D$20=\"Space-By-Space (90.1-2010)\",INDEX(LPD2010SS,MATCH('Interior Lighting'!D163,LightingSpaceType,0)*W163),INDEX(LPD2010WB,MATCH('Interior Lighting'!D163,LightingSpaceType,0)))","v":{"$error":"#N/A"}},0,{"$error":"#N/A"},{"$error":"#N/A"},{"$error":"#N/A"},0,"",null,null,1,null,{"$error":"#N/A"},{"$error":"#N/A"},{"$f":"INDEX(Lookup!$O$9:$O$24,MATCH('Interior Lighting'!Z163,Lookup!$K$9:$K$24,0))","v":{"$error":"#N/A"}},{"$f":"IF(E163=\"A\",INDEX(Lookup!$L$9:$L$24,MATCH(Z163,Lookup!$K$9:$K$24,0)),IF(E163=\"B\",INDEX(Lookup!$M$9:$M$24,MATCH(Z163,Lookup!$K$9:$K$24,0)),IF(E163=\"C\",INDEX(Lookup!$N$9:$N$24,MATCH(Z163,Lookup!$K$9:$K$24,0)),\"N/A\")))","v":{"$error":"#N/A"}}]
[null,null,null,null,{"$f":"INDEX(Lookup!$I$9:$I$24,MATCH('Interior Lighting'!D164,Lookup!$C$9:$C$24,0))","v":{"$error":"#N/A"}},null,null,null,{"$error":"#N/A"},null,0,{"$error":"#DIV/0!"},"N/A",{"$f":"IF($D$20=\"Space-By-Space (90.1-2010)\",INDEX(LPD2010SS,MATCH('Interior Lighting'!D164,LightingSpaceType,0)*W164),INDEX(LPD2010WB,MATCH('Interior Lighting'!D164,LightingSpaceType,0)))","v":{"$error":"#N/A"}},0,{"$error":"#N/A"},{"$error":"#N/A"},{"$error":"#N/A"},0,"",null,null,1,null,{"$error":"#N/A"},{"$error":"#N/A"},{"$f":"INDEX(Lookup!$O$9:$O$24,MATCH('Interior Lighting'!Z164,Lookup!$K$9:$K$24,0))","v":{"$error":"#N/A"}},{"$f":"IF(E164=\"A\",INDEX(Lookup!$L$9:$L$24,MATCH(Z164,Lookup!$K$9:$K$24,0)),IF(E164=\"B\",INDEX(Lookup!$M$9:$M$24,MATCH(Z164,Lookup!$K$9:$K$24,0)),IF(E164=\"C\",INDEX(Lookup!$N$9:$N$24,MATCH(Z164,Lookup!$K$9:$K$24,0)),\"N/A\")))","v":{"$error":"#N/A"}}]
[null,null,null,null,{"$f":"INDEX(Lookup!$I$9:$I$24,MATCH('Interior Lighting'!D165,Lookup!$C$9:$C$24,0))","v":{"$error":"#N/A"}},null,null,null,{"$error":"#N/A"},null,0,{"$error":"#DIV/0!"},"N/A",{"$f":"IF($D$20=\"Space-By-Space (90.1-2010)\",INDEX(LPD2010SS,MATCH('Interior Lighting'!D165,LightingSpaceType,0)*W165),INDEX(LPD2010WB,MATCH('Interior Lighting'!D165,LightingSpaceType,0)))","v":{"$error":"#N/A"}},0,{"$error":"#N/A"},{"$error":"#N/A"},{"$error":"#N/A"},0,"",null,null,1,null,{"$error":"#N/A"},{"$error":"#N/A"},{"$f":"INDEX(Lookup!$O$9:$O$24,MATCH('Interior Lighting'!Z165,Lookup!$K$9:$K$24,0))","v":{"$error":"#N/A"}},{"$f":"IF(E165=\"A\",INDEX(Lookup!$L$9:$L$24,MATCH(Z165,Lookup!$K$9:$K$24,0)),IF(E165=\"B\",INDEX(Lookup!$M$9:$M$24,MATCH(Z165,Lookup!$K$9:$K$24,0)),IF(E165=\"C\",INDEX(Lookup!$N$9:$N$24,MATCH(Z165,Lookup!$K$9:$K$24,0)),\"N/A\")))","v":{"$error":"#N/A"}}]
[null,null,null,null,{"$f":"INDEX(Lookup!$I$9:$I$24,MATCH('Interior Lighting'!D166,Lookup!$C$9:$C$24,0))","v":{"$error":"#N/A"}},null,null,null,{"$error":"#N/A"},null,0,{"$error":"#DIV/0!"},"N/A",{"$f":"IF($D$20=\"Space-By-Space (90.1-2010)\",INDEX(LPD2010SS,MATCH('Interior Lighting'!D166,LightingSpaceType,0)*W166),INDEX(LPD2010WB,MATCH('Interior Lighting'!D166,LightingSpaceType,0)))","v":{"$error":"#N/A"}},0,{"$error":"#N/A"},{"$error":"#N/A"},{"$error":"#N/A"},0,"",null,null,1,null,{"$error":"#N/A"},{"$error":"#N/A"},{"$f":"INDEX(Lookup!$O$9:$O$24,MATCH('Interior Lighting'!Z166,Lookup!$K$9:$K$24,0))","v":{"$error":"#N/A"}},{"$f":"IF(E166=\"A\",INDEX(Lookup!$L$9:$L$24,MATCH(Z166,Lookup!$K$9:$K$24,0)),IF(E166=\"B\",INDEX(Lookup!$M$9:$M$24,MATCH(Z166,Lookup!$K$9:$K$24,0)),IF(E166=\"C\",INDEX(Lookup!$N$9:$N$24,MATCH(Z166,Lookup!$K$9:$K$24,0)),\"N/A\")))","v":{"$error":"#N/A"}}]
[null,null,null,null,{"$f":"INDEX(Lookup!$I$9:$I$24,MATCH('Interior Lighting'!D167,Lookup!$C$9:$C$24,0))","v":{"$error":"#N/A"}},null,null,null,{"$error":"#N/A"},null,0,{"$error":"#DIV/0!"},"N/A",{"$f":"IF($D$20=\"Space-By-Space (90.1-2010)\",INDEX(LPD2010SS,MATCH('Interior Lighting'!D167,LightingSpaceType,0)*W167),INDEX(LPD2010WB,MATCH('Interior Lighting'!D167,LightingSpaceType,0)))","v":{"$error":"#N/A"}},0,{"$error":"#N/A"},{"$error":"#N/A"},{"$error":"#N/A"},0,"",null,null,1,null,{"$error":"#N/A"},{"$error":"#N/A"},{"$f":"INDEX(Lookup!$O$9:$O$24,MATCH('Interior Lighting'!Z167,Lookup!$K$9:$K$24,0))","v":{"$error":"#N/A"}},{"$f":"IF(E167=\"A\",INDEX(Lookup!$L$9:$L$24,MATCH(Z167,Lookup!$K$9:$K$24,0)),IF(E167=\"B\",INDEX(Lookup!$M$9:$M$24,MATCH(Z167,Lookup!$K$9:$K$24,0)),IF(E167=\"C\",INDEX(Lookup!$N$9:$N$24,MATCH(Z167,Lookup!$K$9:$K$24,0)),\"N/A\")))","v":{"$error":"#N/A"}}]
[null,null,null,null,{"$f":"INDEX(Lookup!$I$9:$I$24,MATCH('Interior Lighting'!D168,Lookup!$C$9:$C$24,0))","v":{"$error":"#N/A"}},null,null,null,{"$error":"#N/A"},null,0,{"$error":"#DIV/0!"},"N/A",{"$f":"IF($D$20=\"Space-By-Space (90.1-2010)\",INDEX(LPD2010SS,MATCH('Interior Lighting'!D168,LightingSpaceType,0)*W168),INDEX(LPD2010WB,MATCH('Interior Lighting'!D168,LightingSpaceType,0)))","v":{"$error":"#N/A"}},0,{"$error":"#N/A"},{"$error":"#N/A"},{"$error":"#N/A"},0,"",null,null,1,null,{"$error":"#N/A"},{"$error":"#N/A"},{"$f":"INDEX(Lookup!$O$9:$O$24,MATCH('Interior Lighting'!Z168,Lookup!$K$9:$K$24,0))","v":{"$error":"#N/A"}},{"$f":"IF(E168=\"A\",INDEX(Lookup!$L$9:$L$24,MATCH(Z168,Lookup!$K$9:$K$24,0)),IF(E168=\"B\",INDEX(Lookup!$M$9:$M$24,MATCH(Z168,Lookup!$K$9:$K$24,0)),IF(E168=\"C\",INDEX(Lookup!$N$9:$N$24,MATCH(Z168,Lookup!$K$9:$K$24,0)),\"N/A\")))","v":{"$error":"#N/A"}}]
[null,null,null,null,{"$f":"INDEX(Lookup!$I$9:$I$24,MATCH('Interior Lighting'!D169,Lookup!$C$9:$C$24,0))","v":{"$error":"#N/A"}},null,null,null,{"$error":"#N/A"},null,0,{"$error":"#DIV/0!"},"N/A",{"$f":"IF($D$20=\"Space-By-Space (90.1-2010)\",INDEX(LPD2010SS,MATCH('Interior Lighting'!D169,LightingSpaceType,0)*W169),INDEX(LPD2010WB,MATCH('Interior Lighting'!D169,LightingSpaceType,0)))","v":{"$error":"#N/A"}},0,{"$error":"#N/A"},{"$error":"#N/A"},{"$error":"#N/A"},0,"",null,null,1,null,{"$error":"#N/A"},{"$error":"#N/A"},{"$f":"INDEX(Lookup!$O$9:$O$24,MATCH('Interior Lighting'!Z169,Lookup!$K$9:$K$24,0))","v":{"$error":"#N/A"}},{"$f":"IF(E169=\"A\",INDEX(Lookup!$L$9:$L$24,MATCH(Z169,Lookup!$K$9:$K$24,0)),IF(E169=\"B\",INDEX(Lookup!$M$9:$M$24,MATCH(Z169,Lookup!$K$9:$K$24,0)),IF(E169=\"C\",INDEX(Lookup!$N$9:$N$24,MATCH(Z169,Lookup!$K$9:$K$24,0)),\"N/A\")))","v":{"$error":"#N/A"}}]
[null,null,null,null,{"$f":"INDEX(Lookup!$I$9:$I$24,MATCH('Interior Lighting'!D170,Lookup!$C$9:$C$24,0))","v":{"$error":"#N/A"}},null,null,null,{"$error":"#N/A"},null,0,{"$error":"#DIV/0!"},"N/A",{"$f":"IF($D$20=\"Space-By-Space (90.1-2010)\",INDEX(LPD2010SS,MATCH('Interior Lighting'!D170,LightingSpaceType,0)*W170),INDEX(LPD2010WB,MATCH('Interior Lighting'!D170,LightingSpaceType,0)))","v":{"$error":"#N/A"}},0,{"$error":"#N/A"},{"$error":"#N/A"},{"$error":"#N/A"},0,"",null,null,1,null,{"$error":"#N/A"},{"$error":"#N/A"},{"$f":"INDEX(Lookup!$O$9:$O$24,MATCH('Interior Lighting'!Z170,Lookup!$K$9:$K$24,0))","v":{"$error":"#N/A"}},{"$f":"IF(E170=\"A\",INDEX(Lookup!$L$9:$L$24,MATCH(Z170,Lookup!$K$9:$K$24,0)),IF(E170=\"B\",INDEX(Lookup!$M$9:$M$24,MATCH(Z170,Lookup!$K$9:$K$24,0)),IF(E170=\"C\",INDEX(Lookup!$N$9:$N$24,MATCH(Z170,Lookup!$K$9:$K$24,0)),\"N/A\")))","v":{"$error":"#N/A"}}]
[null,null,null,null,{"$f":"INDEX(Lookup!$I$9:$I$24,MATCH('Interior Lighting'!D171,Lookup!$C$9:$C$24,0))","v":{"$error":"#N/A"}},null,null,null,{"$error":"#N/A"},null,0,{"$error":"#DIV/0!"},"N/A",{"$f":"IF($D$20=\"Space-By-Space (90.1-2010)\",INDEX(LPD2010SS,MATCH('Interior Lighting'!D171,LightingSpaceType,0)*W171),INDEX(LPD2010WB,MATCH('Interior Lighting'!D171,LightingSpaceType,0)))","v":{"$error":"#N/A"}},0,{"$error":"#N/A"},{"$error":"#N/A"},{"$error":"#N/A"},0,"",null,null,1,null,{"$error":"#N/A"},{"$error":"#N/A"},{"$f":"INDEX(Lookup!$O$9:$O$24,MATCH('Interior Lighting'!Z171,Lookup!$K$9:$K$24,0))","v":{"$error":"#N/A"}},{"$f":"IF(E171=\"A\",INDEX(Lookup!$L$9:$L$24,MATCH(Z171,Lookup!$K$9:$K$24,0)),IF(E171=\"B\",INDEX(Lookup!$M$9:$M$24,MATCH(Z171,Lookup!$K$9:$K$24,0)),IF(E171=\"C\",INDEX(Lookup!$N$9:$N$24,MATCH(Z171,Lookup!$K$9:$K$24,0)),\"N/A\")))","v":{"$error":"#N/A"}}]
[null,null,null,null,{"$f":"INDEX(Lookup!$I$9:$I$24,MATCH('Interior Lighting'!D172,Lookup!$C$9:$C$24,0))","v":{"$error":"#N/A"}},null,null,null,{"$error":"#N/A"},null,0,{"$error":"#DIV/0!"},"N/A",{"$f":"IF($D$20=\"Space-By-Space (90.1-2010)\",INDEX(LPD2010SS,MATCH('Interior Lighting'!D172,LightingSpaceType,0)*W172),INDEX(LPD2010WB,MATCH('Interior Lighting'!D172,LightingSpaceType,0)))","v":{"$error":"#N/A"}},0,{"$error":"#N/A"},{"$error":"#N/A"},{"$error":"#N/A"},0,"",null,null,1,null,{"$error":"#N/A"},{"$error":"#N/A"},{"$f":"INDEX(Lookup!$O$9:$O$24,MATCH('Interior Lighting'!Z172,Lookup!$K$9:$K$24,0))","v":{"$error":"#N/A"}},{"$f":"IF(E172=\"A\",INDEX(Lookup!$L$9:$L$24,MATCH(Z172,Lookup!$K$9:$K$24,0)),IF(E172=\"B\",INDEX(Lookup!$M$9:$M$24,MATCH(Z172,Lookup!$K$9:$K$24,0)),IF(E172=\"C\",INDEX(Lookup!$N$9:$N$24,MATCH(Z172,Lookup!$K$9:$K$24,0)),\"N/A\")))","v":{"$error":"#N/A"}}]
[null,null,null,null,{"$f":"INDEX(Lookup!$I$9:$I$24,MATCH('Interior Lighting'!D173,Lookup!$C$9:$C$24,0))","v":{"$error":"#N/A"}},null,null,null,{"$error":"#N/A"},null,0,{"$error":"#DIV/0!"},"N/A",{"$f":"IF($D$20=\"Space-By-Space (90.1-2010)\",INDEX(LPD2010SS,MATCH('Interior Lighting'!D173,LightingSpaceType,0)*W173),INDEX(LPD2010WB,MATCH('Interior Lighting'!D173,LightingSpaceType,0)))","v":{"$error":"#N/A"}},0,{"$error":"#N/A"},{"$error":"#N/A"},{"$error":"#N/A"},0,"",null,null,1,null,{"$error":"#N/A"},{"$error":"#N/A"},{"$f":"INDEX(Lookup!$O$9:$O$24,MATCH('Interior Lighting'!Z173,Lookup!$K$9:$K$24,0))","v":{"$error":"#N/A"}},{"$f":"IF(E173=\"A\",INDEX(Lookup!$L$9:$L$24,MATCH(Z173,Lookup!$K$9:$K$24,0)),IF(E173=\"B\",INDEX(Lookup!$M$9:$M$24,MATCH(Z173,Lookup!$K$9:$K$24,0)),IF(E173=\"C\",INDEX(Lookup!$N$9:$N$24,MATCH(Z173,Lookup!$K$9:$K$24,0)),\"N/A\")))","v":{"$error":"#N/A"}}]
[null,null,null,null,{"$f":"INDEX(Lookup!$I$9:$I$24,MATCH('Interior Lighting'!D174,Lookup!$C$9:$C$24,0))","v":{"$error":"#N/A"}},null,null,null,{"$error":"#N/A"},null,0,{"$error":"#DIV/0!"},"N/A",{"$f":"IF($D$20=\"Space-By-Space (90.1-2010)\",INDEX(LPD2010SS,MATCH('Interior Lighting'!D174,LightingSpaceType,0)*W174),INDEX(LPD2010WB,MATCH('Interior Lighting'!D174,LightingSpaceType,0)))","v":{"$error":"#N/A"}},0,{"$error":"#N/A"},{"$error":"#N/A"},{"$error":"#N/A"},0,"",null,null,1,null,{"$error":"#N/A"},{"$error":"#N/A"},{"$f":"INDEX(Lookup!$O$9:$O$24,MATCH('Interior Lighting'!Z174,Lookup!$K$9:$K$24,0))","v":{"$error":"#N/A"}},{"$f":"IF(E174=\"A\",INDEX(Lookup!$L$9:$L$24,MATCH(Z174,Lookup!$K$9:$K$24,0)),IF(E174=\"B\",INDEX(Lookup!$M$9:$M$24,MATCH(Z174,Lookup!$K$9:$K$24,0)),IF(E174=\"C\",INDEX(Lookup!$N$9:$N$24,MATCH(Z174,Lookup!$K$9:$K$24,0)),\"N/A\")))","v":{"$error":"#N/A"}}]
[null,null,null,null,{"$f":"INDEX(Lookup!$I$9:$I$24,MATCH('Interior Lighting'!D175,Lookup!$C$9:$C$24,0))","v":{"$error":"#N/A"}},null,null,null,{"$error":"#N/A"},null,0,{"$error":"#DIV/0!"},"N/A",{"$f":"IF($D$20=\"Space-By-Space (90.1-2010)\",INDEX(LPD2010SS,MATCH('Interior Lighting'!D175,LightingSpaceType,0)*W175),INDEX(LPD2010WB,MATCH('Interior Lighting'!D175,LightingSpaceType,0)))","v":{"$error":"#N/A"}},0,{"$error":"#N/A"},{"$error":"#N/A"},{"$error":"#N/A"},0,"",null,null,1,null,{"$error":"#N/A"},{"$error":"#N/A"},{"$f":"INDEX(Lookup!$O$9:$O$24,MATCH('Interior Lighting'!Z175,Lookup!$K$9:$K$24,0))","v":{"$error":"#N/A"}},{"$f":"IF(E175=\"A\",INDEX(Lookup!$L$9:$L$24,MATCH(Z175,Lookup!$K$9:$K$24,0)),IF(E175=\"B\",INDEX(Lookup!$M$9:$M$24,MATCH(Z175,Lookup!$K$9:$K$24,0)),IF(E175=\"C\",INDEX(Lookup!$N$9:$N$24,MATCH(Z175,Lookup!$K$9:$K$24,0)),\"N/A\")))","v":{"$error":"#N/A"}}]
[null,null,null,null,{"$f":"INDEX(Lookup!$I$9:$I$24,MATCH('Interior Lighting'!D176,Lookup!$C$9:$C$24,0))","v":{"$error":"#N/A"}},null,null,null,{"$error":"#N/A"},null,0,{"$error":"#DIV/0!"},"N/A",{"$f":"IF($D$20=\"Space-By-Space (90.1-2010)\",INDEX(LPD2010SS,MATCH('Interior Lighting'!D176,LightingSpaceType,0)*W176),INDEX(LPD2010WB,MATCH('Interior Lighting'!D176,LightingSpaceType,0)))","v":{"$error":"#N/A"}},0,{"$error":"#N/A"},{"$error":"#N/A"},{"$error":"#N/A"},0,"",null,null,1,null,{"$error":"#N/A"},{"$error":"#N/A"},{"$f":"INDEX(Lookup!$O$9:$O$24,MATCH('Interior Lighting'!Z176,Lookup!$K$9:$K$24,0))","v":{"$error":"#N/A"}},{"$f":"IF(E176=\"A\",INDEX(Lookup!$L$9:$L$24,MATCH(Z176,Lookup!$K$9:$K$24,0)),IF(E176=\"B\",INDEX(Lookup!$M$9:$M$24,MATCH(Z176,Lookup!$K$9:$K$24,0)),IF(E176=\"C\",INDEX(Lookup!$N$9:$N$24,MATCH(Z176,Lookup!$K$9:$K$24,0)),\"N/A\")))","v":{"$error":"#N/A"}}]
[null,null,null,null,{"$f":"INDEX(Lookup!$I$9:$I$24,MATCH('Interior Lighting'!D177,Lookup!$C$9:$C$24,0))","v":{"$error":"#N/A"}},null,null,null,{"$error":"#N/A"},null,0,{"$error":"#DIV/0!"},"N/A",{"$f":"IF($D$20=\"Space-By-Space (90.1-2010)\",INDEX(LPD2010SS,MATCH('Interior Lighting'!D177,LightingSpaceType,0)*W177),INDEX(LPD2010WB,MATCH('Interior Lighting'!D177,LightingSpaceType,0)))","v":{"$error":"#N/A"}},0,{"$error":"#N/A"},{"$error":"#N/A"},{"$error":"#N/A"},0,"",null,null,1,null,{"$error":"#N/A"},{"$error":"#N/A"},{"$f":"INDEX(Lookup!$O$9:$O$24,MATCH('Interior Lighting'!Z177,Lookup!$K$9:$K$24,0))","v":{"$error":"#N/A"}},{"$f":"IF(E177=\"A\",INDEX(Lookup!$L$9:$L$24,MATCH(Z177,Lookup!$K$9:$K$24,0)),IF(E177=\"B\",INDEX(Lookup!$M$9:$M$24,MATCH(Z177,Lookup!$K$9:$K$24,0)),IF(E177=\"C\",INDEX(Lookup!$N$9:$N$24,MATCH(Z177,Lookup!$K$9:$K$24,0)),\"N/A\")))","v":{"$error":"#N/A"}}]
[null,null,null,null,{"$f":"INDEX(Lookup!$I$9:$I$24,MATCH('Interior Lighting'!D178,Lookup!$C$9:$C$24,0))","v":{"$error":"#N/A"}},null,null,null,{"$error":"#N/A"},null,0,{"$error":"#DIV/0!"},"N/A",{"$f":"IF($D$20=\"Space-By-Space (90.1-2010)\",INDEX(LPD2010SS,MATCH('Interior Lighting'!D178,LightingSpaceType,0)*W178),INDEX(LPD2010WB,MATCH('Interior Lighting'!D178,LightingSpaceType,0)))","v":{"$error":"#N/A"}},0,{"$error":"#N/A"},{"$error":"#N/A"},{"$error":"#N/A"},0,"",null,null,1,null,{"$error":"#N/A"},{"$error":"#N/A"},{"$f":"INDEX(Lookup!$O$9:$O$24,MATCH('Interior Lighting'!Z178,Lookup!$K$9:$K$24,0))","v":{"$error":"#N/A"}},{"$f":"IF(E178=\"A\",INDEX(Lookup!$L$9:$L$24,MATCH(Z178,Lookup!$K$9:$K$24,0)),IF(E178=\"B\",INDEX(Lookup!$M$9:$M$24,MATCH(Z178,Lookup!$K$9:$K$24,0)),IF(E178=\"C\",INDEX(Lookup!$N$9:$N$24,MATCH(Z178,Lookup!$K$9:$K$24,0)),\"N/A\")))","v":{"$error":"#N/A"}}]
[null,null,null,null,{"$f":"INDEX(Lookup!$I$9:$I$24,MATCH('Interior Lighting'!D179,Lookup!$C$9:$C$24,0))","v":{"$error":"#N/A"}},null,null,null,{"$error":"#N/A"},null,0,{"$error":"#DIV/0!"},"N/A",{"$f":"IF($D$20=\"Space-By-Space (90.1-2010)\",INDEX(LPD2010SS,MATCH('Interior Lighting'!D179,LightingSpaceType,0)*W179),INDEX(LPD2010WB,MATCH('Interior Lighting'!D179,LightingSpaceType,0)))","v":{"$error":"#N/A"}},0,{"$error":"#N/A"},{"$error":"#N/A"},{"$error":"#N/A"},0,"",null,null,1,null,{"$error":"#N/A"},{"$error":"#N/A"},{"$f":"INDEX(Lookup!$O$9:$O$24,MATCH('Interior Lighting'!Z179,Lookup!$K$9:$K$24,0))","v":{"$error":"#N/A"}},{"$f":"IF(E179=\"A\",INDEX(Lookup!$L$9:$L$24,MATCH(Z179,Lookup!$K$9:$K$24,0)),IF(E179=\"B\",INDEX(Lookup!$M$9:$M$24,MATCH(Z179,Lookup!$K$9:$K$24,0)),IF(E179=\"C\",INDEX(Lookup!$N$9:$N$24,MATCH(Z179,Lookup!$K$9:$K$24,0)),\"N/A\")))","v":{"$error":"#N/A"}}]
[null,null,null,null,{"$f":"INDEX(Lookup!$I$9:$I$24,MATCH('Interior Lighting'!D180,Lookup!$C$9:$C$24,0))","v":{"$error":"#N/A"}},null,null,null,{"$error":"#N/A"},null,0,{"$error":"#DIV/0!"},"N/A",{"$f":"IF($D$20=\"Space-By-Space (90.1-2010)\",INDEX(LPD2010SS,MATCH('Interior Lighting'!D180,LightingSpaceType,0)*W180),INDEX(LPD2010WB,MATCH('Interior Lighting'!D180,LightingSpaceType,0)))","v":{"$error":"#N/A"}},0,{"$error":"#N/A"},{"$error":"#N/A"},{"$error":"#N/A"},0,"",null,null,1,null,{"$error":"#N/A"},{"$error":"#N/A"},{"$f":"INDEX(Lookup!$O$9:$O$24,MATCH('Interior Lighting'!Z180,Lookup!$K$9:$K$24,0))","v":{"$error":"#N/A"}},{"$f":"IF(E180=\"A\",INDEX(Lookup!$L$9:$L$24,MATCH(Z180,Lookup!$K$9:$K$24,0)),IF(E180=\"B\",INDEX(Lookup!$M$9:$M$24,MATCH(Z180,Lookup!$K$9:$K$24,0)),IF(E180=\"C\",INDEX(Lookup!$N$9:$N$24,MATCH(Z180,Lookup!$K$9:$K$24,0)),\"N/A\")))","v":{"$error":"#N/A"}}]
[null,null,null,null,{"$f":"INDEX(Lookup!$I$9:$I$24,MATCH('Interior Lighting'!D181,Lookup!$C$9:$C$24,0))","v":{"$error":"#N/A"}},null,null,null,{"$error":"#N/A"},null,0,{"$error":"#DIV/0!"},"N/A",{"$f":"IF($D$20=\"Space-By-Space (90.1-2010)\",INDEX(LPD2010SS,MATCH('Interior Lighting'!D181,LightingSpaceType,0)*W181),INDEX(LPD2010WB,MATCH('Interior Lighting'!D181,LightingSpaceType,0)))","v":{"$error":"#N/A"}},0,{"$error":"#N/A"},{"$error":"#N/A"},{"$error":"#N/A"},0,"",null,null,1,null,{"$error":"#N/A"},{"$error":"#N/A"},{"$f":"INDEX(Lookup!$O$9:$O$24,MATCH('Interior Lighting'!Z181,Lookup!$K$9:$K$24,0))","v":{"$error":"#N/A"}},{"$f":"IF(E181=\"A\",INDEX(Lookup!$L$9:$L$24,MATCH(Z181,Lookup!$K$9:$K$24,0)),IF(E181=\"B\",INDEX(Lookup!$M$9:$M$24,MATCH(Z181,Lookup!$K$9:$K$24,0)),IF(E181=\"C\",INDEX(Lookup!$N$9:$N$24,MATCH(Z181,Lookup!$K$9:$K$24,0)),\"N/A\")))","v":{"$error":"#N/A"}}]
[null,null,null,null,{"$f":"INDEX(Lookup!$I$9:$I$24,MATCH('Interior Lighting'!D182,Lookup!$C$9:$C$24,0))","v":{"$error":"#N/A"}},null,null,null,{"$error":"#N/A"},null,0,{"$error":"#DIV/0!"},"N/A",{"$f":"IF($D$20=\"Space-By-Space (90.1-2010)\",INDEX(LPD2010SS,MATCH('Interior Lighting'!D182,LightingSpaceType,0)*W182),INDEX(LPD2010WB,MATCH('Interior Lighting'!D182,LightingSpaceType,0)))","v":{"$error":"#N/A"}},0,{"$error":"#N/A"},{"$error":"#N/A"},{"$error":"#N/A"},0,"",null,null,1,null,{"$error":"#N/A"},{"$error":"#N/A"},{"$f":"INDEX(Lookup!$O$9:$O$24,MATCH('Interior Lighting'!Z182,Lookup!$K$9:$K$24,0))","v":{"$error":"#N/A"}},{"$f":"IF(E182=\"A\",INDEX(Lookup!$L$9:$L$24,MATCH(Z182,Lookup!$K$9:$K$24,0)),IF(E182=\"B\",INDEX(Lookup!$M$9:$M$24,MATCH(Z182,Lookup!$K$9:$K$24,0)),IF(E182=\"C\",INDEX(Lookup!$N$9:$N$24,MATCH(Z182,Lookup!$K$9:$K$24,0)),\"N/A\")))","v":{"$error":"#N/A"}}]
[null,null,null,null,{"$f":"INDEX(Lookup!$I$9:$I$24,MATCH('Interior Lighting'!D183,Lookup!$C$9:$C$24,0))","v":{"$error":"#N/A"}},null,null,null,{"$error":"#N/A"},null,0,{"$error":"#DIV/0!"},"N/A",{"$f":"IF($D$20=\"Space-By-Space (90.1-2010)\",INDEX(LPD2010SS,MATCH('Interior Lighting'!D183,LightingSpaceType,0)*W183),INDEX(LPD2010WB,MATCH('Interior Lighting'!D183,LightingSpaceType,0)))","v":{"$error":"#N/A"}},0,{"$error":"#N/A"},{"$error":"#N/A"},{"$error":"#N/A"},0,"",null,null,1,null,{"$error":"#N/A"},{"$error":"#N/A"},{"$f":"INDEX(Lookup!$O$9:$O$24,MATCH('Interior Lighting'!Z183,Lookup!$K$9:$K$24,0))","v":{"$error":"#N/A"}},{"$f":"IF(E183=\"A\",INDEX(Lookup!$L$9:$L$24,MATCH(Z183,Lookup!$K$9:$K$24,0)),IF(E183=\"B\",INDEX(Lookup!$M$9:$M$24,MATCH(Z183,Lookup!$K$9:$K$24,0)),IF(E183=\"C\",INDEX(Lookup!$N$9:$N$24,MATCH(Z183,Lookup!$K$9:$K$24,0)),\"N/A\")))","v":{"$error":"#N/A"}}]
[null,null,null,null,{"$f":"INDEX(Lookup!$I$9:$I$24,MATCH('Interior Lighting'!D184,Lookup!$C$9:$C$24,0))","v":{"$error":"#N/A"}},null,null,null,{"$error":"#N/A"},null,0,{"$error":"#DIV/0!"},"N/A",{"$f":"IF($D$20=\"Space-By-Space (90.1-2010)\",INDEX(LPD2010SS,MATCH('Interior Lighting'!D184,LightingSpaceType,0)*W184),INDEX(LPD2010WB,MATCH('Interior Lighting'!D184,LightingSpaceType,0)))","v":{"$error":"#N/A"}},0,{"$error":"#N/A"},{"$error":"#N/A"},{"$error":"#N/A"},0,"",null,null,1,null,{"$error":"#N/A"},{"$error":"#N/A"},{"$f":"INDEX(Lookup!$O$9:$O$24,MATCH('Interior Lighting'!Z184,Lookup!$K$9:$K$24,0))","v":{"$error":"#N/A"}},{"$f":"IF(E184=\"A\",INDEX(Lookup!$L$9:$L$24,MATCH(Z184,Lookup!$K$9:$K$24,0)),IF(E184=\"B\",INDEX(Lookup!$M$9:$M$24,MATCH(Z184,Lookup!$K$9:$K$24,0)),IF(E184=\"C\",INDEX(Lookup!$N$9:$N$24,MATCH(Z184,Lookup!$K$9:$K$24,0)),\"N/A\")))","v":{"$error":"#N/A"}}]
[null,null,null,null,{"$f":"INDEX(Lookup!$I$9:$I$24,MATCH('Interior Lighting'!D185,Lookup!$C$9:$C$24,0))","v":{"$error":"#N/A"}},null,null,null,{"$error":"#N/A"},null,0,{"$error":"#DIV/0!"},"N/A",{"$f":"IF($D$20=\"Space-By-Space (90.1-2010)\",INDEX(LPD2010SS,MATCH('Interior Lighting'!D185,LightingSpaceType,0)*W185),INDEX(LPD2010WB,MATCH('Interior Lighting'!D185,LightingSpaceType,0)))","v":{"$error":"#N/A"}},0,{"$error":"#N/A"},{"$error":"#N/A"},{"$error":"#N/A"},0,"",null,null,1,null,{"$error":"#N/A"},{"$error":"#N/A"},{"$f":"INDEX(Lookup!$O$9:$O$24,MATCH('Interior Lighting'!Z185,Lookup!$K$9:$K$24,0))","v":{"$error":"#N/A"}},{"$f":"IF(E185=\"A\",INDEX(Lookup!$L$9:$L$24,MATCH(Z185,Lookup!$K$9:$K$24,0)),IF(E185=\"B\",INDEX(Lookup!$M$9:$M$24,MATCH(Z185,Lookup!$K$9:$K$24,0)),IF(E185=\"C\",INDEX(Lookup!$N$9:$N$24,MATCH(Z185,Lookup!$K$9:$K$24,0)),\"N/A\")))","v":{"$error":"#N/A"}}]
[null,null,null,null,{"$f":"INDEX(Lookup!$I$9:$I$24,MATCH('Interior Lighting'!D186,Lookup!$C$9:$C$24,0))","v":{"$error":"#N/A"}},null,null,null,{"$error":"#N/A"},null,0,{"$error":"#DIV/0!"},"N/A",{"$f":"IF($D$20=\"Space-By-Space (90.1-2010)\",INDEX(LPD2010SS,MATCH('Interior Lighting'!D186,LightingSpaceType,0)*W186),INDEX(LPD2010WB,MATCH('Interior Lighting'!D186,LightingSpaceType,0)))","v":{"$error":"#N/A"}},0,{"$error":"#N/A"},{"$error":"#N/A"},{"$error":"#N/A"},0,"",null,null,1,null,{"$error":"#N/A"},{"$error":"#N/A"},{"$f":"INDEX(Lookup!$O$9:$O$24,MATCH('Interior Lighting'!Z186,Lookup!$K$9:$K$24,0))","v":{"$error":"#N/A"}},{"$f":"IF(E186=\"A\",INDEX(Lookup!$L$9:$L$24,MATCH(Z186,Lookup!$K$9:$K$24,0)),IF(E186=\"B\",INDEX(Lookup!$M$9:$M$24,MATCH(Z186,Lookup!$K$9:$K$24,0)),IF(E186=\"C\",INDEX(Lookup!$N$9:$N$24,MATCH(Z186,Lookup!$K$9:$K$24,0)),\"N/A\")))","v":{"$error":"#N/A"}}]
[null,null,null,null,{"$f":"INDEX(Lookup!$I$9:$I$24,MATCH('Interior Lighting'!D187,Lookup!$C$9:$C$24,0))","v":{"$error":"#N/A"}},null,null,null,{"$error":"#N/A"},null,0,{"$error":"#DIV/0!"},"N/A",{"$f":"IF($D$20=\"Space-By-Space (90.1-2010)\",INDEX(LPD2010SS,MATCH('Interior Lighting'!D187,LightingSpaceType,0)*W187),INDEX(LPD2010WB,MATCH('Interior Lighting'!D187,LightingSpaceType,0)))","v":{"$error":"#N/A"}},0,{"$error":"#N/A"},{"$error":"#N/A"},{"$error":"#N/A"},0,"",null,null,1,null,{"$error":"#N/A"},{"$error":"#N/A"},{"$f":"INDEX(Lookup!$O$9:$O$24,MATCH('Interior Lighting'!Z187,Lookup!$K$9:$K$24,0))","v":{"$error":"#N/A"}},{"$f":"IF(E187=\"A\",INDEX(Lookup!$L$9:$L$24,MATCH(Z187,Lookup!$K$9:$K$24,0)),IF(E187=\"B\",INDEX(Lookup!$M$9:$M$24,MATCH(Z187,Lookup!$K$9:$K$24,0)),IF(E187=\"C\",INDEX(Lookup!$N$9:$N$24,MATCH(Z187,Lookup!$K$9:$K$24,0)),\"N/A\")))","v":{"$error":"#N/A"}}]
[null,null,null,null,{"$f":"INDEX(Lookup!$I$9:$I$24,MATCH('Interior Lighting'!D188,Lookup!$C$9:$C$24,0))","v":{"$error":"#N/A"}},null,null,null,{"$error":"#N/A"},null,0,{"$error":"#DIV/0!"},"N/A",{"$f":"IF($D$20=\"Space-By-Space (90.1-2010)\",INDEX(LPD2010SS,MATCH('Interior Lighting'!D188,LightingSpaceType,0)*W188),INDEX(LPD2010WB,MATCH('Interior Lighting'!D188,LightingSpaceType,0)))","v":{"$error":"#N/A"}},0,{"$error":"#N/A"},{"$error":"#N/A"},{"$error":"#N/A"},0,"",null,null,1,null,{"$error":"#N/A"},{"$error":"#N/A"},{"$f":"INDEX(Lookup!$O$9:$O$24,MATCH('Interior Lighting'!Z188,Lookup!$K$9:$K$24,0))","v":{"$error":"#N/A"}},{"$f":"IF(E188=\"A\",INDEX(Lookup!$L$9:$L$24,MATCH(Z188,Lookup!$K$9:$K$24,0)),IF(E188=\"B\",INDEX(Lookup!$M$9:$M$24,MATCH(Z188,Lookup!$K$9:$K$24,0)),IF(E188=\"C\",INDEX(Lookup!$N$9:$N$24,MATCH(Z188,Lookup!$K$9:$K$24,0)),\"N/A\")))","v":{"$error":"#N/A"}}]
[null,null,null,null,{"$f":"INDEX(Lookup!$I$9:$I$24,MATCH('Interior Lighting'!D189,Lookup!$C$9:$C$24,0))","v":{"$error":"#N/A"}},null,null,null,{"$error":"#N/A"},null,0,{"$error":"#DIV/0!"},"N/A",{"$f":"IF($D$20=\"Space-By-Space (90.1-2010)\",INDEX(LPD2010SS,MATCH('Interior Lighting'!D189,LightingSpaceType,0)*W189),INDEX(LPD2010WB,MATCH('Interior Lighting'!D189,LightingSpaceType,0)))","v":{"$error":"#N/A"}},0,{"$error":"#N/A"},{"$error":"#N/A"},{"$error":"#N/A"},0,"",null,null,1,null,{"$error":"#N/A"},{"$error":"#N/A"},{"$f":"INDEX(Lookup!$O$9:$O$24,MATCH('Interior Lighting'!Z189,Lookup!$K$9:$K$24,0))","v":{"$error":"#N/A"}},{"$f":"IF(E189=\"A\",INDEX(Lookup!$L$9:$L$24,MATCH(Z189,Lookup!$K$9:$K$24,0)),IF(E189=\"B\",INDEX(Lookup!$M$9:$M$24,MATCH(Z189,Lookup!$K$9:$K$24,0)),IF(E189=\"C\",INDEX(Lookup!$N$9:$N$24,MATCH(Z189,Lookup!$K$9:$K$24,0)),\"N/A\")))","v":{"$error":"#N/A"}}]
[null,null,null,null,{"$f":"INDEX(Lookup!$I$9:$I$24,MATCH('Interior Lighting'!D190,Lookup!$C$9:$C$24,0))","v":{"$error":"#N/A"}},null,null,null,{"$error":"#N/A"},null,0,{"$error":"#DIV/0!"},"N/A",{"$f":"IF($D$20=\"Space-By-Space (90.1-2010)\",INDEX(LPD2010SS,MATCH('Interior Lighting'!D190,LightingSpaceType,0)*W190),INDEX(LPD2010WB,MATCH('Interior Lighting'!D190,LightingSpaceType,0)))","v":{"$error":"#N/A"}},0,{"$error":"#N/A"},{"$error":"#N/A"},{"$error":"#N/A"},0,"",null,null,1,null,{"$error":"#N/A"},{"$error":"#N/A"},{"$f":"INDEX(Lookup!$O$9:$O$24,MATCH('Interior Lighting'!Z190,Lookup!$K$9:$K$24,0))","v":{"$error":"#N/A"}},{"$f":"IF(E190=\"A\",INDEX(Lookup!$L$9:$L$24,MATCH(Z190,Lookup!$K$9:$K$24,0)),IF(E190=\"B\",INDEX(Lookup!$M$9:$M$24,MATCH(Z190,Lookup!$K$9:$K$24,0)),IF(E190=\"C\",INDEX(Lookup!$N$9:$N$24,MATCH(Z190,Lookup!$K$9:$K$24,0)),\"N/A\")))","v":{"$error":"#N/A"}}]
[null,null,null,null,{"$f":"INDEX(Lookup!$I$9:$I$24,MATCH('Interior Lighting'!D191,Lookup!$C$9:$C$24,0))","v":{"$error":"#N/A"}},null,null,null,{"$error":"#N/A"},null,0,{"$error":"#DIV/0!"},"N/A",{"$f":"IF($D$20=\"Space-By-Space (90.1-2010)\",INDEX(LPD2010SS,MATCH('Interior Lighting'!D191,LightingSpaceType,0)*W191),INDEX(LPD2010WB,MATCH('Interior Lighting'!D191,LightingSpaceType,0)))","v":{"$error":"#N/A"}},0,{"$error":"#N/A"},{"$error":"#N/A"},{"$error":"#N/A"},0,"",null,null,1,null,{"$error":"#N/A"},{"$error":"#N/A"},{"$f":"INDEX(Lookup!$O$9:$O$24,MATCH('Interior Lighting'!Z191,Lookup!$K$9:$K$24,0))","v":{"$error":"#N/A"}},{"$f":"IF(E191=\"A\",INDEX(Lookup!$L$9:$L$24,MATCH(Z191,Lookup!$K$9:$K$24,0)),IF(E191=\"B\",INDEX(Lookup!$M$9:$M$24,MATCH(Z191,Lookup!$K$9:$K$24,0)),IF(E191=\"C\",INDEX(Lookup!$N$9:$N$24,MATCH(Z191,Lookup!$K$9:$K$24,0)),\"N/A\")))","v":{"$error":"#N/A"}}]
[null,null,null,null,{"$f":"INDEX(Lookup!$I$9:$I$24,MATCH('Interior Lighting'!D192,Lookup!$C$9:$C$24,0))","v":{"$error":"#N/A"}},null,null,null,{"$error":"#N/A"},null,0,{"$error":"#DIV/0!"},"N/A",{"$f":"IF($D$20=\"Space-By-Space (90.1-2010)\",INDEX(LPD2010SS,MATCH('Interior Lighting'!D192,LightingSpaceType,0)*W192),INDEX(LPD2010WB,MATCH('Interior Lighting'!D192,LightingSpaceType,0)))","v":{"$error":"#N/A"}},0,{"$error":"#N/A"},{"$error":"#N/A"},{"$error":"#N/A"},0,"",null,null,1,null,{"$error":"#N/A"},{"$error":"#N/A"},{"$f":"INDEX(Lookup!$O$9:$O$24,MATCH('Interior Lighting'!Z192,Lookup!$K$9:$K$24,0))","v":{"$error":"#N/A"}},{"$f":"IF(E192=\"A\",INDEX(Lookup!$L$9:$L$24,MATCH(Z192,Lookup!$K$9:$K$24,0)),IF(E192=\"B\",INDEX(Lookup!$M$9:$M$24,MATCH(Z192,Lookup!$K$9:$K$24,0)),IF(E192=\"C\",INDEX(Lookup!$N$9:$N$24,MATCH(Z192,Lookup!$K$9:$K$24,0)),\"N/A\")))","v":{"$error":"#N/A"}}]
[null,null,null,null,{"$f":"INDEX(Lookup!$I$9:$I$24,MATCH('Interior Lighting'!D193,Lookup!$C$9:$C$24,0))","v":{"$error":"#N/A"}},null,null,null,{"$error":"#N/A"},null,0,{"$error":"#DIV/0!"},"N/A",{"$f":"IF($D$20=\"Space-By-Space (90.1-2010)\",INDEX(LPD2010SS,MATCH('Interior Lighting'!D193,LightingSpaceType,0)*W193),INDEX(LPD2010WB,MATCH('Interior Lighting'!D193,LightingSpaceType,0)))","v":{"$error":"#N/A"}},0,{"$error":"#N/A"},{"$error":"#N/A"},{"$error":"#N/A"},0,"",null,null,1,null,{"$error":"#N/A"},{"$error":"#N/A"},{"$f":"INDEX(Lookup!$O$9:$O$24,MATCH('Interior Lighting'!Z193,Lookup!$K$9:$K$24,0))","v":{"$error":"#N/A"}},{"$f":"IF(E193=\"A\",INDEX(Lookup!$L$9:$L$24,MATCH(Z193,Lookup!$K$9:$K$24,0)),IF(E193=\"B\",INDEX(Lookup!$M$9:$M$24,MATCH(Z193,Lookup!$K$9:$K$24,0)),IF(E193=\"C\",INDEX(Lookup!$N$9:$N$24,MATCH(Z193,Lookup!$K$9:$K$24,0)),\"N/A\")))","v":{"$error":"#N/A"}}]
[null,null,null,null,{"$f":"INDEX(Lookup!$I$9:$I$24,MATCH('Interior Lighting'!D194,Lookup!$C$9:$C$24,0))","v":{"$error":"#N/A"}},null,null,null,{"$error":"#N/A"},null,0,{"$error":"#DIV/0!"},"N/A",{"$f":"IF($D$20=\"Space-By-Space (90.1-2010)\",INDEX(LPD2010SS,MATCH('Interior Lighting'!D194,LightingSpaceType,0)*W194),INDEX(LPD2010WB,MATCH('Interior Lighting'!D194,LightingSpaceType,0)))","v":{"$error":"#N/A"}},0,{"$error":"#N/A"},{"$error":"#N/A"},{"$error":"#N/A"},0,"",null,null,1,null,{"$error":"#N/A"},{"$error":"#N/A"},{"$f":"INDEX(Lookup!$O$9:$O$24,MATCH('Interior Lighting'!Z194,Lookup!$K$9:$K$24,0))","v":{"$error":"#N/A"}},{"$f":"IF(E194=\"A\",INDEX(Lookup!$L$9:$L$24,MATCH(Z194,Lookup!$K$9:$K$24,0)),IF(E194=\"B\",INDEX(Lookup!$M$9:$M$24,MATCH(Z194,Lookup!$K$9:$K$24,0)),IF(E194=\"C\",INDEX(Lookup!$N$9:$N$24,MATCH(Z194,Lookup!$K$9:$K$24,0)),\"N/A\")))","v":{"$error":"#N/A"}}]
[null,null,null,null,{"$f":"INDEX(Lookup!$I$9:$I$24,MATCH('Interior Lighting'!D195,Lookup!$C$9:$C$24,0))","v":{"$error":"#N/A"}},null,null,null,{"$error":"#N/A"},null,0,{"$error":"#DIV/0!"},"N/A",{"$f":"IF($D$20=\"Space-By-Space (90.1-2010)\",INDEX(LPD2010SS,MATCH('Interior Lighting'!D195,LightingSpaceType,0)*W195),INDEX(LPD2010WB,MATCH('Interior Lighting'!D195,LightingSpaceType,0)))","v":{"$error":"#N/A"}},0,{"$error":"#N/A"},{"$error":"#N/A"},{"$error":"#N/A"},0,"",null,null,1,null,{"$error":"#N/A"},{"$error":"#N/A"},{"$f":"INDEX(Lookup!$O$9:$O$24,MATCH('Interior Lighting'!Z195,Lookup!$K$9:$K$24,0))","v":{"$error":"#N/A"}},{"$f":"IF(E195=\"A\",INDEX(Lookup!$L$9:$L$24,MATCH(Z195,Lookup!$K$9:$K$24,0)),IF(E195=\"B\",INDEX(Lookup!$M$9:$M$24,MATCH(Z195,Lookup!$K$9:$K$24,0)),IF(E195=\"C\",INDEX(Lookup!$N$9:$N$24,MATCH(Z195,Lookup!$K$9:$K$24,0)),\"N/A\")))","v":{"$error":"#N/A"}}]
[null,null,null,null,{"$f":"INDEX(Lookup!$I$9:$I$24,MATCH('Interior Lighting'!D196,Lookup!$C$9:$C$24,0))","v":{"$error":"#N/A"}},null,null,null,{"$error":"#N/A"},null,0,{"$error":"#DIV/0!"},"N/A",{"$f":"IF($D$20=\"Space-By-Space (90.1-2010)\",INDEX(LPD2010SS,MATCH('Interior Lighting'!D196,LightingSpaceType,0)*W196),INDEX(LPD2010WB,MATCH('Interior Lighting'!D196,LightingSpaceType,0)))","v":{"$error":"#N/A"}},0,{"$error":"#N/A"},{"$error":"#N/A"},{"$error":"#N/A"},0,"",null,null,1,null,{"$error":"#N/A"},{"$error":"#N/A"},{"$f":"INDEX(Lookup!$O$9:$O$24,MATCH('Interior Lighting'!Z196,Lookup!$K$9:$K$24,0))","v":{"$error":"#N/A"}},{"$f":"IF(E196=\"A\",INDEX(Lookup!$L$9:$L$24,MATCH(Z196,Lookup!$K$9:$K$24,0)),IF(E196=\"B\",INDEX(Lookup!$M$9:$M$24,MATCH(Z196,Lookup!$K$9:$K$24,0)),IF(E196=\"C\",INDEX(Lookup!$N$9:$N$24,MATCH(Z196,Lookup!$K$9:$K$24,0)),\"N/A\")))","v":{"$error":"#N/A"}}]
[null,null,null,null,{"$f":"INDEX(Lookup!$I$9:$I$24,MATCH('Interior Lighting'!D197,Lookup!$C$9:$C$24,0))","v":{"$error":"#N/A"}},null,null,null,{"$error":"#N/A"},null,0,{"$error":"#DIV/0!"},"N/A",{"$f":"IF($D$20=\"Space-By-Space (90.1-2010)\",INDEX(LPD2010SS,MATCH('Interior Lighting'!D197,LightingSpaceType,0)*W197),INDEX(LPD2010WB,MATCH('Interior Lighting'!D197,LightingSpaceType,0)))","v":{"$error":"#N/A"}},0,{"$error":"#N/A"},{"$error":"#N/A"},{"$error":"#N/A"},0,"",null,null,1,null,{"$error":"#N/A"},{"$error":"#N/A"},{"$f":"INDEX(Lookup!$O$9:$O$24,MATCH('Interior Lighting'!Z197,Lookup!$K$9:$K$24,0))","v":{"$error":"#N/A"}},{"$f":"IF(E197=\"A\",INDEX(Lookup!$L$9:$L$24,MATCH(Z197,Lookup!$K$9:$K$24,0)),IF(E197=\"B\",INDEX(Lookup!$M$9:$M$24,MATCH(Z197,Lookup!$K$9:$K$24,0)),IF(E197=\"C\",INDEX(Lookup!$N$9:$N$24,MATCH(Z197,Lookup!$K$9:$K$24,0)),\"N/A\")))","v":{"$error":"#N/A"}}]
[null,null,null,null,{"$f":"INDEX(Lookup!$I$9:$I$24,MATCH('Interior Lighting'!D198,Lookup!$C$9:$C$24,0))","v":{"$error":"#N/A"}},null,null,null,{"$error":"#N/A"},null,0,{"$error":"#DIV/0!"},"N/A",{"$f":"IF($D$20=\"Space-By-Space (90.1-2010)\",INDEX(LPD2010SS,MATCH('Interior Lighting'!D198,LightingSpaceType,0)*W198),INDEX(LPD2010WB,MATCH('Interior Lighting'!D198,LightingSpaceType,0)))","v":{"$error":"#N/A"}},0,{"$error":"#N/A"},{"$error":"#N/A"},{"$error":"#N/A"},0,"",null,null,1,null,{"$error":"#N/A"},{"$error":"#N/A"},{"$f":"INDEX(Lookup!$O$9:$O$24,MATCH('Interior Lighting'!Z198,Lookup!$K$9:$K$24,0))","v":{"$error":"#N/A"}},{"$f":"IF(E198=\"A\",INDEX(Lookup!$L$9:$L$24,MATCH(Z198,Lookup!$K$9:$K$24,0)),IF(E198=\"B\",INDEX(Lookup!$M$9:$M$24,MATCH(Z198,Lookup!$K$9:$K$24,0)),IF(E198=\"C\",INDEX(Lookup!$N$9:$N$24,MATCH(Z198,Lookup!$K$9:$K$24,0)),\"N/A\")))","v":{"$error":"#N/A"}}]
[null,null,null,null,{"$f":"INDEX(Lookup!$I$9:$I$24,MATCH('Interior Lighting'!D199,Lookup!$C$9:$C$24,0))","v":{"$error":"#N/A"}},null,null,null,{"$error":"#N/A"},null,0,{"$error":"#DIV/0!"},"N/A",{"$f":"IF($D$20=\"Space-By-Space (90.1-2010)\",INDEX(LPD2010SS,MATCH('Interior Lighting'!D199,LightingSpaceType,0)*W199),INDEX(LPD2010WB,MATCH('Interior Lighting'!D199,LightingSpaceType,0)))","v":{"$error":"#N/A"}},0,{"$error":"#N/A"},{"$error":"#N/A"},{"$error":"#N/A"},0,"",null,null,1,null,{"$error":"#N/A"},{"$error":"#N/A"},{"$f":"INDEX(Lookup!$O$9:$O$24,MATCH('Interior Lighting'!Z199,Lookup!$K$9:$K$24,0))","v":{"$error":"#N/A"}},{"$f":"IF(E199=\"A\",INDEX(Lookup!$L$9:$L$24,MATCH(Z199,Lookup!$K$9:$K$24,0)),IF(E199=\"B\",INDEX(Lookup!$M$9:$M$24,MATCH(Z199,Lookup!$K$9:$K$24,0)),IF(E199=\"C\",INDEX(Lookup!$N$9:$N$24,MATCH(Z199,Lookup!$K$9:$K$24,0)),\"N/A\")))","v":{"$error":"#N/A"}}]
[null,null,null,null,{"$f":"INDEX(Lookup!$I$9:$I$24,MATCH('Interior Lighting'!D200,Lookup!$C$9:$C$24,0))","v":{"$error":"#N/A"}},null,null,null,{"$error":"#N/A"},null,0,{"$error":"#DIV/0!"},"N/A",{"$f":"IF($D$20=\"Space-By-Space (90.1-2010)\",INDEX(LPD2010SS,MATCH('Interior Lighting'!D200,LightingSpaceType,0)*W200),INDEX(LPD2010WB,MATCH('Interior Lighting'!D200,LightingSpaceType,0)))","v":{"$error":"#N/A"}},0,{"$error":"#N/A"},{"$error":"#N/A"},{"$error":"#N/A"},0,"",null,null,1,null,{"$error":"#N/A"},{"$error":"#N/A"},{"$f":"INDEX(Lookup!$O$9:$O$24,MATCH('Interior Lighting'!Z200,Lookup!$K$9:$K$24,0))","v":{"$error":"#N/A"}},{"$f":"IF(E200=\"A\",INDEX(Lookup!$L$9:$L$24,MATCH(Z200,Lookup!$K$9:$K$24,0)),IF(E200=\"B\",INDEX(Lookup!$M$9:$M$24,MATCH(Z200,Lookup!$K$9:$K$24,0)),IF(E200=\"C\",INDEX(Lookup!$N$9:$N$24,MATCH(Z200,Lookup!$K$9:$K$24,0)),\"N/A\")))","v":{"$error":"#N/A"}}]
[null,null,null,null,{"$f":"INDEX(Lookup!$I$9:$I$24,MATCH('Interior Lighting'!D201,Lookup!$C$9:$C$24,0))","v":{"$error":"#N/A"}},null,null,null,{"$error":"#N/A"},null,0,{"$error":"#DIV/0!"},"N/A",{"$f":"IF($D$20=\"Space-By-Space (90.1-2010)\",INDEX(LPD2010SS,MATCH('Interior Lighting'!D201,LightingSpaceType,0)*W201),INDEX(LPD2010WB,MATCH('Interior Lighting'!D201,LightingSpaceType,0)))","v":{"$error":"#N/A"}},0,{"$error":"#N/A"},{"$error":"#N/A"},{"$error":"#N/A"},0,"",null,null,1,null,{"$error":"#N/A"},{"$error":"#N/A"},{"$f":"INDEX(Lookup!$O$9:$O$24,MATCH('Interior Lighting'!Z201,Lookup!$K$9:$K$24,0))","v":{"$error":"#N/A"}},{"$f":"IF(E201=\"A\",INDEX(Lookup!$L$9:$L$24,MATCH(Z201,Lookup!$K$9:$K$24,0)),IF(E201=\"B\",INDEX(Lookup!$M$9:$M$24,MATCH(Z201,Lookup!$K$9:$K$24,0)),IF(E201=\"C\",INDEX(Lookup!$N$9:$N$24,MATCH(Z201,Lookup!$K$9:$K$24,0)),\"N/A\")))","v":{"$error":"#N/A"}}]
[null,null,null,null,{"$f":"INDEX(Lookup!$I$9:$I$24,MATCH('Interior Lighting'!D202,Lookup!$C$9:$C$24,0))","v":{"$error":"#N/A"}},null,null,null,{"$error":"#N/A"},null,0,{"$error":"#DIV/0!"},"N/A",{"$f":"IF($D$20=\"Space-By-Space (90.1-2010)\",INDEX(LPD2010SS,MATCH('Interior Lighting'!D202,LightingSpaceType,0)*W202),INDEX(LPD2010WB,MATCH('Interior Lighting'!D202,LightingSpaceType,0)))","v":{"$error":"#N/A"}},0,{"$error":"#N/A"},{"$error":"#N/A"},{"$error":"#N/A"},0,"",null,null,1,null,{"$error":"#N/A"},{"$error":"#N/A"},{"$f":"INDEX(Lookup!$O$9:$O$24,MATCH('Interior Lighting'!Z202,Lookup!$K$9:$K$24,0))","v":{"$error":"#N/A"}},{"$f":"IF(E202=\"A\",INDEX(Lookup!$L$9:$L$24,MATCH(Z202,Lookup!$K$9:$K$24,0)),IF(E202=\"B\",INDEX(Lookup!$M$9:$M$24,MATCH(Z202,Lookup!$K$9:$K$24,0)),IF(E202=\"C\",INDEX(Lookup!$N$9:$N$24,MATCH(Z202,Lookup!$K$9:$K$24,0)),\"N/A\")))","v":{"$error":"#N/A"}}]
[null,null,null,null,{"$f":"INDEX(Lookup!$I$9:$I$24,MATCH('Interior Lighting'!D203,Lookup!$C$9:$C$24,0))","v":{"$error":"#N/A"}},null,null,null,{"$error":"#N/A"},null,0,{"$error":"#DIV/0!"},"N/A",{"$f":"IF($D$20=\"Space-By-Space (90.1-2010)\",INDEX(LPD2010SS,MATCH('Interior Lighting'!D203,LightingSpaceType,0)*W203),INDEX(LPD2010WB,MATCH('Interior Lighting'!D203,LightingSpaceType,0)))","v":{"$error":"#N/A"}},0,{"$error":"#N/A"},{"$error":"#N/A"},{"$error":"#N/A"},0,"",null,null,1,null,{"$error":"#N/A"},{"$error":"#N/A"},{"$f":"INDEX(Lookup!$O$9:$O$24,MATCH('Interior Lighting'!Z203,Lookup!$K$9:$K$24,0))","v":{"$error":"#N/A"}},{"$f":"IF(E203=\"A\",INDEX(Lookup!$L$9:$L$24,MATCH(Z203,Lookup!$K$9:$K$24,0)),IF(E203=\"B\",INDEX(Lookup!$M$9:$M$24,MATCH(Z203,Lookup!$K$9:$K$24,0)),IF(E203=\"C\",INDEX(Lookup!$N$9:$N$24,MATCH(Z203,Lookup!$K$9:$K$24,0)),\"N/A\")))","v":{"$error":"#N/A"}}]
[null,null,null,null,{"$f":"INDEX(Lookup!$I$9:$I$24,MATCH('Interior Lighting'!D204,Lookup!$C$9:$C$24,0))","v":{"$error":"#N/A"}},null,null,null,{"$error":"#N/A"},null,0,{"$error":"#DIV/0!"},"N/A",{"$f":"IF($D$20=\"Space-By-Space (90.1-2010)\",INDEX(LPD2010SS,MATCH('Interior Lighting'!D204,LightingSpaceType,0)*W204),INDEX(LPD2010WB,MATCH('Interior Lighting'!D204,LightingSpaceType,0)))","v":{"$error":"#N/A"}},0,{"$error":"#N/A"},{"$error":"#N/A"},{"$error":"#N/A"},0,"",null,null,1,null,{"$error":"#N/A"},{"$error":"#N/A"},{"$f":"INDEX(Lookup!$O$9:$O$24,MATCH('Interior Lighting'!Z204,Lookup!$K$9:$K$24,0))","v":{"$error":"#N/A"}},{"$f":"IF(E204=\"A\",INDEX(Lookup!$L$9:$L$24,MATCH(Z204,Lookup!$K$9:$K$24,0)),IF(E204=\"B\",INDEX(Lookup!$M$9:$M$24,MATCH(Z204,Lookup!$K$9:$K$24,0)),IF(E204=\"C\",INDEX(Lookup!$N$9:$N$24,MATCH(Z204,Lookup!$K$9:$K$24,0)),\"N/A\")))","v":{"$error":"#N/A"}}]
[null,null,null,null,{"$f":"INDEX(Lookup!$I$9:$I$24,MATCH('Interior Lighting'!D205,Lookup!$C$9:$C$24,0))","v":{"$error":"#N/A"}},null,null,null,{"$error":"#N/A"},null,0,{"$error":"#DIV/0!"},"N/A",{"$f":"IF($D$20=\"Space-By-Space (90.1-2010)\",INDEX(LPD2010SS,MATCH('Interior Lighting'!D205,LightingSpaceType,0)*W205),INDEX(LPD2010WB,MATCH('Interior Lighting'!D205,LightingSpaceType,0)))","v":{"$error":"#N/A"}},0,{"$error":"#N/A"},{"$error":"#N/A"},{"$error":"#N/A"},0,"",null,null,1,null,{"$error":"#N/A"},{"$error":"#N/A"},{"$f":"INDEX(Lookup!$O$9:$O$24,MATCH('Interior Lighting'!Z205,Lookup!$K$9:$K$24,0))","v":{"$error":"#N/A"}},{"$f":"IF(E205=\"A\",INDEX(Lookup!$L$9:$L$24,MATCH(Z205,Lookup!$K$9:$K$24,0)),IF(E205=\"B\",INDEX(Lookup!$M$9:$M$24,MATCH(Z205,Lookup!$K$9:$K$24,0)),IF(E205=\"C\",INDEX(Lookup!$N$9:$N$24,MATCH(Z205,Lookup!$K$9:$K$24,0)),\"N/A\")))","v":{"$error":"#N/A"}}]
[null,null,null,null,{"$f":"INDEX(Lookup!$I$9:$I$24,MATCH('Interior Lighting'!D206,Lookup!$C$9:$C$24,0))","v":{"$error":"#N/A"}},null,null,null,{"$error":"#N/A"},null,0,{"$error":"#DIV/0!"},"N/A",{"$f":"IF($D$20=\"Space-By-Space (90.1-2010)\",INDEX(LPD2010SS,MATCH('Interior Lighting'!D206,LightingSpaceType,0)*W206),INDEX(LPD2010WB,MATCH('Interior Lighting'!D206,LightingSpaceType,0)))","v":{"$error":"#N/A"}},0,{"$error":"#N/A"},{"$error":"#N/A"},{"$error":"#N/A"},0,"",null,null,1,null,{"$error":"#N/A"},{"$error":"#N/A"},{"$f":"INDEX(Lookup!$O$9:$O$24,MATCH('Interior Lighting'!Z206,Lookup!$K$9:$K$24,0))","v":{"$error":"#N/A"}},{"$f":"IF(E206=\"A\",INDEX(Lookup!$L$9:$L$24,MATCH(Z206,Lookup!$K$9:$K$24,0)),IF(E206=\"B\",INDEX(Lookup!$M$9:$M$24,MATCH(Z206,Lookup!$K$9:$K$24,0)),IF(E206=\"C\",INDEX(Lookup!$N$9:$N$24,MATCH(Z206,Lookup!$K$9:$K$24,0)),\"N/A\")))","v":{"$error":"#N/A"}}]
[null,null,null,null,{"$f":"INDEX(Lookup!$I$9:$I$24,MATCH('Interior Lighting'!D207,Lookup!$C$9:$C$24,0))","v":{"$error":"#N/A"}},null,null,null,{"$error":"#N/A"},null,0,{"$error":"#DIV/0!"},"N/A",{"$f":"IF($D$20=\"Space-By-Space (90.1-2010)\",INDEX(LPD2010SS,MATCH('Interior Lighting'!D207,LightingSpaceType,0)*W207),INDEX(LPD2010WB,MATCH('Interior Lighting'!D207,LightingSpaceType,0)))","v":{"$error":"#N/A"}},0,{"$error":"#N/A"},{"$error":"#N/A"},{"$error":"#N/A"},0,"",null,null,1,null,{"$error":"#N/A"},{"$error":"#N/A"},{"$f":"INDEX(Lookup!$O$9:$O$24,MATCH('Interior Lighting'!Z207,Lookup!$K$9:$K$24,0))","v":{"$error":"#N/A"}},{"$f":"IF(E207=\"A\",INDEX(Lookup!$L$9:$L$24,MATCH(Z207,Lookup!$K$9:$K$24,0)),IF(E207=\"B\",INDEX(Lookup!$M$9:$M$24,MATCH(Z207,Lookup!$K$9:$K$24,0)),IF(E207=\"C\",INDEX(Lookup!$N$9:$N$24,MATCH(Z207,Lookup!$K$9:$K$24,0)),\"N/A\")))","v":{"$error":"#N/A"}}]
[null,null,null,null,{"$f":"INDEX(Lookup!$I$9:$I$24,MATCH('Interior Lighting'!D208,Lookup!$C$9:$C$24,0))","v":{"$error":"#N/A"}},null,null,null,{"$error":"#N/A"},null,0,{"$error":"#DIV/0!"},"N/A",{"$f":"IF($D$20=\"Space-By-Space (90.1-2010)\",INDEX(LPD2010SS,MATCH('Interior Lighting'!D208,LightingSpaceType,0)*W208),INDEX(LPD2010WB,MATCH('Interior Lighting'!D208,LightingSpaceType,0)))","v":{"$error":"#N/A"}},0,{"$error":"#N/A"},{"$error":"#N/A"},{"$error":"#N/A"},0,"",null,null,1,null,{"$error":"#N/A"},{"$error":"#N/A"},{"$f":"INDEX(Lookup!$O$9:$O$24,MATCH('Interior Lighting'!Z208,Lookup!$K$9:$K$24,0))","v":{"$error":"#N/A"}},{"$f":"IF(E208=\"A\",INDEX(Lookup!$L$9:$L$24,MATCH(Z208,Lookup!$K$9:$K$24,0)),IF(E208=\"B\",INDEX(Lookup!$M$9:$M$24,MATCH(Z208,Lookup!$K$9:$K$24,0)),IF(E208=\"C\",INDEX(Lookup!$N$9:$N$24,MATCH(Z208,Lookup!$K$9:$K$24,0)),\"N/A\")))","v":{"$error":"#N/A"}}]
[null,null,null,null,{"$f":"INDEX(Lookup!$I$9:$I$24,MATCH('Interior Lighting'!D209,Lookup!$C$9:$C$24,0))","v":{"$error":"#N/A"}},null,null,null,{"$error":"#N/A"},null,0,{"$error":"#DIV/0!"},"N/A",{"$f":"IF($D$20=\"Space-By-Space (90.1-2010)\",INDEX(LPD2010SS,MATCH('Interior Lighting'!D209,LightingSpaceType,0)*W209),INDEX(LPD2010WB,MATCH('Interior Lighting'!D209,LightingSpaceType,0)))","v":{"$error":"#N/A"}},0,{"$error":"#N/A"},{"$error":"#N/A"},{"$error":"#N/A"},0,"",null,null,1,null,{"$error":"#N/A"},{"$error":"#N/A"},{"$f":"INDEX(Lookup!$O$9:$O$24,MATCH('Interior Lighting'!Z209,Lookup!$K$9:$K$24,0))","v":{"$error":"#N/A"}},{"$f":"IF(E209=\"A\",INDEX(Lookup!$L$9:$L$24,MATCH(Z209,Lookup!$K$9:$K$24,0)),IF(E209=\"B\",INDEX(Lookup!$M$9:$M$24,MATCH(Z209,Lookup!$K$9:$K$24,0)),IF(E209=\"C\",INDEX(Lookup!$N$9:$N$24,MATCH(Z209,Lookup!$K$9:$K$24,0)),\"N/A\")))","v":{"$error":"#N/A"}}]
[null,null,null,null,{"$f":"INDEX(Lookup!$I$9:$I$24,MATCH('Interior Lighting'!D210,Lookup!$C$9:$C$24,0))","v":{"$error":"#N/A"}},null,null,null,{"$error":"#N/A"},null,0,{"$error":"#DIV/0!"},"N/A",{"$f":"IF($D$20=\"Space-By-Space (90.1-2010)\",INDEX(LPD2010SS,MATCH('Interior Lighting'!D210,LightingSpaceType,0)*W210),INDEX(LPD2010WB,MATCH('Interior Lighting'!D210,LightingSpaceType,0)))","v":{"$error":"#N/A"}},0,{"$error":"#N/A"},{"$error":"#N/A"},{"$error":"#N/A"},0,"",null,null,1,null,{"$error":"#N/A"},{"$error":"#N/A"},{"$f":"INDEX(Lookup!$O$9:$O$24,MATCH('Interior Lighting'!Z210,Lookup!$K$9:$K$24,0))","v":{"$error":"#N/A"}},{"$f":"IF(E210=\"A\",INDEX(Lookup!$L$9:$L$24,MATCH(Z210,Lookup!$K$9:$K$24,0)),IF(E210=\"B\",INDEX(Lookup!$M$9:$M$24,MATCH(Z210,Lookup!$K$9:$K$24,0)),IF(E210=\"C\",INDEX(Lookup!$N$9:$N$24,MATCH(Z210,Lookup!$K$9:$K$24,0)),\"N/A\")))","v":{"$error":"#N/A"}}]
[null,null,null,null,{"$f":"INDEX(Lookup!$I$9:$I$24,MATCH('Interior Lighting'!D211,Lookup!$C$9:$C$24,0))","v":{"$error":"#N/A"}},null,null,null,{"$error":"#N/A"},null,0,{"$error":"#DIV/0!"},"N/A",{"$f":"IF($D$20=\"Space-By-Space (90.1-2010)\",INDEX(LPD2010SS,MATCH('Interior Lighting'!D211,LightingSpaceType,0)*W211),INDEX(LPD2010WB,MATCH('Interior Lighting'!D211,LightingSpaceType,0)))","v":{"$error":"#N/A"}},0,{"$error":"#N/A"},{"$error":"#N/A"},{"$error":"#N/A"},0,"",null,null,1,null,{"$error":"#N/A"},{"$error":"#N/A"},{"$f":"INDEX(Lookup!$O$9:$O$24,MATCH('Interior Lighting'!Z211,Lookup!$K$9:$K$24,0))","v":{"$error":"#N/A"}},{"$f":"IF(E211=\"A\",INDEX(Lookup!$L$9:$L$24,MATCH(Z211,Lookup!$K$9:$K$24,0)),IF(E211=\"B\",INDEX(Lookup!$M$9:$M$24,MATCH(Z211,Lookup!$K$9:$K$24,0)),IF(E211=\"C\",INDEX(Lookup!$N$9:$N$24,MATCH(Z211,Lookup!$K$9:$K$24,0)),\"N/A\")))","v":{"$error":"#N/A"}}]
[null,null,null,null,{"$f":"INDEX(Lookup!$I$9:$I$24,MATCH('Interior Lighting'!D212,Lookup!$C$9:$C$24,0))","v":{"$error":"#N/A"}},null,null,null,{"$error":"#N/A"},null,0,{"$error":"#DIV/0!"},"N/A",{"$f":"IF($D$20=\"Space-By-Space (90.1-2010)\",INDEX(LPD2010SS,MATCH('Interior Lighting'!D212,LightingSpaceType,0)*W212),INDEX(LPD2010WB,MATCH('Interior Lighting'!D212,LightingSpaceType,0)))","v":{"$error":"#N/A"}},0,{"$error":"#N/A"},{"$error":"#N/A"},{"$error":"#N/A"},0,"",null,null,1,null,{"$error":"#N/A"},{"$error":"#N/A"},{"$f":"INDEX(Lookup!$O$9:$O$24,MATCH('Interior Lighting'!Z212,Lookup!$K$9:$K$24,0))","v":{"$error":"#N/A"}},{"$f":"IF(E212=\"A\",INDEX(Lookup!$L$9:$L$24,MATCH(Z212,Lookup!$K$9:$K$24,0)),IF(E212=\"B\",INDEX(Lookup!$M$9:$M$24,MATCH(Z212,Lookup!$K$9:$K$24,0)),IF(E212=\"C\",INDEX(Lookup!$N$9:$N$24,MATCH(Z212,Lookup!$K$9:$K$24,0)),\"N/A\")))","v":{"$error":"#N/A"}}]
[null,null,null,null,{"$f":"INDEX(Lookup!$I$9:$I$24,MATCH('Interior Lighting'!D213,Lookup!$C$9:$C$24,0))","v":{"$error":"#N/A"}},null,null,null,{"$error":"#N/A"},null,0,{"$error":"#DIV/0!"},"N/A",{"$f":"IF($D$20=\"Space-By-Space (90.1-2010)\",INDEX(LPD2010SS,MATCH('Interior Lighting'!D213,LightingSpaceType,0)*W213),INDEX(LPD2010WB,MATCH('Interior Lighting'!D213,LightingSpaceType,0)))","v":{"$error":"#N/A"}},0,{"$error":"#N/A"},{"$error":"#N/A"},{"$error":"#N/A"},0,"",null,null,1,null,{"$error":"#N/A"},{"$error":"#N/A"},{"$f":"INDEX(Lookup!$O$9:$O$24,MATCH('Interior Lighting'!Z213,Lookup!$K$9:$K$24,0))","v":{"$error":"#N/A"}},{"$f":"IF(E213=\"A\",INDEX(Lookup!$L$9:$L$24,MATCH(Z213,Lookup!$K$9:$K$24,0)),IF(E213=\"B\",INDEX(Lookup!$M$9:$M$24,MATCH(Z213,Lookup!$K$9:$K$24,0)),IF(E213=\"C\",INDEX(Lookup!$N$9:$N$24,MATCH(Z213,Lookup!$K$9:$K$24,0)),\"N/A\")))","v":{"$error":"#N/A"}}]
[null,null,null,null,{"$f":"INDEX(Lookup!$I$9:$I$24,MATCH('Interior Lighting'!D214,Lookup!$C$9:$C$24,0))","v":{"$error":"#N/A"}},null,null,null,{"$error":"#N/A"},null,0,{"$error":"#DIV/0!"},"N/A",{"$f":"IF($D$20=\"Space-By-Space (90.1-2010)\",INDEX(LPD2010SS,MATCH('Interior Lighting'!D214,LightingSpaceType,0)*W214),INDEX(LPD2010WB,MATCH('Interior Lighting'!D214,LightingSpaceType,0)))","v":{"$error":"#N/A"}},0,{"$error":"#N/A"},{"$error":"#N/A"},{"$error":"#N/A"},0,"",null,null,1,null,{"$error":"#N/A"},{"$error":"#N/A"},{"$f":"INDEX(Lookup!$O$9:$O$24,MATCH('Interior Lighting'!Z214,Lookup!$K$9:$K$24,0))","v":{"$error":"#N/A"}},{"$f":"IF(E214=\"A\",INDEX(Lookup!$L$9:$L$24,MATCH(Z214,Lookup!$K$9:$K$24,0)),IF(E214=\"B\",INDEX(Lookup!$M$9:$M$24,MATCH(Z214,Lookup!$K$9:$K$24,0)),IF(E214=\"C\",INDEX(Lookup!$N$9:$N$24,MATCH(Z214,Lookup!$K$9:$K$24,0)),\"N/A\")))","v":{"$error":"#N/A"}}]
[null,null,null,null,{"$f":"INDEX(Lookup!$I$9:$I$24,MATCH('Interior Lighting'!D215,Lookup!$C$9:$C$24,0))","v":{"$error":"#N/A"}},null,null,null,{"$error":"#N/A"},null,0,{"$error":"#DIV/0!"},"N/A",{"$f":"IF($D$20=\"Space-By-Space (90.1-2010)\",INDEX(LPD2010SS,MATCH('Interior Lighting'!D215,LightingSpaceType,0)*W215),INDEX(LPD2010WB,MATCH('Interior Lighting'!D215,LightingSpaceType,0)))","v":{"$error":"#N/A"}},0,{"$error":"#N/A"},{"$error":"#N/A"},{"$error":"#N/A"},0,"",null,null,1,null,{"$error":"#N/A"},{"$error":"#N/A"},{"$f":"INDEX(Lookup!$O$9:$O$24,MATCH('Interior Lighting'!Z215,Lookup!$K$9:$K$24,0))","v":{"$error":"#N/A"}},{"$f":"IF(E215=\"A\",INDEX(Lookup!$L$9:$L$24,MATCH(Z215,Lookup!$K$9:$K$24,0)),IF(E215=\"B\",INDEX(Lookup!$M$9:$M$24,MATCH(Z215,Lookup!$K$9:$K$24,0)),IF(E215=\"C\",INDEX(Lookup!$N$9:$N$24,MATCH(Z215,Lookup!$K$9:$K$24,0)),\"N/A\")))","v":{"$error":"#N/A"}}]
[null,null,null,null,{"$f":"INDEX(Lookup!$I$9:$I$24,MATCH('Interior Lighting'!D216,Lookup!$C$9:$C$24,0))","v":{"$error":"#N/A"}},null,null,null,{"$error":"#N/A"},null,0,{"$error":"#DIV/0!"},"N/A",{"$f":"IF($D$20=\"Space-By-Space (90.1-2010)\",INDEX(LPD2010SS,MATCH('Interior Lighting'!D216,LightingSpaceType,0)*W216),INDEX(LPD2010WB,MATCH('Interior Lighting'!D216,LightingSpaceType,0)))","v":{"$error":"#N/A"}},0,{"$error":"#N/A"},{"$error":"#N/A"},{"$error":"#N/A"},0,"",null,null,1,null,{"$error":"#N/A"},{"$error":"#N/A"},{"$f":"INDEX(Lookup!$O$9:$O$24,MATCH('Interior Lighting'!Z216,Lookup!$K$9:$K$24,0))","v":{"$error":"#N/A"}},{"$f":"IF(E216=\"A\",INDEX(Lookup!$L$9:$L$24,MATCH(Z216,Lookup!$K$9:$K$24,0)),IF(E216=\"B\",INDEX(Lookup!$M$9:$M$24,MATCH(Z216,Lookup!$K$9:$K$24,0)),IF(E216=\"C\",INDEX(Lookup!$N$9:$N$24,MATCH(Z216,Lookup!$K$9:$K$24,0)),\"N/A\")))","v":{"$error":"#N/A"}}]
[null,null,null,null,{"$f":"INDEX(Lookup!$I$9:$I$24,MATCH('Interior Lighting'!D217,Lookup!$C$9:$C$24,0))","v":{"$error":"#N/A"}},null,null,null,{"$error":"#N/A"},null,0,{"$error":"#DIV/0!"},"N/A",{"$f":"IF($D$20=\"Space-By-Space (90.1-2010)\",INDEX(LPD2010SS,MATCH('Interior Lighting'!D217,LightingSpaceType,0)*W217),INDEX(LPD2010WB,MATCH('Interior Lighting'!D217,LightingSpaceType,0)))","v":{"$error":"#N/A"}},0,{"$error":"#N/A"},{"$error":"#N/A"},{"$error":"#N/A"},0,"",null,null,1,null,{"$error":"#N/A"},{"$error":"#N/A"},{"$f":"INDEX(Lookup!$O$9:$O$24,MATCH('Interior Lighting'!Z217,Lookup!$K$9:$K$24,0))","v":{"$error":"#N/A"}},{"$f":"IF(E217=\"A\",INDEX(Lookup!$L$9:$L$24,MATCH(Z217,Lookup!$K$9:$K$24,0)),IF(E217=\"B\",INDEX(Lookup!$M$9:$M$24,MATCH(Z217,Lookup!$K$9:$K$24,0)),IF(E217=\"C\",INDEX(Lookup!$N$9:$N$24,MATCH(Z217,Lookup!$K$9:$K$24,0)),\"N/A\")))","v":{"$error":"#N/A"}}]
[null,null,null,null,{"$f":"INDEX(Lookup!$I$9:$I$24,MATCH('Interior Lighting'!D218,Lookup!$C$9:$C$24,0))","v":{"$error":"#N/A"}},null,null,null,{"$error":"#N/A"},null,0,{"$error":"#DIV/0!"},"N/A",{"$f":"IF($D$20=\"Space-By-Space (90.1-2010)\",INDEX(LPD2010SS,MATCH('Interior Lighting'!D218,LightingSpaceType,0)*W218),INDEX(LPD2010WB,MATCH('Interior Lighting'!D218,LightingSpaceType,0)))","v":{"$error":"#N/A"}},0,{"$error":"#N/A"},{"$error":"#N/A"},{"$error":"#N/A"},0,"",null,null,1,null,{"$error":"#N/A"},{"$error":"#N/A"},{"$f":"INDEX(Lookup!$O$9:$O$24,MATCH('Interior Lighting'!Z218,Lookup!$K$9:$K$24,0))","v":{"$error":"#N/A"}},{"$f":"IF(E218=\"A\",INDEX(Lookup!$L$9:$L$24,MATCH(Z218,Lookup!$K$9:$K$24,0)),IF(E218=\"B\",INDEX(Lookup!$M$9:$M$24,MATCH(Z218,Lookup!$K$9:$K$24,0)),IF(E218=\"C\",INDEX(Lookup!$N$9:$N$24,MATCH(Z218,Lookup!$K$9:$K$24,0)),\"N/A\")))","v":{"$error":"#N/A"}}]
[null,null,null,null,{"$f":"INDEX(Lookup!$I$9:$I$24,MATCH('Interior Lighting'!D219,Lookup!$C$9:$C$24,0))","v":{"$error":"#N/A"}},null,null,null,{"$error":"#N/A"},null,0,{"$error":"#DIV/0!"},"N/A",{"$f":"IF($D$20=\"Space-By-Space (90.1-2010)\",INDEX(LPD2010SS,MATCH('Interior Lighting'!D219,LightingSpaceType,0)*W219),INDEX(LPD2010WB,MATCH('Interior Lighting'!D219,LightingSpaceType,0)))","v":{"$error":"#N/A"}},0,{"$error":"#N/A"},{"$error":"#N/A"},{"$error":"#N/A"},0,"",null,null,1,null,{"$error":"#N/A"},{"$error":"#N/A"},{"$f":"INDEX(Lookup!$O$9:$O$24,MATCH('Interior Lighting'!Z219,Lookup!$K$9:$K$24,0))","v":{"$error":"#N/A"}},{"$f":"IF(E219=\"A\",INDEX(Lookup!$L$9:$L$24,MATCH(Z219,Lookup!$K$9:$K$24,0)),IF(E219=\"B\",INDEX(Lookup!$M$9:$M$24,MATCH(Z219,Lookup!$K$9:$K$24,0)),IF(E219=\"C\",INDEX(Lookup!$N$9:$N$24,MATCH(Z219,Lookup!$K$9:$K$24,0)),\"N/A\")))","v":{"$error":"#N/A"}}]
[null,null,null,null,{"$f":"INDEX(Lookup!$I$9:$I$24,MATCH('Interior Lighting'!D220,Lookup!$C$9:$C$24,0))","v":{"$error":"#N/A"}},null,null,null,{"$error":"#N/A"},null,0,{"$error":"#DIV/0!"},"N/A",{"$f":"IF($D$20=\"Space-By-Space (90.1-2010)\",INDEX(LPD2010SS,MATCH('Interior Lighting'!D220,LightingSpaceType,0)*W220),INDEX(LPD2010WB,MATCH('Interior Lighting'!D220,LightingSpaceType,0)))","v":{"$error":"#N/A"}},0,{"$error":"#N/A"},{"$error":"#N/A"},{"$error":"#N/A"},0,"",null,null,1,null,{"$error":"#N/A"},{"$error":"#N/A"},{"$f":"INDEX(Lookup!$O$9:$O$24,MATCH('Interior Lighting'!Z220,Lookup!$K$9:$K$24,0))","v":{"$error":"#N/A"}},{"$f":"IF(E220=\"A\",INDEX(Lookup!$L$9:$L$24,MATCH(Z220,Lookup!$K$9:$K$24,0)),IF(E220=\"B\",INDEX(Lookup!$M$9:$M$24,MATCH(Z220,Lookup!$K$9:$K$24,0)),IF(E220=\"C\",INDEX(Lookup!$N$9:$N$24,MATCH(Z220,Lookup!$K$9:$K$24,0)),\"N/A\")))","v":{"$error":"#N/A"}}]
[null,null,null,null,{"$f":"INDEX(Lookup!$I$9:$I$24,MATCH('Interior Lighting'!D221,Lookup!$C$9:$C$24,0))","v":{"$error":"#N/A"}},null,null,null,{"$error":"#N/A"},null,0,{"$error":"#DIV/0!"},"N/A",{"$f":"IF($D$20=\"Space-By-Space (90.1-2010)\",INDEX(LPD2010SS,MATCH('Interior Lighting'!D221,LightingSpaceType,0)*W221),INDEX(LPD2010WB,MATCH('Interior Lighting'!D221,LightingSpaceType,0)))","v":{"$error":"#N/A"}},0,{"$error":"#N/A"},{"$error":"#N/A"},{"$error":"#N/A"},0,"",null,null,1,null,{"$error":"#N/A"},{"$error":"#N/A"},{"$f":"INDEX(Lookup!$O$9:$O$24,MATCH('Interior Lighting'!Z221,Lookup!$K$9:$K$24,0))","v":{"$error":"#N/A"}},{"$f":"IF(E221=\"A\",INDEX(Lookup!$L$9:$L$24,MATCH(Z221,Lookup!$K$9:$K$24,0)),IF(E221=\"B\",INDEX(Lookup!$M$9:$M$24,MATCH(Z221,Lookup!$K$9:$K$24,0)),IF(E221=\"C\",INDEX(Lookup!$N$9:$N$24,MATCH(Z221,Lookup!$K$9:$K$24,0)),\"N/A\")))","v":{"$error":"#N/A"}}]
[null,null,null,null,{"$f":"INDEX(Lookup!$I$9:$I$24,MATCH('Interior Lighting'!D222,Lookup!$C$9:$C$24,0))","v":{"$error":"#N/A"}},null,null,null,{"$error":"#N/A"},null,0,{"$error":"#DIV/0!"},"N/A",{"$f":"IF($D$20=\"Space-By-Space (90.1-2010)\",INDEX(LPD2010SS,MATCH('Interior Lighting'!D222,LightingSpaceType,0)*W222),INDEX(LPD2010WB,MATCH('Interior Lighting'!D222,LightingSpaceType,0)))","v":{"$error":"#N/A"}},0,{"$f":"Y222*AA222*AB222","v":{"$error":"#N/A"}},{"$error":"#N/A"},{"$f":"INDEX(Footcandles,MATCH(D222,LightingSpaceType,0))","v":{"$error":"#N/A"}},{"$f":"J222*B222","v":0},{"$f":"IF(F222>0, IF(Q222<R222, \"Insufficient lighting to meet IESNA footcandle recommendations.\", \"\"), \"\")","v":""},null,null,{"$f":"IF(A222=\"Yes\",1.2,1)","v":1},null,{"$f":"INDEX($M$4:$M$27,MATCH(G222,$J$4:$J$27,0))","v":{"$error":"#N/A"}},{"$f":"INDEX($K$4:$K$27,MATCH(G222,$J$4:$J$27,0))","v":{"$error":"#N/A"}},{"$f":"INDEX(Lookup!$O$9:$O$24,MATCH('Interior Lighting'!Z222,Lookup!$K$9:$K$24,0))","v":{"$error":"#N/A"}},{"$f":"IF(E222=\"A\",INDEX(Lookup!$L$9:$L$24,MATCH(Z222,Lookup!$K$9:$K$24,0)),IF(E222=\"B\",INDEX(Lookup!$M$9:$M$24,MATCH(Z222,Lookup!$K$9:$K$24,0)),IF(E222=\"C\",INDEX(Lookup!$N$9:$N$24,MATCH(Z222,Lookup!$K$9:$K$24,0)),\"N/A\")))","v":{"$error":"#N/A"}}]
[null,null,null,null,{"$f":"INDEX(Lookup!$I$9:$I$24,MATCH('Interior Lighting'!D223,Lookup!$C$9:$C$24,0))","v":{"$error":"#N/A"}},null,null,null,{"$f":"INDEX($L$4:$L$27,MATCH(G223,$J$4:$J$27,0))","v":{"$error":"#N/A"}},null,{"$f":"IF(F223>0, F223*I223*J223, 0)","v":0},{"$f":"IF(D223=\"Exit Signs\",\"convert to kW\", K223/S223)","v":{"$error":"#DIV/0!"}},{"$f":"IF(H223=\"Yes\",IF(D223=\"Corridor/Transition\",0.75*L223,1*L223),\"N/A\")","v":"N/A"},{"$f":"IF($D$20=\"Space-By-Space (90.1-2010)\",INDEX(LPD2010SS,MATCH('Interior Lighting'!D223,LightingSpaceType,0)*W223),INDEX(LPD2010WB,MATCH('Interior Lighting'!D223,LightingSpaceType,0)))","v":{"$error":"#N/A"}},{"$f":"IF(D223=\"Exit Signs\", 5*F223*J223, IF(B223>0, N223*S223, 0))","v":0},{"$error":"#N/A"},{"$f":"IF(D223=\"Exit Signs\",\"NA\", K223*P223/S223)","v":{"$error":"#N/A"}},{"$error":"#N/A"},0,"",null,null,1,null,{"$error":"#N/A"},{"$error":"#N/A"},{"$f":"INDEX(Lookup!$O$9:$O$24,MATCH('Interior Lighting'!Z223,Lookup!$K$9:$K$24,0))","v":{"$error":"#N/A"}},{"$f":"IF(E223=\"A\",INDEX(Lookup!$L$9:$L$24,MATCH(Z223,Lookup!$K$9:$K$24,0)),IF(E223=\"B\",INDEX(Lookup!$M$9:$M$24,MATCH(Z223,Lookup!$K$9:$K$24,0)),IF(E223=\"C\",INDEX(Lookup!$N$9:$N$24,MATCH(Z223,Lookup!$K$9:$K$24,0)),\"N/A\")))","v":{"$error":"#N/A"}}]
[null,null,null,null,{"$f":"INDEX(Lookup!$I$9:$I$24,MATCH('Interior Lighting'!D224,Lookup!$C$9:$C$24,0))","v":{"$error":"#N/A"}},null,null,null,{"$error":"#N/A"},null,0,{"$error":"#DIV/0!"},"N/A",{"$f":"IF($D$20=\"Space-By-Space (90.1-2010)\",INDEX(LPD2010SS,MATCH('Interior Lighting'!D224,LightingSpaceType,0)*W224),INDEX(LPD2010WB,MATCH('Interior Lighting'!D224,LightingSpaceType,0)))","v":{"$error":"#N/A"}},0,{"$error":"#N/A"},{"$error":"#N/A"},{"$error":"#N/A"},0,"",null,null,1,null,{"$error":"#N/A"},{"$error":"#N/A"},{"$f":"INDEX(Lookup!$O$9:$O$24,MATCH('Interior Lighting'!Z224,Lookup!$K$9:$K$24,0))","v":{"$error":"#N/A"}},{"$f":"IF(E224=\"A\",INDEX(Lookup!$L$9:$L$24,MATCH(Z224,Lookup!$K$9:$K$24,0)),IF(E224=\"B\",INDEX(Lookup!$M$9:$M$24,MATCH(Z224,Lookup!$K$9:$K$24,0)),IF(E224=\"C\",INDEX(Lookup!$N$9:$N$24,MATCH(Z224,Lookup!$K$9:$K$24,0)),\"N/A\")))","v":{"$error":"#N/A"}}]
[null,null,null,null,{"$f":"INDEX(Lookup!$I$9:$I$24,MATCH('Interior Lighting'!D225,Lookup!$C$9:$C$24,0))","v":{"$error":"#N/A"}},null,null,null,{"$error":"#N/A"},null,0,{"$error":"#DIV/0!"},"N/A",{"$f":"IF($D$20=\"Space-By-Space (90.1-2010)\",INDEX(LPD2010SS,MATCH('Interior Lighting'!D225,LightingSpaceType,0)*W225),INDEX(LPD2010WB,MATCH('Interior Lighting'!D225,LightingSpaceType,0)))","v":{"$error":"#N/A"}},0,{"$error":"#N/A"},{"$error":"#N/A"},{"$error":"#N/A"},0,"",null,null,1,null,{"$error":"#N/A"},{"$error":"#N/A"},{"$f":"INDEX(Lookup!$O$9:$O$24,MATCH('Interior Lighting'!Z225,Lookup!$K$9:$K$24,0))","v":{"$error":"#N/A"}},{"$f":"IF(E225=\"A\",INDEX(Lookup!$L$9:$L$24,MATCH(Z225,Lookup!$K$9:$K$24,0)),IF(E225=\"B\",INDEX(Lookup!$M$9:$M$24,MATCH(Z225,Lookup!$K$9:$K$24,0)),IF(E225=\"C\",INDEX(Lookup!$N$9:$N$24,MATCH(Z225,Lookup!$K$9:$K$24,0)),\"N/A\")))","v":{"$error":"#N/A"}}]
[null,null,null,null,{"$f":"INDEX(Lookup!$I$9:$I$24,MATCH('Interior Lighting'!D226,Lookup!$C$9:$C$24,0))","v":{"$error":"#N/A"}},null,null,null,{"$error":"#N/A"},null,0,{"$error":"#DIV/0!"},"N/A",{"$f":"IF($D$20=\"Space-By-Space (90.1-2010)\",INDEX(LPD2010SS,MATCH('Interior Lighting'!D226,LightingSpaceType,0)*W226),INDEX(LPD2010WB,MATCH('Interior Lighting'!D226,LightingSpaceType,0)))","v":{"$error":"#N/A"}},0,{"$error":"#N/A"},{"$error":"#N/A"},{"$error":"#N/A"},0,"",null,null,1,null,{"$error":"#N/A"},{"$error":"#N/A"},{"$f":"INDEX(Lookup!$O$9:$O$24,MATCH('Interior Lighting'!Z226,Lookup!$K$9:$K$24,0))","v":{"$error":"#N/A"}},{"$f":"IF(E226=\"A\",INDEX(Lookup!$L$9:$L$24,MATCH(Z226,Lookup!$K$9:$K$24,0)),IF(E226=\"B\",INDEX(Lookup!$M$9:$M$24,MATCH(Z226,Lookup!$K$9:$K$24,0)),IF(E226=\"C\",INDEX(Lookup!$N$9:$N$24,MATCH(Z226,Lookup!$K$9:$K$24,0)),\"N/A\")))","v":{"$error":"#N/A"}}]
[null,null,null,null,{"$f":"INDEX(Lookup!$I$9:$I$24,MATCH('Interior Lighting'!D227,Lookup!$C$9:$C$24,0))","v":{"$error":"#N/A"}},null,null,null,{"$error":"#N/A"},null,0,{"$error":"#DIV/0!"},"N/A",{"$f":"IF($D$20=\"Space-By-Space (90.1-2010)\",INDEX(LPD2010SS,MATCH('Interior Lighting'!D227,LightingSpaceType,0)*W227),INDEX(LPD2010WB,MATCH('Interior Lighting'!D227,LightingSpaceType,0)))","v":{"$error":"#N/A"}},0,{"$error":"#N/A"},{"$error":"#N/A"},{"$error":"#N/A"},0,"",null,null,1,null,{"$error":"#N/A"},{"$error":"#N/A"},{"$f":"INDEX(Lookup!$O$9:$O$24,MATCH('Interior Lighting'!Z227,Lookup!$K$9:$K$24,0))","v":{"$error":"#N/A"}},{"$f":"IF(E227=\"A\",INDEX(Lookup!$L$9:$L$24,MATCH(Z227,Lookup!$K$9:$K$24,0)),IF(E227=\"B\",INDEX(Lookup!$M$9:$M$24,MATCH(Z227,Lookup!$K$9:$K$24,0)),IF(E227=\"C\",INDEX(Lookup!$N$9:$N$24,MATCH(Z227,Lookup!$K$9:$K$24,0)),\"N/A\")))","v":{"$error":"#N/A"}}]
[null,null,null,null,{"$f":"INDEX(Lookup!$I$9:$I$24,MATCH('Interior Lighting'!D228,Lookup!$C$9:$C$24,0))","v":{"$error":"#N/A"}},null,null,null,{"$error":"#N/A"},null,0,{"$error":"#DIV/0!"},"N/A",{"$f":"IF($D$20=\"Space-By-Space (90.1-2010)\",INDEX(LPD2010SS,MATCH('Interior Lighting'!D228,LightingSpaceType,0)*W228),INDEX(LPD2010WB,MATCH('Interior Lighting'!D228,LightingSpaceType,0)))","v":{"$error":"#N/A"}},0,{"$error":"#N/A"},{"$error":"#N/A"},{"$error":"#N/A"},0,"",null,null,1,null,{"$error":"#N/A"},{"$error":"#N/A"},{"$f":"INDEX(Lookup!$O$9:$O$24,MATCH('Interior Lighting'!Z228,Lookup!$K$9:$K$24,0))","v":{"$error":"#N/A"}},{"$f":"IF(E228=\"A\",INDEX(Lookup!$L$9:$L$24,MATCH(Z228,Lookup!$K$9:$K$24,0)),IF(E228=\"B\",INDEX(Lookup!$M$9:$M$24,MATCH(Z228,Lookup!$K$9:$K$24,0)),IF(E228=\"C\",INDEX(Lookup!$N$9:$N$24,MATCH(Z228,Lookup!$K$9:$K$24,0)),\"N/A\")))","v":{"$error":"#N/A"}}]
[null,null,null,null,{"$f":"INDEX(Lookup!$I$9:$I$24,MATCH('Interior Lighting'!D229,Lookup!$C$9:$C$24,0))","v":{"$error":"#N/A"}},null,null,null,{"$error":"#N/A"},null,0,{"$error":"#DIV/0!"},"N/A",{"$f":"IF($D$20=\"Space-By-Space (90.1-2010)\",INDEX(LPD2010SS,MATCH('Interior Lighting'!D229,LightingSpaceType,0)*W229),INDEX(LPD2010WB,MATCH('Interior Lighting'!D229,LightingSpaceType,0)))","v":{"$error":"#N/A"}},0,{"$error":"#N/A"},{"$error":"#N/A"},{"$error":"#N/A"},0,"",null,null,1,null,{"$error":"#N/A"},{"$error":"#N/A"},{"$f":"INDEX(Lookup!$O$9:$O$24,MATCH('Interior Lighting'!Z229,Lookup!$K$9:$K$24,0))","v":{"$error":"#N/A"}},{"$f":"IF(E229=\"A\",INDEX(Lookup!$L$9:$L$24,MATCH(Z229,Lookup!$K$9:$K$24,0)),IF(E229=\"B\",INDEX(Lookup!$M$9:$M$24,MATCH(Z229,Lookup!$K$9:$K$24,0)),IF(E229=\"C\",INDEX(Lookup!$N$9:$N$24,MATCH(Z229,Lookup!$K$9:$K$24,0)),\"N/A\")))","v":{"$error":"#N/A"}}]
[null,null,null,null,{"$f":"INDEX(Lookup!$I$9:$I$24,MATCH('Interior Lighting'!D230,Lookup!$C$9:$C$24,0))","v":{"$error":"#N/A"}},null,null,null,{"$error":"#N/A"},null,0,{"$error":"#DIV/0!"},"N/A",{"$f":"IF($D$20=\"Space-By-Space (90.1-2010)\",INDEX(LPD2010SS,MATCH('Interior Lighting'!D230,LightingSpaceType,0)*W230),INDEX(LPD2010WB,MATCH('Interior Lighting'!D230,LightingSpaceType,0)))","v":{"$error":"#N/A"}},0,{"$error":"#N/A"},{"$error":"#N/A"},{"$error":"#N/A"},0,"",null,null,1,null,{"$error":"#N/A"},{"$error":"#N/A"},{"$f":"INDEX(Lookup!$O$9:$O$24,MATCH('Interior Lighting'!Z230,Lookup!$K$9:$K$24,0))","v":{"$error":"#N/A"}},{"$f":"IF(E230=\"A\",INDEX(Lookup!$L$9:$L$24,MATCH(Z230,Lookup!$K$9:$K$24,0)),IF(E230=\"B\",INDEX(Lookup!$M$9:$M$24,MATCH(Z230,Lookup!$K$9:$K$24,0)),IF(E230=\"C\",INDEX(Lookup!$N$9:$N$24,MATCH(Z230,Lookup!$K$9:$K$24,0)),\"N/A\")))","v":{"$error":"#N/A"}}]
[null,null,null,null,{"$f":"INDEX(Lookup!$I$9:$I$24,MATCH('Interior Lighting'!D231,Lookup!$C$9:$C$24,0))","v":{"$error":"#N/A"}},null,null,null,{"$error":"#N/A"},null,0,{"$error":"#DIV/0!"},"N/A",{"$f":"IF($D$20=\"Space-By-Space (90.1-2010)\",INDEX(LPD2010SS,MATCH('Interior Lighting'!D231,LightingSpaceType,0)*W231),INDEX(LPD2010WB,MATCH('Interior Lighting'!D231,LightingSpaceType,0)))","v":{"$error":"#N/A"}},0,{"$error":"#N/A"},{"$error":"#N/A"},{"$error":"#N/A"},0,"",null,null,1,null,{"$error":"#N/A"},{"$error":"#N/A"},{"$f":"INDEX(Lookup!$O$9:$O$24,MATCH('Interior Lighting'!Z231,Lookup!$K$9:$K$24,0))","v":{"$error":"#N/A"}},{"$f":"IF(E231=\"A\",INDEX(Lookup!$L$9:$L$24,MATCH(Z231,Lookup!$K$9:$K$24,0)),IF(E231=\"B\",INDEX(Lookup!$M$9:$M$24,MATCH(Z231,Lookup!$K$9:$K$24,0)),IF(E231=\"C\",INDEX(Lookup!$N$9:$N$24,MATCH(Z231,Lookup!$K$9:$K$24,0)),\"N/A\")))","v":{"$error":"#N/A"}}]
[null,null,null,null,{"$f":"INDEX(Lookup!$I$9:$I$24,MATCH('Interior Lighting'!D232,Lookup!$C$9:$C$24,0))","v":{"$error":"#N/A"}},null,null,null,{"$error":"#N/A"},null,0,{"$error":"#DIV/0!"},"N/A",{"$f":"IF($D$20=\"Space-By-Space (90.1-2010)\",INDEX(LPD2010SS,MATCH('Interior Lighting'!D232,LightingSpaceType,0)*W232),INDEX(LPD2010WB,MATCH('Interior Lighting'!D232,LightingSpaceType,0)))","v":{"$error":"#N/A"}},0,{"$error":"#N/A"},{"$error":"#N/A"},{"$error":"#N/A"},0,"",null,null,1,null,{"$error":"#N/A"},{"$error":"#N/A"},{"$f":"INDEX(Lookup!$O$9:$O$24,MATCH('Interior Lighting'!Z232,Lookup!$K$9:$K$24,0))","v":{"$error":"#N/A"}},{"$f":"IF(E232=\"A\",INDEX(Lookup!$L$9:$L$24,MATCH(Z232,Lookup!$K$9:$K$24,0)),IF(E232=\"B\",INDEX(Lookup!$M$9:$M$24,MATCH(Z232,Lookup!$K$9:$K$24,0)),IF(E232=\"C\",INDEX(Lookup!$N$9:$N$24,MATCH(Z232,Lookup!$K$9:$K$24,0)),\"N/A\")))","v":{"$error":"#N/A"}}]
[null,null,null,null,{"$f":"INDEX(Lookup!$I$9:$I$24,MATCH('Interior Lighting'!D233,Lookup!$C$9:$C$24,0))","v":{"$error":"#N/A"}},null,null,null,{"$error":"#N/A"},null,0,{"$error":"#DIV/0!"},"N/A",{"$f":"IF($D$20=\"Space-By-Space (90.1-2010)\",INDEX(LPD2010SS,MATCH('Interior Lighting'!D233,LightingSpaceType,0)*W233),INDEX(LPD2010WB,MATCH('Interior Lighting'!D233,LightingSpaceType,0)))","v":{"$error":"#N/A"}},0,{"$error":"#N/A"},{"$error":"#N/A"},{"$error":"#N/A"},0,"",null,null,1,null,{"$error":"#N/A"},{"$error":"#N/A"},{"$f":"INDEX(Lookup!$O$9:$O$24,MATCH('Interior Lighting'!Z233,Lookup!$K$9:$K$24,0))","v":{"$error":"#N/A"}},{"$f":"IF(E233=\"A\",INDEX(Lookup!$L$9:$L$24,MATCH(Z233,Lookup!$K$9:$K$24,0)),IF(E233=\"B\",INDEX(Lookup!$M$9:$M$24,MATCH(Z233,Lookup!$K$9:$K$24,0)),IF(E233=\"C\",INDEX(Lookup!$N$9:$N$24,MATCH(Z233,Lookup!$K$9:$K$24,0)),\"N/A\")))","v":{"$error":"#N/A"}}]
[null,null,null,null,{"$f":"INDEX(Lookup!$I$9:$I$24,MATCH('Interior Lighting'!D234,Lookup!$C$9:$C$24,0))","v":{"$error":"#N/A"}},null,null,null,{"$error":"#N/A"},null,0,{"$error":"#DIV/0!"},"N/A",{"$f":"IF($D$20=\"Space-By-Space (90.1-2010)\",INDEX(LPD2010SS,MATCH('Interior Lighting'!D234,LightingSpaceType,0)*W234),INDEX(LPD2010WB,MATCH('Interior Lighting'!D234,LightingSpaceType,0)))","v":{"$error":"#N/A"}},0,{"$error":"#N/A"},{"$error":"#N/A"},{"$error":"#N/A"},0,"",null,null,1,null,{"$error":"#N/A"},{"$error":"#N/A"},{"$f":"INDEX(Lookup!$O$9:$O$24,MATCH('Interior Lighting'!Z234,Lookup!$K$9:$K$24,0))","v":{"$error":"#N/A"}},{"$f":"IF(E234=\"A\",INDEX(Lookup!$L$9:$L$24,MATCH(Z234,Lookup!$K$9:$K$24,0)),IF(E234=\"B\",INDEX(Lookup!$M$9:$M$24,MATCH(Z234,Lookup!$K$9:$K$24,0)),IF(E234=\"C\",INDEX(Lookup!$N$9:$N$24,MATCH(Z234,Lookup!$K$9:$K$24,0)),\"N/A\")))","v":{"$error":"#N/A"}}]
[null,null,null,null,{"$f":"INDEX(Lookup!$I$9:$I$24,MATCH('Interior Lighting'!D235,Lookup!$C$9:$C$24,0))","v":{"$error":"#N/A"}},null,null,null,{"$error":"#N/A"},null,0,{"$error":"#DIV/0!"},"N/A",{"$f":"IF($D$20=\"Space-By-Space (90.1-2010)\",INDEX(LPD2010SS,MATCH('Interior Lighting'!D235,LightingSpaceType,0)*W235),INDEX(LPD2010WB,MATCH('Interior Lighting'!D235,LightingSpaceType,0)))","v":{"$error":"#N/A"}},0,{"$error":"#N/A"},{"$error":"#N/A"},{"$error":"#N/A"},0,"",null,null,1,null,{"$error":"#N/A"},{"$error":"#N/A"},{"$f":"INDEX(Lookup!$O$9:$O$24,MATCH('Interior Lighting'!Z235,Lookup!$K$9:$K$24,0))","v":{"$error":"#N/A"}},{"$f":"IF(E235=\"A\",INDEX(Lookup!$L$9:$L$24,MATCH(Z235,Lookup!$K$9:$K$24,0)),IF(E235=\"B\",INDEX(Lookup!$M$9:$M$24,MATCH(Z235,Lookup!$K$9:$K$24,0)),IF(E235=\"C\",INDEX(Lookup!$N$9:$N$24,MATCH(Z235,Lookup!$K$9:$K$24,0)),\"N/A\")))","v":{"$error":"#N/A"}}]
[null,null,null,null,{"$f":"INDEX(Lookup!$I$9:$I$24,MATCH('Interior Lighting'!D236,Lookup!$C$9:$C$24,0))","v":{"$error":"#N/A"}},null,null,null,{"$error":"#N/A"},null,0,{"$error":"#DIV/0!"},"N/A",{"$f":"IF($D$20=\"Space-By-Space (90.1-2010)\",INDEX(LPD2010SS,MATCH('Interior Lighting'!D236,LightingSpaceType,0)*W236),INDEX(LPD2010WB,MATCH('Interior Lighting'!D236,LightingSpaceType,0)))","v":{"$error":"#N/A"}},0,{"$error":"#N/A"},{"$error":"#N/A"},{"$error":"#N/A"},0,"",null,null,1,null,{"$error":"#N/A"},{"$error":"#N/A"},{"$f":"INDEX(Lookup!$O$9:$O$24,MATCH('Interior Lighting'!Z236,Lookup!$K$9:$K$24,0))","v":{"$error":"#N/A"}},{"$f":"IF(E236=\"A\",INDEX(Lookup!$L$9:$L$24,MATCH(Z236,Lookup!$K$9:$K$24,0)),IF(E236=\"B\",INDEX(Lookup!$M$9:$M$24,MATCH(Z236,Lookup!$K$9:$K$24,0)),IF(E236=\"C\",INDEX(Lookup!$N$9:$N$24,MATCH(Z236,Lookup!$K$9:$K$24,0)),\"N/A\")))","v":{"$error":"#N/A"}}]
[null,null,null,null,{"$f":"INDEX(Lookup!$I$9:$I$24,MATCH('Interior Lighting'!D237,Lookup!$C$9:$C$24,0))","v":{"$error":"#N/A"}},null,null,null,{"$error":"#N/A"},null,0,{"$error":"#DIV/0!"},"N/A",{"$f":"IF($D$20=\"Space-By-Space (90.1-2010)\",INDEX(LPD2010SS,MATCH('Interior Lighting'!D237,LightingSpaceType,0)*W237),INDEX(LPD2010WB,MATCH('Interior Lighting'!D237,LightingSpaceType,0)))","v":{"$error":"#N/A"}},0,{"$error":"#N/A"},{"$error":"#N/A"},{"$error":"#N/A"},0,"",null,null,1,null,{"$error":"#N/A"},{"$error":"#N/A"},{"$f":"INDEX(Lookup!$O$9:$O$24,MATCH('Interior Lighting'!Z237,Lookup!$K$9:$K$24,0))","v":{"$error":"#N/A"}},{"$f":"IF(E237=\"A\",INDEX(Lookup!$L$9:$L$24,MATCH(Z237,Lookup!$K$9:$K$24,0)),IF(E237=\"B\",INDEX(Lookup!$M$9:$M$24,MATCH(Z237,Lookup!$K$9:$K$24,0)),IF(E237=\"C\",INDEX(Lookup!$N$9:$N$24,MATCH(Z237,Lookup!$K$9:$K$24,0)),\"N/A\")))","v":{"$error":"#N/A"}}]
[null,null,null,null,{"$f":"INDEX(Lookup!$I$9:$I$24,MATCH('Interior Lighting'!D238,Lookup!$C$9:$C$24,0))","v":{"$error":"#N/A"}},null,null,null,{"$error":"#N/A"},null,0,{"$error":"#DIV/0!"},"N/A",{"$f":"IF($D$20=\"Space-By-Space (90.1-2010)\",INDEX(LPD2010SS,MATCH('Interior Lighting'!D238,LightingSpaceType,0)*W238),INDEX(LPD2010WB,MATCH('Interior Lighting'!D238,LightingSpaceType,0)))","v":{"$error":"#N/A"}},0,{"$error":"#N/A"},{"$error":"#N/A"},{"$error":"#N/A"},0,"",null,null,1,null,{"$error":"#N/A"},{"$error":"#N/A"},{"$f":"INDEX(Lookup!$O$9:$O$24,MATCH('Interior Lighting'!Z238,Lookup!$K$9:$K$24,0))","v":{"$error":"#N/A"}},{"$f":"IF(E238=\"A\",INDEX(Lookup!$L$9:$L$24,MATCH(Z238,Lookup!$K$9:$K$24,0)),IF(E238=\"B\",INDEX(Lookup!$M$9:$M$24,MATCH(Z238,Lookup!$K$9:$K$24,0)),IF(E238=\"C\",INDEX(Lookup!$N$9:$N$24,MATCH(Z238,Lookup!$K$9:$K$24,0)),\"N/A\")))","v":{"$error":"#N/A"}}]
[null,null,null,null,{"$f":"INDEX(Lookup!$I$9:$I$24,MATCH('Interior Lighting'!D239,Lookup!$C$9:$C$24,0))","v":{"$error":"#N/A"}},null,null,null,{"$error":"#N/A"},null,0,{"$error":"#DIV/0!"},"N/A",{"$f":"IF($D$20=\"Space-By-Space (90.1-2010)\",INDEX(LPD2010SS,MATCH('Interior Lighting'!D239,LightingSpaceType,0)*W239),INDEX(LPD2010WB,MATCH('Interior Lighting'!D239,LightingSpaceType,0)))","v":{"$error":"#N/A"}},0,{"$error":"#N/A"},{"$error":"#N/A"},{"$error":"#N/A"},0,"",null,null,1,null,{"$error":"#N/A"},{"$error":"#N/A"},{"$f":"INDEX(Lookup!$O$9:$O$24,MATCH('Interior Lighting'!Z239,Lookup!$K$9:$K$24,0))","v":{"$error":"#N/A"}},{"$f":"IF(E239=\"A\",INDEX(Lookup!$L$9:$L$24,MATCH(Z239,Lookup!$K$9:$K$24,0)),IF(E239=\"B\",INDEX(Lookup!$M$9:$M$24,MATCH(Z239,Lookup!$K$9:$K$24,0)),IF(E239=\"C\",INDEX(Lookup!$N$9:$N$24,MATCH(Z239,Lookup!$K$9:$K$24,0)),\"N/A\")))","v":{"$error":"#N/A"}}]
[null,null,null,null,{"$f":"INDEX(Lookup!$I$9:$I$24,MATCH('Interior Lighting'!D240,Lookup!$C$9:$C$24,0))","v":{"$error":"#N/A"}},null,null,null,{"$error":"#N/A"},null,0,{"$error":"#DIV/0!"},"N/A",{"$f":"IF($D$20=\"Space-By-Space (90.1-2010)\",INDEX(LPD2010SS,MATCH('Interior Lighting'!D240,LightingSpaceType,0)*W240),INDEX(LPD2010WB,MATCH('Interior Lighting'!D240,LightingSpaceType,0)))","v":{"$error":"#N/A"}},0,{"$error":"#N/A"},{"$error":"#N/A"},{"$error":"#N/A"},0,"",null,null,1,null,{"$error":"#N/A"},{"$error":"#N/A"},{"$f":"INDEX(Lookup!$O$9:$O$24,MATCH('Interior Lighting'!Z240,Lookup!$K$9:$K$24,0))","v":{"$error":"#N/A"}},{"$f":"IF(E240=\"A\",INDEX(Lookup!$L$9:$L$24,MATCH(Z240,Lookup!$K$9:$K$24,0)),IF(E240=\"B\",INDEX(Lookup!$M$9:$M$24,MATCH(Z240,Lookup!$K$9:$K$24,0)),IF(E240=\"C\",INDEX(Lookup!$N$9:$N$24,MATCH(Z240,Lookup!$K$9:$K$24,0)),\"N/A\")))","v":{"$error":"#N/A"}}]
[null,null,null,null,{"$f":"INDEX(Lookup!$I$9:$I$24,MATCH('Interior Lighting'!D241,Lookup!$C$9:$C$24,0))","v":{"$error":"#N/A"}},null,null,null,{"$error":"#N/A"},null,0,{"$error":"#DIV/0!"},"N/A",{"$f":"IF($D$20=\"Space-By-Space (90.1-2010)\",INDEX(LPD2010SS,MATCH('Interior Lighting'!D241,LightingSpaceType,0)*W241),INDEX(LPD2010WB,MATCH('Interior Lighting'!D241,LightingSpaceType,0)))","v":{"$error":"#N/A"}},0,{"$error":"#N/A"},{"$error":"#N/A"},{"$error":"#N/A"},0,"",null,null,1,null,{"$error":"#N/A"},{"$error":"#N/A"},{"$f":"INDEX(Lookup!$O$9:$O$24,MATCH('Interior Lighting'!Z241,Lookup!$K$9:$K$24,0))","v":{"$error":"#N/A"}},{"$f":"IF(E241=\"A\",INDEX(Lookup!$L$9:$L$24,MATCH(Z241,Lookup!$K$9:$K$24,0)),IF(E241=\"B\",INDEX(Lookup!$M$9:$M$24,MATCH(Z241,Lookup!$K$9:$K$24,0)),IF(E241=\"C\",INDEX(Lookup!$N$9:$N$24,MATCH(Z241,Lookup!$K$9:$K$24,0)),\"N/A\")))","v":{"$error":"#N/A"}}]
[null,null,null,null,{"$f":"INDEX(Lookup!$I$9:$I$24,MATCH('Interior Lighting'!D242,Lookup!$C$9:$C$24,0))","v":{"$error":"#N/A"}},null,null,null,{"$error":"#N/A"},null,0,{"$error":"#DIV/0!"},"N/A",{"$f":"IF($D$20=\"Space-By-Space (90.1-2010)\",INDEX(LPD2010SS,MATCH('Interior Lighting'!D242,LightingSpaceType,0)*W242),INDEX(LPD2010WB,MATCH('Interior Lighting'!D242,LightingSpaceType,0)))","v":{"$error":"#N/A"}},0,{"$error":"#N/A"},{"$error":"#N/A"},{"$error":"#N/A"},0,"",null,null,1,null,{"$error":"#N/A"},{"$error":"#N/A"},{"$f":"INDEX(Lookup!$O$9:$O$24,MATCH('Interior Lighting'!Z242,Lookup!$K$9:$K$24,0))","v":{"$error":"#N/A"}},{"$f":"IF(E242=\"A\",INDEX(Lookup!$L$9:$L$24,MATCH(Z242,Lookup!$K$9:$K$24,0)),IF(E242=\"B\",INDEX(Lookup!$M$9:$M$24,MATCH(Z242,Lookup!$K$9:$K$24,0)),IF(E242=\"C\",INDEX(Lookup!$N$9:$N$24,MATCH(Z242,Lookup!$K$9:$K$24,0)),\"N/A\")))","v":{"$error":"#N/A"}}]
[null,null,null,null,{"$f":"INDEX(Lookup!$I$9:$I$24,MATCH('Interior Lighting'!D243,Lookup!$C$9:$C$24,0))","v":{"$error":"#N/A"}},null,null,null,{"$error":"#N/A"},null,0,{"$error":"#DIV/0!"},"N/A",{"$f":"IF($D$20=\"Space-By-Space (90.1-2010)\",INDEX(LPD2010SS,MATCH('Interior Lighting'!D243,LightingSpaceType,0)*W243),INDEX(LPD2010WB,MATCH('Interior Lighting'!D243,LightingSpaceType,0)))","v":{"$error":"#N/A"}},0,{"$error":"#N/A"},{"$error":"#N/A"},{"$error":"#N/A"},0,"",null,null,1,null,{"$error":"#N/A"},{"$error":"#N/A"},{"$f":"INDEX(Lookup!$O$9:$O$24,MATCH('Interior Lighting'!Z243,Lookup!$K$9:$K$24,0))","v":{"$error":"#N/A"}},{"$f":"IF(E243=\"A\",INDEX(Lookup!$L$9:$L$24,MATCH(Z243,Lookup!$K$9:$K$24,0)),IF(E243=\"B\",INDEX(Lookup!$M$9:$M$24,MATCH(Z243,Lookup!$K$9:$K$24,0)),IF(E243=\"C\",INDEX(Lookup!$N$9:$N$24,MATCH(Z243,Lookup!$K$9:$K$24,0)),\"N/A\")))","v":{"$error":"#N/A"}}]
[null,null,null,null,{"$f":"INDEX(Lookup!$I$9:$I$24,MATCH('Interior Lighting'!D244,Lookup!$C$9:$C$24,0))","v":{"$error":"#N/A"}},null,null,null,{"$error":"#N/A"},null,0,{"$error":"#DIV/0!"},"N/A",{"$f":"IF($D$20=\"Space-By-Space (90.1-2010)\",INDEX(LPD2010SS,MATCH('Interior Lighting'!D244,LightingSpaceType,0)*W244),INDEX(LPD2010WB,MATCH('Interior Lighting'!D244,LightingSpaceType,0)))","v":{"$error":"#N/A"}},0,{"$error":"#N/A"},{"$error":"#N/A"},{"$error":"#N/A"},0,"",null,null,1,null,{"$error":"#N/A"},{"$error":"#N/A"},{"$f":"INDEX(Lookup!$O$9:$O$24,MATCH('Interior Lighting'!Z244,Lookup!$K$9:$K$24,0))","v":{"$error":"#N/A"}},{"$f":"IF(E244=\"A\",INDEX(Lookup!$L$9:$L$24,MATCH(Z244,Lookup!$K$9:$K$24,0)),IF(E244=\"B\",INDEX(Lookup!$M$9:$M$24,MATCH(Z244,Lookup!$K$9:$K$24,0)),IF(E244=\"C\",INDEX(Lookup!$N$9:$N$24,MATCH(Z244,Lookup!$K$9:$K$24,0)),\"N/A\")))","v":{"$error":"#N/A"}}]
[null,null,null,null,{"$f":"INDEX(Lookup!$I$9:$I$24,MATCH('Interior Lighting'!D245,Lookup!$C$9:$C$24,0))","v":{"$error":"#N/A"}},null,null,null,{"$error":"#N/A"},null,0,{"$error":"#DIV/0!"},"N/A",{"$f":"IF($D$20=\"Space-By-Space (90.1-2010)\",INDEX(LPD2010SS,MATCH('Interior Lighting'!D245,LightingSpaceType,0)*W245),INDEX(LPD2010WB,MATCH('Interior Lighting'!D245,LightingSpaceType,0)))","v":{"$error":"#N/A"}},0,{"$error":"#N/A"},{"$error":"#N/A"},{"$error":"#N/A"},0,"",null,null,1,null,{"$error":"#N/A"},{"$error":"#N/A"},{"$f":"INDEX(Lookup!$O$9:$O$24,MATCH('Interior Lighting'!Z245,Lookup!$K$9:$K$24,0))","v":{"$error":"#N/A"}},{"$f":"IF(E245=\"A\",INDEX(Lookup!$L$9:$L$24,MATCH(Z245,Lookup!$K$9:$K$24,0)),IF(E245=\"B\",INDEX(Lookup!$M$9:$M$24,MATCH(Z245,Lookup!$K$9:$K$24,0)),IF(E245=\"C\",INDEX(Lookup!$N$9:$N$24,MATCH(Z245,Lookup!$K$9:$K$24,0)),\"N/A\")))","v":{"$error":"#N/A"}}]
[null,null,null,null,{"$f":"INDEX(Lookup!$I$9:$I$24,MATCH('Interior Lighting'!D246,Lookup!$C$9:$C$24,0))","v":{"$error":"#N/A"}},null,null,null,{"$error":"#N/A"},null,0,{"$error":"#DIV/0!"},"N/A",{"$f":"IF($D$20=\"Space-By-Space (90.1-2010)\",INDEX(LPD2010SS,MATCH('Interior Lighting'!D246,LightingSpaceType,0)*W246),INDEX(LPD2010WB,MATCH('Interior Lighting'!D246,LightingSpaceType,0)))","v":{"$error":"#N/A"}},0,{"$error":"#N/A"},{"$error":"#N/A"},{"$error":"#N/A"},0,"",null,null,1,null,{"$error":"#N/A"},{"$error":"#N/A"},{"$f":"INDEX(Lookup!$O$9:$O$24,MATCH('Interior Lighting'!Z246,Lookup!$K$9:$K$24,0))","v":{"$error":"#N/A"}},{"$f":"IF(E246=\"A\",INDEX(Lookup!$L$9:$L$24,MATCH(Z246,Lookup!$K$9:$K$24,0)),IF(E246=\"B\",INDEX(Lookup!$M$9:$M$24,MATCH(Z246,Lookup!$K$9:$K$24,0)),IF(E246=\"C\",INDEX(Lookup!$N$9:$N$24,MATCH(Z246,Lookup!$K$9:$K$24,0)),\"N/A\")))","v":{"$error":"#N/A"}}]
[null,null,null,null,{"$f":"INDEX(Lookup!$I$9:$I$24,MATCH('Interior Lighting'!D247,Lookup!$C$9:$C$24,0))","v":{"$error":"#N/A"}},null,null,null,{"$error":"#N/A"},null,0,{"$error":"#DIV/0!"},"N/A",{"$f":"IF($D$20=\"Space-By-Space (90.1-2010)\",INDEX(LPD2010SS,MATCH('Interior Lighting'!D247,LightingSpaceType,0)*W247),INDEX(LPD2010WB,MATCH('Interior Lighting'!D247,LightingSpaceType,0)))","v":{"$error":"#N/A"}},0,{"$error":"#N/A"},{"$error":"#N/A"},{"$error":"#N/A"},0,"",null,null,1,null,{"$error":"#N/A"},{"$error":"#N/A"},{"$f":"INDEX(Lookup!$O$9:$O$24,MATCH('Interior Lighting'!Z247,Lookup!$K$9:$K$24,0))","v":{"$error":"#N/A"}},{"$f":"IF(E247=\"A\",INDEX(Lookup!$L$9:$L$24,MATCH(Z247,Lookup!$K$9:$K$24,0)),IF(E247=\"B\",INDEX(Lookup!$M$9:$M$24,MATCH(Z247,Lookup!$K$9:$K$24,0)),IF(E247=\"C\",INDEX(Lookup!$N$9:$N$24,MATCH(Z247,Lookup!$K$9:$K$24,0)),\"N/A\")))","v":{"$error":"#N/A"}}]
[null,null,null,null,{"$f":"INDEX(Lookup!$I$9:$I$24,MATCH('Interior Lighting'!D248,Lookup!$C$9:$C$24,0))","v":{"$error":"#N/A"}},null,null,null,{"$error":"#N/A"},null,0,{"$error":"#DIV/0!"},"N/A",{"$f":"IF($D$20=\"Space-By-Space (90.1-2010)\",INDEX(LPD2010SS,MATCH('Interior Lighting'!D248,LightingSpaceType,0)*W248),INDEX(LPD2010WB,MATCH('Interior Lighting'!D248,LightingSpaceType,0)))","v":{"$error":"#N/A"}},0,{"$error":"#N/A"},{"$error":"#N/A"},{"$error":"#N/A"},0,"",null,null,1,null,{"$error":"#N/A"},{"$error":"#N/A"},{"$f":"INDEX(Lookup!$O$9:$O$24,MATCH('Interior Lighting'!Z248,Lookup!$K$9:$K$24,0))","v":{"$error":"#N/A"}},{"$f":"IF(E248=\"A\",INDEX(Lookup!$L$9:$L$24,MATCH(Z248,Lookup!$K$9:$K$24,0)),IF(E248=\"B\",INDEX(Lookup!$M$9:$M$24,MATCH(Z248,Lookup!$K$9:$K$24,0)),IF(E248=\"C\",INDEX(Lookup!$N$9:$N$24,MATCH(Z248,Lookup!$K$9:$K$24,0)),\"N/A\")))","v":{"$error":"#N/A"}}]
[null,null,null,null,{"$f":"INDEX(Lookup!$I$9:$I$24,MATCH('Interior Lighting'!D249,Lookup!$C$9:$C$24,0))","v":{"$error":"#N/A"}},null,null,null,{"$error":"#N/A"},null,0,{"$error":"#DIV/0!"},"N/A",{"$f":"IF($D$20=\"Space-By-Space (90.1-2010)\",INDEX(LPD2010SS,MATCH('Interior Lighting'!D249,LightingSpaceType,0)*W249),INDEX(LPD2010WB,MATCH('Interior Lighting'!D249,LightingSpaceType,0)))","v":{"$error":"#N/A"}},0,{"$error":"#N/A"},{"$error":"#N/A"},{"$error":"#N/A"},0,"",null,null,1,null,{"$error":"#N/A"},{"$error":"#N/A"},{"$f":"INDEX(Lookup!$O$9:$O$24,MATCH('Interior Lighting'!Z249,Lookup!$K$9:$K$24,0))","v":{"$error":"#N/A"}},{"$f":"IF(E249=\"A\",INDEX(Lookup!$L$9:$L$24,MATCH(Z249,Lookup!$K$9:$K$24,0)),IF(E249=\"B\",INDEX(Lookup!$M$9:$M$24,MATCH(Z249,Lookup!$K$9:$K$24,0)),IF(E249=\"C\",INDEX(Lookup!$N$9:$N$24,MATCH(Z249,Lookup!$K$9:$K$24,0)),\"N/A\")))","v":{"$error":"#N/A"}}]
[null,null,null,null,{"$f":"INDEX(Lookup!$I$9:$I$24,MATCH('Interior Lighting'!D250,Lookup!$C$9:$C$24,0))","v":{"$error":"#N/A"}},null,null,null,{"$error":"#N/A"},null,0,{"$error":"#DIV/0!"},"N/A",{"$f":"IF($D$20=\"Space-By-Space (90.1-2010)\",INDEX(LPD2010SS,MATCH('Interior Lighting'!D250,LightingSpaceType,0)*W250),INDEX(LPD2010WB,MATCH('Interior Lighting'!D250,LightingSpaceType,0)))","v":{"$error":"#N/A"}},0,{"$error":"#N/A"},{"$error":"#N/A"},{"$error":"#N/A"},0,"",null,null,1,null,{"$error":"#N/A"},{"$error":"#N/A"},{"$f":"INDEX(Lookup!$O$9:$O$24,MATCH('Interior Lighting'!Z250,Lookup!$K$9:$K$24,0))","v":{"$error":"#N/A"}},{"$f":"IF(E250=\"A\",INDEX(Lookup!$L$9:$L$24,MATCH(Z250,Lookup!$K$9:$K$24,0)),IF(E250=\"B\",INDEX(Lookup!$M$9:$M$24,MATCH(Z250,Lookup!$K$9:$K$24,0)),IF(E250=\"C\",INDEX(Lookup!$N$9:$N$24,MATCH(Z250,Lookup!$K$9:$K$24,0)),\"N/A\")))","v":{"$error":"#N/A"}}]
[null,null,null,null,{"$f":"INDEX(Lookup!$I$9:$I$24,MATCH('Interior Lighting'!D251,Lookup!$C$9:$C$24,0))","v":{"$error":"#N/A"}},null,null,null,{"$error":"#N/A"},null,0,{"$error":"#DIV/0!"},"N/A",{"$f":"IF($D$20=\"Space-By-Space (90.1-2010)\",INDEX(LPD2010SS,MATCH('Interior Lighting'!D251,LightingSpaceType,0)*W251),INDEX(LPD2010WB,MATCH('Interior Lighting'!D251,LightingSpaceType,0)))","v":{"$error":"#N/A"}},0,{"$error":"#N/A"},{"$error":"#N/A"},{"$error":"#N/A"},0,"",null,null,1,null,{"$error":"#N/A"},{"$error":"#N/A"},{"$f":"INDEX(Lookup!$O$9:$O$24,MATCH('Interior Lighting'!Z251,Lookup!$K$9:$K$24,0))","v":{"$error":"#N/A"}},{"$f":"IF(E251=\"A\",INDEX(Lookup!$L$9:$L$24,MATCH(Z251,Lookup!$K$9:$K$24,0)),IF(E251=\"B\",INDEX(Lookup!$M$9:$M$24,MATCH(Z251,Lookup!$K$9:$K$24,0)),IF(E251=\"C\",INDEX(Lookup!$N$9:$N$24,MATCH(Z251,Lookup!$K$9:$K$24,0)),\"N/A\")))","v":{"$error":"#N/A"}}]
[null,null,null,null,{"$f":"INDEX(Lookup!$I$9:$I$24,MATCH('Interior Lighting'!D252,Lookup!$C$9:$C$24,0))","v":{"$error":"#N/A"}},null,null,null,{"$error":"#N/A"},null,0,{"$error":"#DIV/0!"},"N/A",{"$f":"IF($D$20=\"Space-By-Space (90.1-2010)\",INDEX(LPD2010SS,MATCH('Interior Lighting'!D252,LightingSpaceType,0)*W252),INDEX(LPD2010WB,MATCH('Interior Lighting'!D252,LightingSpaceType,0)))","v":{"$error":"#N/A"}},0,{"$error":"#N/A"},{"$error":"#N/A"},{"$error":"#N/A"},0,"",null,null,1,null,{"$error":"#N/A"},{"$error":"#N/A"},{"$f":"INDEX(Lookup!$O$9:$O$24,MATCH('Interior Lighting'!Z252,Lookup!$K$9:$K$24,0))","v":{"$error":"#N/A"}},{"$f":"IF(E252=\"A\",INDEX(Lookup!$L$9:$L$24,MATCH(Z252,Lookup!$K$9:$K$24,0)),IF(E252=\"B\",INDEX(Lookup!$M$9:$M$24,MATCH(Z252,Lookup!$K$9:$K$24,0)),IF(E252=\"C\",INDEX(Lookup!$N$9:$N$24,MATCH(Z252,Lookup!$K$9:$K$24,0)),\"N/A\")))","v":{"$error":"#N/A"}}]
[null,null,null,null,{"$f":"INDEX(Lookup!$I$9:$I$24,MATCH('Interior Lighting'!D253,Lookup!$C$9:$C$24,0))","v":{"$error":"#N/A"}},null,null,null,{"$error":"#N/A"},null,0,{"$error":"#DIV/0!"},"N/A",{"$f":"IF($D$20=\"Space-By-Space (90.1-2010)\",INDEX(LPD2010SS,MATCH('Interior Lighting'!D253,LightingSpaceType,0)*W253),INDEX(LPD2010WB,MATCH('Interior Lighting'!D253,LightingSpaceType,0)))","v":{"$error":"#N/A"}},0,{"$error":"#N/A"},{"$error":"#N/A"},{"$error":"#N/A"},0,"",null,null,1,null,{"$error":"#N/A"},{"$error":"#N/A"},{"$f":"INDEX(Lookup!$O$9:$O$24,MATCH('Interior Lighting'!Z253,Lookup!$K$9:$K$24,0))","v":{"$error":"#N/A"}},{"$f":"IF(E253=\"A\",INDEX(Lookup!$L$9:$L$24,MATCH(Z253,Lookup!$K$9:$K$24,0)),IF(E253=\"B\",INDEX(Lookup!$M$9:$M$24,MATCH(Z253,Lookup!$K$9:$K$24,0)),IF(E253=\"C\",INDEX(Lookup!$N$9:$N$24,MATCH(Z253,Lookup!$K$9:$K$24,0)),\"N/A\")))","v":{"$error":"#N/A"}}]
[null,null,null,null,{"$f":"INDEX(Lookup!$I$9:$I$24,MATCH('Interior Lighting'!D254,Lookup!$C$9:$C$24,0))","v":{"$error":"#N/A"}},null,null,null,{"$error":"#N/A"},null,0,{"$error":"#DIV/0!"},"N/A",{"$f":"IF($D$20=\"Space-By-Space (90.1-2010)\",INDEX(LPD2010SS,MATCH('Interior Lighting'!D254,LightingSpaceType,0)*W254),INDEX(LPD2010WB,MATCH('Interior Lighting'!D254,LightingSpaceType,0)))","v":{"$error":"#N/A"}},0,{"$error":"#N/A"},{"$error":"#N/A"},{"$error":"#N/A"},0,"",null,null,1,null,{"$error":"#N/A"},{"$error":"#N/A"},{"$f":"INDEX(Lookup!$O$9:$O$24,MATCH('Interior Lighting'!Z254,Lookup!$K$9:$K$24,0))","v":{"$error":"#N/A"}},{"$f":"IF(E254=\"A\",INDEX(Lookup!$L$9:$L$24,MATCH(Z254,Lookup!$K$9:$K$24,0)),IF(E254=\"B\",INDEX(Lookup!$M$9:$M$24,MATCH(Z254,Lookup!$K$9:$K$24,0)),IF(E254=\"C\",INDEX(Lookup!$N$9:$N$24,MATCH(Z254,Lookup!$K$9:$K$24,0)),\"N/A\")))","v":{"$error":"#N/A"}}]
[null,null,null,null,{"$f":"INDEX(Lookup!$I$9:$I$24,MATCH('Interior Lighting'!D255,Lookup!$C$9:$C$24,0))","v":{"$error":"#N/A"}},null,null,null,{"$error":"#N/A"},null,0,{"$error":"#DIV/0!"},"N/A",{"$f":"IF($D$20=\"Space-By-Space (90.1-2010)\",INDEX(LPD2010SS,MATCH('Interior Lighting'!D255,LightingSpaceType,0)*W255),INDEX(LPD2010WB,MATCH('Interior Lighting'!D255,LightingSpaceType,0)))","v":{"$error":"#N/A"}},0,{"$error":"#N/A"},{"$error":"#N/A"},{"$error":"#N/A"},0,"",null,null,1,null,{"$error":"#N/A"},{"$error":"#N/A"},{"$f":"INDEX(Lookup!$O$9:$O$24,MATCH('Interior Lighting'!Z255,Lookup!$K$9:$K$24,0))","v":{"$error":"#N/A"}},{"$f":"IF(E255=\"A\",INDEX(Lookup!$L$9:$L$24,MATCH(Z255,Lookup!$K$9:$K$24,0)),IF(E255=\"B\",INDEX(Lookup!$M$9:$M$24,MATCH(Z255,Lookup!$K$9:$K$24,0)),IF(E255=\"C\",INDEX(Lookup!$N$9:$N$24,MATCH(Z255,Lookup!$K$9:$K$24,0)),\"N/A\")))","v":{"$error":"#N/A"}}]
[null,null,null,null,{"$f":"INDEX(Lookup!$I$9:$I$24,MATCH('Interior Lighting'!D256,Lookup!$C$9:$C$24,0))","v":{"$error":"#N/A"}},null,null,null,{"$error":"#N/A"},null,0,{"$error":"#DIV/0!"},"N/A",{"$f":"IF($D$20=\"Space-By-Space (90.1-2010)\",INDEX(LPD2010SS,MATCH('Interior Lighting'!D256,LightingSpaceType,0)*W256),INDEX(LPD2010WB,MATCH('Interior Lighting'!D256,LightingSpaceType,0)))","v":{"$error":"#N/A"}},0,{"$error":"#N/A"},{"$error":"#N/A"},{"$error":"#N/A"},0,"",null,null,1,null,{"$error":"#N/A"},{"$error":"#N/A"},{"$f":"INDEX(Lookup!$O$9:$O$24,MATCH('Interior Lighting'!Z256,Lookup!$K$9:$K$24,0))","v":{"$error":"#N/A"}},{"$f":"IF(E256=\"A\",INDEX(Lookup!$L$9:$L$24,MATCH(Z256,Lookup!$K$9:$K$24,0)),IF(E256=\"B\",INDEX(Lookup!$M$9:$M$24,MATCH(Z256,Lookup!$K$9:$K$24,0)),IF(E256=\"C\",INDEX(Lookup!$N$9:$N$24,MATCH(Z256,Lookup!$K$9:$K$24,0)),\"N/A\")))","v":{"$error":"#N/A"}}]
[null,null,null,null,{"$f":"INDEX(Lookup!$I$9:$I$24,MATCH('Interior Lighting'!D257,Lookup!$C$9:$C$24,0))","v":{"$error":"#N/A"}},null,null,null,{"$error":"#N/A"},null,0,{"$error":"#DIV/0!"},"N/A",{"$f":"IF($D$20=\"Space-By-Space (90.1-2010)\",INDEX(LPD2010SS,MATCH('Interior Lighting'!D257,LightingSpaceType,0)*W257),INDEX(LPD2010WB,MATCH('Interior Lighting'!D257,LightingSpaceType,0)))","v":{"$error":"#N/A"}},0,{"$error":"#N/A"},{"$error":"#N/A"},{"$error":"#N/A"},0,"",null,null,1,null,{"$error":"#N/A"},{"$error":"#N/A"},{"$f":"INDEX(Lookup!$O$9:$O$24,MATCH('Interior Lighting'!Z257,Lookup!$K$9:$K$24,0))","v":{"$error":"#N/A"}},{"$f":"IF(E257=\"A\",INDEX(Lookup!$L$9:$L$24,MATCH(Z257,Lookup!$K$9:$K$24,0)),IF(E257=\"B\",INDEX(Lookup!$M$9:$M$24,MATCH(Z257,Lookup!$K$9:$K$24,0)),IF(E257=\"C\",INDEX(Lookup!$N$9:$N$24,MATCH(Z257,Lookup!$K$9:$K$24,0)),\"N/A\")))","v":{"$error":"#N/A"}}]
[null,null,null,null,{"$f":"INDEX(Lookup!$I$9:$I$24,MATCH('Interior Lighting'!D258,Lookup!$C$9:$C$24,0))","v":{"$error":"#N/A"}},null,null,null,{"$error":"#N/A"},null,0,{"$error":"#DIV/0!"},"N/A",{"$f":"IF($D$20=\"Space-By-Space (90.1-2010)\",INDEX(LPD2010SS,MATCH('Interior Lighting'!D258,LightingSpaceType,0)*W258),INDEX(LPD2010WB,MATCH('Interior Lighting'!D258,LightingSpaceType,0)))","v":{"$error":"#N/A"}},0,{"$error":"#N/A"},{"$error":"#N/A"},{"$error":"#N/A"},0,"",null,null,1,null,{"$error":"#N/A"},{"$error":"#N/A"},{"$f":"INDEX(Lookup!$O$9:$O$24,MATCH('Interior Lighting'!Z258,Lookup!$K$9:$K$24,0))","v":{"$error":"#N/A"}},{"$f":"IF(E258=\"A\",INDEX(Lookup!$L$9:$L$24,MATCH(Z258,Lookup!$K$9:$K$24,0)),IF(E258=\"B\",INDEX(Lookup!$M$9:$M$24,MATCH(Z258,Lookup!$K$9:$K$24,0)),IF(E258=\"C\",INDEX(Lookup!$N$9:$N$24,MATCH(Z258,Lookup!$K$9:$K$24,0)),\"N/A\")))","v":{"$error":"#N/A"}}]
[null,null,null,null,{"$f":"INDEX(Lookup!$I$9:$I$24,MATCH('Interior Lighting'!D259,Lookup!$C$9:$C$24,0))","v":{"$error":"#N/A"}},null,null,null,{"$error":"#N/A"},null,0,{"$error":"#DIV/0!"},"N/A",{"$f":"IF($D$20=\"Space-By-Space (90.1-2010)\",INDEX(LPD2010SS,MATCH('Interior Lighting'!D259,LightingSpaceType,0)*W259),INDEX(LPD2010WB,MATCH('Interior Lighting'!D259,LightingSpaceType,0)))","v":{"$error":"#N/A"}},0,{"$error":"#N/A"},{"$error":"#N/A"},{"$error":"#N/A"},0,"",null,null,1,null,{"$error":"#N/A"},{"$error":"#N/A"},{"$f":"INDEX(Lookup!$O$9:$O$24,MATCH('Interior Lighting'!Z259,Lookup!$K$9:$K$24,0))","v":{"$error":"#N/A"}},{"$f":"IF(E259=\"A\",INDEX(Lookup!$L$9:$L$24,MATCH(Z259,Lookup!$K$9:$K$24,0)),IF(E259=\"B\",INDEX(Lookup!$M$9:$M$24,MATCH(Z259,Lookup!$K$9:$K$24,0)),IF(E259=\"C\",INDEX(Lookup!$N$9:$N$24,MATCH(Z259,Lookup!$K$9:$K$24,0)),\"N/A\")))","v":{"$error":"#N/A"}}]
[null,null,null,null,{"$f":"INDEX(Lookup!$I$9:$I$24,MATCH('Interior Lighting'!D260,Lookup!$C$9:$C$24,0))","v":{"$error":"#N/A"}},null,null,null,{"$error":"#N/A"},null,0,{"$error":"#DIV/0!"},"N/A",{"$f":"IF($D$20=\"Space-By-Space (90.1-2010)\",INDEX(LPD2010SS,MATCH('Interior Lighting'!D260,LightingSpaceType,0)*W260),INDEX(LPD2010WB,MATCH('Interior Lighting'!D260,LightingSpaceType,0)))","v":{"$error":"#N/A"}},0,{"$error":"#N/A"},{"$error":"#N/A"},{"$error":"#N/A"},0,"",null,null,1,null,{"$error":"#N/A"},{"$error":"#N/A"},{"$f":"INDEX(Lookup!$O$9:$O$24,MATCH('Interior Lighting'!Z260,Lookup!$K$9:$K$24,0))","v":{"$error":"#N/A"}},{"$f":"IF(E260=\"A\",INDEX(Lookup!$L$9:$L$24,MATCH(Z260,Lookup!$K$9:$K$24,0)),IF(E260=\"B\",INDEX(Lookup!$M$9:$M$24,MATCH(Z260,Lookup!$K$9:$K$24,0)),IF(E260=\"C\",INDEX(Lookup!$N$9:$N$24,MATCH(Z260,Lookup!$K$9:$K$24,0)),\"N/A\")))","v":{"$error":"#N/A"}}]
[null,null,null,null,{"$f":"INDEX(Lookup!$I$9:$I$24,MATCH('Interior Lighting'!D261,Lookup!$C$9:$C$24,0))","v":{"$error":"#N/A"}},null,null,null,{"$error":"#N/A"},null,0,{"$error":"#DIV/0!"},"N/A",{"$f":"IF($D$20=\"Space-By-Space (90.1-2010)\",INDEX(LPD2010SS,MATCH('Interior Lighting'!D261,LightingSpaceType,0)*W261),INDEX(LPD2010WB,MATCH('Interior Lighting'!D261,LightingSpaceType,0)))","v":{"$error":"#N/A"}},0,{"$error":"#N/A"},{"$error":"#N/A"},{"$error":"#N/A"},0,"",null,null,1,null,{"$error":"#N/A"},{"$error":"#N/A"},{"$f":"INDEX(Lookup!$O$9:$O$24,MATCH('Interior Lighting'!Z261,Lookup!$K$9:$K$24,0))","v":{"$error":"#N/A"}},{"$f":"IF(E261=\"A\",INDEX(Lookup!$L$9:$L$24,MATCH(Z261,Lookup!$K$9:$K$24,0)),IF(E261=\"B\",INDEX(Lookup!$M$9:$M$24,MATCH(Z261,Lookup!$K$9:$K$24,0)),IF(E261=\"C\",INDEX(Lookup!$N$9:$N$24,MATCH(Z261,Lookup!$K$9:$K$24,0)),\"N/A\")))","v":{"$error":"#N/A"}}]
[null,null,null,null,{"$f":"INDEX(Lookup!$I$9:$I$24,MATCH('Interior Lighting'!D262,Lookup!$C$9:$C$24,0))","v":{"$error":"#N/A"}},null,null,null,{"$error":"#N/A"},null,0,{"$error":"#DIV/0!"},"N/A",{"$f":"IF($D$20=\"Space-By-Space (90.1-2010)\",INDEX(LPD2010SS,MATCH('Interior Lighting'!D262,LightingSpaceType,0)*W262),INDEX(LPD2010WB,MATCH('Interior Lighting'!D262,LightingSpaceType,0)))","v":{"$error":"#N/A"}},0,{"$error":"#N/A"},{"$error":"#N/A"},{"$error":"#N/A"},0,"",null,null,1,null,{"$error":"#N/A"},{"$error":"#N/A"},{"$f":"INDEX(Lookup!$O$9:$O$24,MATCH('Interior Lighting'!Z262,Lookup!$K$9:$K$24,0))","v":{"$error":"#N/A"}},{"$f":"IF(E262=\"A\",INDEX(Lookup!$L$9:$L$24,MATCH(Z262,Lookup!$K$9:$K$24,0)),IF(E262=\"B\",INDEX(Lookup!$M$9:$M$24,MATCH(Z262,Lookup!$K$9:$K$24,0)),IF(E262=\"C\",INDEX(Lookup!$N$9:$N$24,MATCH(Z262,Lookup!$K$9:$K$24,0)),\"N/A\")))","v":{"$error":"#N/A"}}]
[null,null,null,null,{"$f":"INDEX(Lookup!$I$9:$I$24,MATCH('Interior Lighting'!D263,Lookup!$C$9:$C$24,0))","v":{"$error":"#N/A"}},null,null,null,{"$error":"#N/A"},null,0,{"$error":"#DIV/0!"},"N/A",{"$f":"IF($D$20=\"Space-By-Space (90.1-2010)\",INDEX(LPD2010SS,MATCH('Interior Lighting'!D263,LightingSpaceType,0)*W263),INDEX(LPD2010WB,MATCH('Interior Lighting'!D263,LightingSpaceType,0)))","v":{"$error":"#N/A"}},0,{"$error":"#N/A"},{"$error":"#N/A"},{"$error":"#N/A"},0,"",null,null,1,null,{"$error":"#N/A"},{"$error":"#N/A"},{"$f":"INDEX(Lookup!$O$9:$O$24,MATCH('Interior Lighting'!Z263,Lookup!$K$9:$K$24,0))","v":{"$error":"#N/A"}},{"$f":"IF(E263=\"A\",INDEX(Lookup!$L$9:$L$24,MATCH(Z263,Lookup!$K$9:$K$24,0)),IF(E263=\"B\",INDEX(Lookup!$M$9:$M$24,MATCH(Z263,Lookup!$K$9:$K$24,0)),IF(E263=\"C\",INDEX(Lookup!$N$9:$N$24,MATCH(Z263,Lookup!$K$9:$K$24,0)),\"N/A\")))","v":{"$error":"#N/A"}}]
[null,null,null,null,{"$f":"INDEX(Lookup!$I$9:$I$24,MATCH('Interior Lighting'!D264,Lookup!$C$9:$C$24,0))","v":{"$error":"#N/A"}},null,null,null,{"$error":"#N/A"},null,0,{"$error":"#DIV/0!"},"N/A",{"$f":"IF($D$20=\"Space-By-Space (90.1-2010)\",INDEX(LPD2010SS,MATCH('Interior Lighting'!D264,LightingSpaceType,0)*W264),INDEX(LPD2010WB,MATCH('Interior Lighting'!D264,LightingSpaceType,0)))","v":{"$error":"#N/A"}},0,{"$error":"#N/A"},{"$error":"#N/A"},{"$error":"#N/A"},0,"",null,null,1,null,{"$error":"#N/A"},{"$error":"#N/A"},{"$f":"INDEX(Lookup!$O$9:$O$24,MATCH('Interior Lighting'!Z264,Lookup!$K$9:$K$24,0))","v":{"$error":"#N/A"}},{"$f":"IF(E264=\"A\",INDEX(Lookup!$L$9:$L$24,MATCH(Z264,Lookup!$K$9:$K$24,0)),IF(E264=\"B\",INDEX(Lookup!$M$9:$M$24,MATCH(Z264,Lookup!$K$9:$K$24,0)),IF(E264=\"C\",INDEX(Lookup!$N$9:$N$24,MATCH(Z264,Lookup!$K$9:$K$24,0)),\"N/A\")))","v":{"$error":"#N/A"}}]
[null,null,null,null,{"$f":"INDEX(Lookup!$I$9:$I$24,MATCH('Interior Lighting'!D265,Lookup!$C$9:$C$24,0))","v":{"$error":"#N/A"}},null,null,null,{"$error":"#N/A"},null,0,{"$error":"#DIV/0!"},"N/A",{"$f":"IF($D$20=\"Space-By-Space (90.1-2010)\",INDEX(LPD2010SS,MATCH('Interior Lighting'!D265,LightingSpaceType,0)*W265),INDEX(LPD2010WB,MATCH('Interior Lighting'!D265,LightingSpaceType,0)))","v":{"$error":"#N/A"}},0,{"$error":"#N/A"},{"$error":"#N/A"},{"$error":"#N/A"},0,"",null,null,1,null,{"$error":"#N/A"},{"$error":"#N/A"},{"$f":"INDEX(Lookup!$O$9:$O$24,MATCH('Interior Lighting'!Z265,Lookup!$K$9:$K$24,0))","v":{"$error":"#N/A"}},{"$f":"IF(E265=\"A\",INDEX(Lookup!$L$9:$L$24,MATCH(Z265,Lookup!$K$9:$K$24,0)),IF(E265=\"B\",INDEX(Lookup!$M$9:$M$24,MATCH(Z265,Lookup!$K$9:$K$24,0)),IF(E265=\"C\",INDEX(Lookup!$N$9:$N$24,MATCH(Z265,Lookup!$K$9:$K$24,0)),\"N/A\")))","v":{"$error":"#N/A"}}]
[null,null,null,null,{"$f":"INDEX(Lookup!$I$9:$I$24,MATCH('Interior Lighting'!D266,Lookup!$C$9:$C$24,0))","v":{"$error":"#N/A"}},null,null,null,{"$error":"#N/A"},null,0,{"$error":"#DIV/0!"},"N/A",{"$f":"IF($D$20=\"Space-By-Space (90.1-2010)\",INDEX(LPD2010SS,MATCH('Interior Lighting'!D266,LightingSpaceType,0)*W266),INDEX(LPD2010WB,MATCH('Interior Lighting'!D266,LightingSpaceType,0)))","v":{"$error":"#N/A"}},0,{"$error":"#N/A"},{"$error":"#N/A"},{"$error":"#N/A"},0,"",null,null,1,null,{"$error":"#N/A"},{"$error":"#N/A"},{"$f":"INDEX(Lookup!$O$9:$O$24,MATCH('Interior Lighting'!Z266,Lookup!$K$9:$K$24,0))","v":{"$error":"#N/A"}},{"$f":"IF(E266=\"A\",INDEX(Lookup!$L$9:$L$24,MATCH(Z266,Lookup!$K$9:$K$24,0)),IF(E266=\"B\",INDEX(Lookup!$M$9:$M$24,MATCH(Z266,Lookup!$K$9:$K$24,0)),IF(E266=\"C\",INDEX(Lookup!$N$9:$N$24,MATCH(Z266,Lookup!$K$9:$K$24,0)),\"N/A\")))","v":{"$error":"#N/A"}}]
[null,null,null,null,{"$f":"INDEX(Lookup!$I$9:$I$24,MATCH('Interior Lighting'!D267,Lookup!$C$9:$C$24,0))","v":{"$error":"#N/A"}},null,null,null,{"$error":"#N/A"},null,0,{"$error":"#DIV/0!"},"N/A",{"$f":"IF($D$20=\"Space-By-Space (90.1-2010)\",INDEX(LPD2010SS,MATCH('Interior Lighting'!D267,LightingSpaceType,0)*W267),INDEX(LPD2010WB,MATCH('Interior Lighting'!D267,LightingSpaceType,0)))","v":{"$error":"#N/A"}},0,{"$error":"#N/A"},{"$error":"#N/A"},{"$error":"#N/A"},0,"",null,null,1,null,{"$error":"#N/A"},{"$error":"#N/A"},{"$f":"INDEX(Lookup!$O$9:$O$24,MATCH('Interior Lighting'!Z267,Lookup!$K$9:$K$24,0))","v":{"$error":"#N/A"}},{"$f":"IF(E267=\"A\",INDEX(Lookup!$L$9:$L$24,MATCH(Z267,Lookup!$K$9:$K$24,0)),IF(E267=\"B\",INDEX(Lookup!$M$9:$M$24,MATCH(Z267,Lookup!$K$9:$K$24,0)),IF(E267=\"C\",INDEX(Lookup!$N$9:$N$24,MATCH(Z267,Lookup!$K$9:$K$24,0)),\"N/A\")))","v":{"$error":"#N/A"}}]
[null,null,null,null,{"$f":"INDEX(Lookup!$I$9:$I$24,MATCH('Interior Lighting'!D268,Lookup!$C$9:$C$24,0))","v":{"$error":"#N/A"}},null,null,null,{"$error":"#N/A"},null,0,{"$error":"#DIV/0!"},"N/A",{"$f":"IF($D$20=\"Space-By-Space (90.1-2010)\",INDEX(LPD2010SS,MATCH('Interior Lighting'!D268,LightingSpaceType,0)*W268),INDEX(LPD2010WB,MATCH('Interior Lighting'!D268,LightingSpaceType,0)))","v":{"$error":"#N/A"}},0,{"$error":"#N/A"},{"$error":"#N/A"},{"$error":"#N/A"},0,"",null,null,1,null,{"$error":"#N/A"},{"$error":"#N/A"},{"$f":"INDEX(Lookup!$O$9:$O$24,MATCH('Interior Lighting'!Z268,Lookup!$K$9:$K$24,0))","v":{"$error":"#N/A"}},{"$f":"IF(E268=\"A\",INDEX(Lookup!$L$9:$L$24,MATCH(Z268,Lookup!$K$9:$K$24,0)),IF(E268=\"B\",INDEX(Lookup!$M$9:$M$24,MATCH(Z268,Lookup!$K$9:$K$24,0)),IF(E268=\"C\",INDEX(Lookup!$N$9:$N$24,MATCH(Z268,Lookup!$K$9:$K$24,0)),\"N/A\")))","v":{"$error":"#N/A"}}]
[null,null,null,null,{"$f":"INDEX(Lookup!$I$9:$I$24,MATCH('Interior Lighting'!D269,Lookup!$C$9:$C$24,0))","v":{"$error":"#N/A"}},null,null,null,{"$error":"#N/A"},null,0,{"$error":"#DIV/0!"},"N/A",{"$f":"IF($D$20=\"Space-By-Space (90.1-2010)\",INDEX(LPD2010SS,MATCH('Interior Lighting'!D269,LightingSpaceType,0)*W269),INDEX(LPD2010WB,MATCH('Interior Lighting'!D269,LightingSpaceType,0)))","v":{"$error":"#N/A"}},0,{"$error":"#N/A"},{"$error":"#N/A"},{"$error":"#N/A"},0,"",null,null,1,null,{"$error":"#N/A"},{"$error":"#N/A"},{"$f":"INDEX(Lookup!$O$9:$O$24,MATCH('Interior Lighting'!Z269,Lookup!$K$9:$K$24,0))","v":{"$error":"#N/A"}},{"$f":"IF(E269=\"A\",INDEX(Lookup!$L$9:$L$24,MATCH(Z269,Lookup!$K$9:$K$24,0)),IF(E269=\"B\",INDEX(Lookup!$M$9:$M$24,MATCH(Z269,Lookup!$K$9:$K$24,0)),IF(E269=\"C\",INDEX(Lookup!$N$9:$N$24,MATCH(Z269,Lookup!$K$9:$K$24,0)),\"N/A\")))","v":{"$error":"#N/A"}}]
[null,null,null,null,{"$f":"INDEX(Lookup!$I$9:$I$24,MATCH('Interior Lighting'!D270,Lookup!$C$9:$C$24,0))","v":{"$error":"#N/A"}},null,null,null,{"$error":"#N/A"},null,0,{"$error":"#DIV/0!"},"N/A",{"$f":"IF($D$20=\"Space-By-Space (90.1-2010)\",INDEX(LPD2010SS,MATCH('Interior Lighting'!D270,LightingSpaceType,0)*W270),INDEX(LPD2010WB,MATCH('Interior Lighting'!D270,LightingSpaceType,0)))","v":{"$error":"#N/A"}},0,{"$error":"#N/A"},{"$error":"#N/A"},{"$error":"#N/A"},0,"",null,null,1,null,{"$error":"#N/A"},{"$error":"#N/A"},{"$f":"INDEX(Lookup!$O$9:$O$24,MATCH('Interior Lighting'!Z270,Lookup!$K$9:$K$24,0))","v":{"$error":"#N/A"}},{"$f":"IF(E270=\"A\",INDEX(Lookup!$L$9:$L$24,MATCH(Z270,Lookup!$K$9:$K$24,0)),IF(E270=\"B\",INDEX(Lookup!$M$9:$M$24,MATCH(Z270,Lookup!$K$9:$K$24,0)),IF(E270=\"C\",INDEX(Lookup!$N$9:$N$24,MATCH(Z270,Lookup!$K$9:$K$24,0)),\"N/A\")))","v":{"$error":"#N/A"}}]
[null,null,null,null,{"$f":"INDEX(Lookup!$I$9:$I$24,MATCH('Interior Lighting'!D271,Lookup!$C$9:$C$24,0))","v":{"$error":"#N/A"}},null,null,null,{"$error":"#N/A"},null,0,{"$error":"#DIV/0!"},"N/A",{"$f":"IF($D$20=\"Space-By-Space (90.1-2010)\",INDEX(LPD2010SS,MATCH('Interior Lighting'!D271,LightingSpaceType,0)*W271),INDEX(LPD2010WB,MATCH('Interior Lighting'!D271,LightingSpaceType,0)))","v":{"$error":"#N/A"}},0,{"$error":"#N/A"},{"$error":"#N/A"},{"$error":"#N/A"},0,"",null,null,1,null,{"$error":"#N/A"},{"$error":"#N/A"},{"$f":"INDEX(Lookup!$O$9:$O$24,MATCH('Interior Lighting'!Z271,Lookup!$K$9:$K$24,0))","v":{"$error":"#N/A"}},{"$f":"IF(E271=\"A\",INDEX(Lookup!$L$9:$L$24,MATCH(Z271,Lookup!$K$9:$K$24,0)),IF(E271=\"B\",INDEX(Lookup!$M$9:$M$24,MATCH(Z271,Lookup!$K$9:$K$24,0)),IF(E271=\"C\",INDEX(Lookup!$N$9:$N$24,MATCH(Z271,Lookup!$K$9:$K$24,0)),\"N/A\")))","v":{"$error":"#N/A"}}]
[null,null,null,null,{"$f":"INDEX(Lookup!$I$9:$I$24,MATCH('Interior Lighting'!D272,Lookup!$C$9:$C$24,0))","v":{"$error":"#N/A"}},null,null,null,{"$error":"#N/A"},null,0,{"$error":"#DIV/0!"},"N/A",{"$f":"IF($D$20=\"Space-By-Space (90.1-2010)\",INDEX(LPD2010SS,MATCH('Interior Lighting'!D272,LightingSpaceType,0)*W272),INDEX(LPD2010WB,MATCH('Interior Lighting'!D272,LightingSpaceType,0)))","v":{"$error":"#N/A"}},0,{"$error":"#N/A"},{"$error":"#N/A"},{"$error":"#N/A"},0,"",null,null,1,null,{"$error":"#N/A"},{"$error":"#N/A"},{"$f":"INDEX(Lookup!$O$9:$O$24,MATCH('Interior Lighting'!Z272,Lookup!$K$9:$K$24,0))","v":{"$error":"#N/A"}},{"$f":"IF(E272=\"A\",INDEX(Lookup!$L$9:$L$24,MATCH(Z272,Lookup!$K$9:$K$24,0)),IF(E272=\"B\",INDEX(Lookup!$M$9:$M$24,MATCH(Z272,Lookup!$K$9:$K$24,0)),IF(E272=\"C\",INDEX(Lookup!$N$9:$N$24,MATCH(Z272,Lookup!$K$9:$K$24,0)),\"N/A\")))","v":{"$error":"#N/A"}}]
[null,null,null,null,{"$f":"INDEX(Lookup!$I$9:$I$24,MATCH('Interior Lighting'!D273,Lookup!$C$9:$C$24,0))","v":{"$error":"#N/A"}},null,null,null,{"$error":"#N/A"},null,0,{"$error":"#DIV/0!"},"N/A",{"$f":"IF($D$20=\"Space-By-Space (90.1-2010)\",INDEX(LPD2010SS,MATCH('Interior Lighting'!D273,LightingSpaceType,0)*W273),INDEX(LPD2010WB,MATCH('Interior Lighting'!D273,LightingSpaceType,0)))","v":{"$error":"#N/A"}},0,{"$error":"#N/A"},{"$error":"#N/A"},{"$error":"#N/A"},0,"",null,null,1,null,{"$error":"#N/A"},{"$error":"#N/A"},{"$f":"INDEX(Lookup!$O$9:$O$24,MATCH('Interior Lighting'!Z273,Lookup!$K$9:$K$24,0))","v":{"$error":"#N/A"}},{"$f":"IF(E273=\"A\",INDEX(Lookup!$L$9:$L$24,MATCH(Z273,Lookup!$K$9:$K$24,0)),IF(E273=\"B\",INDEX(Lookup!$M$9:$M$24,MATCH(Z273,Lookup!$K$9:$K$24,0)),IF(E273=\"C\",INDEX(Lookup!$N$9:$N$24,MATCH(Z273,Lookup!$K$9:$K$24,0)),\"N/A\")))","v":{"$error":"#N/A"}}]
[null,null,null,null,{"$f":"INDEX(Lookup!$I$9:$I$24,MATCH('Interior Lighting'!D274,Lookup!$C$9:$C$24,0))","v":{"$error":"#N/A"}},null,null,null,{"$error":"#N/A"},null,0,{"$error":"#DIV/0!"},"N/A",{"$f":"IF($D$20=\"Space-By-Space (90.1-2010)\",INDEX(LPD2010SS,MATCH('Interior Lighting'!D274,LightingSpaceType,0)*W274),INDEX(LPD2010WB,MATCH('Interior Lighting'!D274,LightingSpaceType,0)))","v":{"$error":"#N/A"}},0,{"$error":"#N/A"},{"$error":"#N/A"},{"$error":"#N/A"},0,"",null,null,1,null,{"$error":"#N/A"},{"$error":"#N/A"},{"$f":"INDEX(Lookup!$O$9:$O$24,MATCH('Interior Lighting'!Z274,Lookup!$K$9:$K$24,0))","v":{"$error":"#N/A"}},{"$f":"IF(E274=\"A\",INDEX(Lookup!$L$9:$L$24,MATCH(Z274,Lookup!$K$9:$K$24,0)),IF(E274=\"B\",INDEX(Lookup!$M$9:$M$24,MATCH(Z274,Lookup!$K$9:$K$24,0)),IF(E274=\"C\",INDEX(Lookup!$N$9:$N$24,MATCH(Z274,Lookup!$K$9:$K$24,0)),\"N/A\")))","v":{"$error":"#N/A"}}]
[null,null,null,null,{"$f":"INDEX(Lookup!$I$9:$I$24,MATCH('Interior Lighting'!D275,Lookup!$C$9:$C$24,0))","v":{"$error":"#N/A"}},null,null,null,{"$error":"#N/A"},null,0,{"$error":"#DIV/0!"},"N/A",{"$f":"IF($D$20=\"Space-By-Space (90.1-2010)\",INDEX(LPD2010SS,MATCH('Interior Lighting'!D275,LightingSpaceType,0)*W275),INDEX(LPD2010WB,MATCH('Interior Lighting'!D275,LightingSpaceType,0)))","v":{"$error":"#N/A"}},0,{"$error":"#N/A"},{"$error":"#N/A"},{"$error":"#N/A"},0,"",null,null,1,null,{"$error":"#N/A"},{"$error":"#N/A"},{"$f":"INDEX(Lookup!$O$9:$O$24,MATCH('Interior Lighting'!Z275,Lookup!$K$9:$K$24,0))","v":{"$error":"#N/A"}},{"$f":"IF(E275=\"A\",INDEX(Lookup!$L$9:$L$24,MATCH(Z275,Lookup!$K$9:$K$24,0)),IF(E275=\"B\",INDEX(Lookup!$M$9:$M$24,MATCH(Z275,Lookup!$K$9:$K$24,0)),IF(E275=\"C\",INDEX(Lookup!$N$9:$N$24,MATCH(Z275,Lookup!$K$9:$K$24,0)),\"N/A\")))","v":{"$error":"#N/A"}}]
[null,null,null,null,{"$f":"INDEX(Lookup!$I$9:$I$24,MATCH('Interior Lighting'!D276,Lookup!$C$9:$C$24,0))","v":{"$error":"#N/A"}},null,null,null,{"$error":"#N/A"},null,0,{"$error":"#DIV/0!"},"N/A",{"$f":"IF($D$20=\"Space-By-Space (90.1-2010)\",INDEX(LPD2010SS,MATCH('Interior Lighting'!D276,LightingSpaceType,0)*W276),INDEX(LPD2010WB,MATCH('Interior Lighting'!D276,LightingSpaceType,0)))","v":{"$error":"#N/A"}},0,{"$error":"#N/A"},{"$error":"#N/A"},{"$error":"#N/A"},0,"",null,null,1,null,{"$error":"#N/A"},{"$error":"#N/A"},{"$f":"INDEX(Lookup!$O$9:$O$24,MATCH('Interior Lighting'!Z276,Lookup!$K$9:$K$24,0))","v":{"$error":"#N/A"}},{"$f":"IF(E276=\"A\",INDEX(Lookup!$L$9:$L$24,MATCH(Z276,Lookup!$K$9:$K$24,0)),IF(E276=\"B\",INDEX(Lookup!$M$9:$M$24,MATCH(Z276,Lookup!$K$9:$K$24,0)),IF(E276=\"C\",INDEX(Lookup!$N$9:$N$24,MATCH(Z276,Lookup!$K$9:$K$24,0)),\"N/A\")))","v":{"$error":"#N/A"}}]
[null,null,null,null,{"$f":"INDEX(Lookup!$I$9:$I$24,MATCH('Interior Lighting'!D277,Lookup!$C$9:$C$24,0))","v":{"$error":"#N/A"}},null,null,null,{"$error":"#N/A"},null,0,{"$error":"#DIV/0!"},"N/A",{"$f":"IF($D$20=\"Space-By-Space (90.1-2010)\",INDEX(LPD2010SS,MATCH('Interior Lighting'!D277,LightingSpaceType,0)*W277),INDEX(LPD2010WB,MATCH('Interior Lighting'!D277,LightingSpaceType,0)))","v":{"$error":"#N/A"}},0,{"$error":"#N/A"},{"$error":"#N/A"},{"$error":"#N/A"},0,"",null,null,1,null,{"$error":"#N/A"},{"$error":"#N/A"},{"$f":"INDEX(Lookup!$O$9:$O$24,MATCH('Interior Lighting'!Z277,Lookup!$K$9:$K$24,0))","v":{"$error":"#N/A"}},{"$f":"IF(E277=\"A\",INDEX(Lookup!$L$9:$L$24,MATCH(Z277,Lookup!$K$9:$K$24,0)),IF(E277=\"B\",INDEX(Lookup!$M$9:$M$24,MATCH(Z277,Lookup!$K$9:$K$24,0)),IF(E277=\"C\",INDEX(Lookup!$N$9:$N$24,MATCH(Z277,Lookup!$K$9:$K$24,0)),\"N/A\")))","v":{"$error":"#N/A"}}]
[null,null,null,null,{"$f":"INDEX(Lookup!$I$9:$I$24,MATCH('Interior Lighting'!D278,Lookup!$C$9:$C$24,0))","v":{"$error":"#N/A"}},null,null,null,{"$error":"#N/A"},null,0,{"$error":"#DIV/0!"},"N/A",{"$f":"IF($D$20=\"Space-By-Space (90.1-2010)\",INDEX(LPD2010SS,MATCH('Interior Lighting'!D278,LightingSpaceType,0)*W278),INDEX(LPD2010WB,MATCH('Interior Lighting'!D278,LightingSpaceType,0)))","v":{"$error":"#N/A"}},0,{"$error":"#N/A"},{"$error":"#N/A"},{"$error":"#N/A"},0,"",null,null,1,null,{"$error":"#N/A"},{"$error":"#N/A"},{"$f":"INDEX(Lookup!$O$9:$O$24,MATCH('Interior Lighting'!Z278,Lookup!$K$9:$K$24,0))","v":{"$error":"#N/A"}},{"$f":"IF(E278=\"A\",INDEX(Lookup!$L$9:$L$24,MATCH(Z278,Lookup!$K$9:$K$24,0)),IF(E278=\"B\",INDEX(Lookup!$M$9:$M$24,MATCH(Z278,Lookup!$K$9:$K$24,0)),IF(E278=\"C\",INDEX(Lookup!$N$9:$N$24,MATCH(Z278,Lookup!$K$9:$K$24,0)),\"N/A\")))","v":{"$error":"#N/A"}}]
[null,null,null,null,{"$f":"INDEX(Lookup!$I$9:$I$24,MATCH('Interior Lighting'!D279,Lookup!$C$9:$C$24,0))","v":{"$error":"#N/A"}},null,null,null,{"$error":"#N/A"},null,0,{"$error":"#DIV/0!"},"N/A",{"$f":"IF($D$20=\"Space-By-Space (90.1-2010)\",INDEX(LPD2010SS,MATCH('Interior Lighting'!D279,LightingSpaceType,0)*W279),INDEX(LPD2010WB,MATCH('Interior Lighting'!D279,LightingSpaceType,0)))","v":{"$error":"#N/A"}},0,{"$error":"#N/A"},{"$error":"#N/A"},{"$error":"#N/A"},0,"",null,null,1,null,{"$error":"#N/A"},{"$error":"#N/A"},{"$f":"INDEX(Lookup!$O$9:$O$24,MATCH('Interior Lighting'!Z279,Lookup!$K$9:$K$24,0))","v":{"$error":"#N/A"}},{"$f":"IF(E279=\"A\",INDEX(Lookup!$L$9:$L$24,MATCH(Z279,Lookup!$K$9:$K$24,0)),IF(E279=\"B\",INDEX(Lookup!$M$9:$M$24,MATCH(Z279,Lookup!$K$9:$K$24,0)),IF(E279=\"C\",INDEX(Lookup!$N$9:$N$24,MATCH(Z279,Lookup!$K$9:$K$24,0)),\"N/A\")))","v":{"$error":"#N/A"}}]
[null,null,null,null,{"$f":"INDEX(Lookup!$I$9:$I$24,MATCH('Interior Lighting'!D280,Lookup!$C$9:$C$24,0))","v":{"$error":"#N/A"}},null,null,null,{"$error":"#N/A"},null,0,{"$error":"#DIV/0!"},"N/A",{"$f":"IF($D$20=\"Space-By-Space (90.1-2010)\",INDEX(LPD2010SS,MATCH('Interior Lighting'!D280,LightingSpaceType,0)*W280),INDEX(LPD2010WB,MATCH('Interior Lighting'!D280,LightingSpaceType,0)))","v":{"$error":"#N/A"}},0,{"$error":"#N/A"},{"$error":"#N/A"},{"$error":"#N/A"},0,"",null,null,1,null,{"$error":"#N/A"},{"$error":"#N/A"},{"$f":"INDEX(Lookup!$O$9:$O$24,MATCH('Interior Lighting'!Z280,Lookup!$K$9:$K$24,0))","v":{"$error":"#N/A"}},{"$f":"IF(E280=\"A\",INDEX(Lookup!$L$9:$L$24,MATCH(Z280,Lookup!$K$9:$K$24,0)),IF(E280=\"B\",INDEX(Lookup!$M$9:$M$24,MATCH(Z280,Lookup!$K$9:$K$24,0)),IF(E280=\"C\",INDEX(Lookup!$N$9:$N$24,MATCH(Z280,Lookup!$K$9:$K$24,0)),\"N/A\")))","v":{"$error":"#N/A"}}]
[null,null,null,null,{"$f":"INDEX(Lookup!$I$9:$I$24,MATCH('Interior Lighting'!D281,Lookup!$C$9:$C$24,0))","v":{"$error":"#N/A"}},null,null,null,{"$error":"#N/A"},null,0,{"$error":"#DIV/0!"},"N/A",{"$f":"IF($D$20=\"Space-By-Space (90.1-2010)\",INDEX(LPD2010SS,MATCH('Interior Lighting'!D281,LightingSpaceType,0)*W281),INDEX(LPD2010WB,MATCH('Interior Lighting'!D281,LightingSpaceType,0)))","v":{"$error":"#N/A"}},0,{"$error":"#N/A"},{"$error":"#N/A"},{"$error":"#N/A"},0,"",null,null,1,null,{"$error":"#N/A"},{"$error":"#N/A"},{"$f":"INDEX(Lookup!$O$9:$O$24,MATCH('Interior Lighting'!Z281,Lookup!$K$9:$K$24,0))","v":{"$error":"#N/A"}},{"$f":"IF(E281=\"A\",INDEX(Lookup!$L$9:$L$24,MATCH(Z281,Lookup!$K$9:$K$24,0)),IF(E281=\"B\",INDEX(Lookup!$M$9:$M$24,MATCH(Z281,Lookup!$K$9:$K$24,0)),IF(E281=\"C\",INDEX(Lookup!$N$9:$N$24,MATCH(Z281,Lookup!$K$9:$K$24,0)),\"N/A\")))","v":{"$error":"#N/A"}}]
[null,null,null,null,{"$f":"INDEX(Lookup!$I$9:$I$24,MATCH('Interior Lighting'!D282,Lookup!$C$9:$C$24,0))","v":{"$error":"#N/A"}},null,null,null,{"$error":"#N/A"},null,0,{"$error":"#DIV/0!"},"N/A",{"$f":"IF($D$20=\"Space-By-Space (90.1-2010)\",INDEX(LPD2010SS,MATCH('Interior Lighting'!D282,LightingSpaceType,0)*W282),INDEX(LPD2010WB,MATCH('Interior Lighting'!D282,LightingSpaceType,0)))","v":{"$error":"#N/A"}},0,{"$error":"#N/A"},{"$error":"#N/A"},{"$error":"#N/A"},0,"",null,null,1,null,{"$error":"#N/A"},{"$error":"#N/A"},{"$f":"INDEX(Lookup!$O$9:$O$24,MATCH('Interior Lighting'!Z282,Lookup!$K$9:$K$24,0))","v":{"$error":"#N/A"}},{"$f":"IF(E282=\"A\",INDEX(Lookup!$L$9:$L$24,MATCH(Z282,Lookup!$K$9:$K$24,0)),IF(E282=\"B\",INDEX(Lookup!$M$9:$M$24,MATCH(Z282,Lookup!$K$9:$K$24,0)),IF(E282=\"C\",INDEX(Lookup!$N$9:$N$24,MATCH(Z282,Lookup!$K$9:$K$24,0)),\"N/A\")))","v":{"$error":"#N/A"}}]
[null,null,null,null,{"$f":"INDEX(Lookup!$I$9:$I$24,MATCH('Interior Lighting'!D283,Lookup!$C$9:$C$24,0))","v":{"$error":"#N/A"}},null,null,null,{"$error":"#N/A"},null,0,{"$error":"#DIV/0!"},"N/A",{"$f":"IF($D$20=\"Space-By-Space (90.1-2010)\",INDEX(LPD2010SS,MATCH('Interior Lighting'!D283,LightingSpaceType,0)*W283),INDEX(LPD2010WB,MATCH('Interior Lighting'!D283,LightingSpaceType,0)))","v":{"$error":"#N/A"}},0,{"$error":"#N/A"},{"$error":"#N/A"},{"$error":"#N/A"},0,"",null,null,1,null,{"$error":"#N/A"},{"$error":"#N/A"},{"$f":"INDEX(Lookup!$O$9:$O$24,MATCH('Interior Lighting'!Z283,Lookup!$K$9:$K$24,0))","v":{"$error":"#N/A"}},{"$f":"IF(E283=\"A\",INDEX(Lookup!$L$9:$L$24,MATCH(Z283,Lookup!$K$9:$K$24,0)),IF(E283=\"B\",INDEX(Lookup!$M$9:$M$24,MATCH(Z283,Lookup!$K$9:$K$24,0)),IF(E283=\"C\",INDEX(Lookup!$N$9:$N$24,MATCH(Z283,Lookup!$K$9:$K$24,0)),\"N/A\")))","v":{"$error":"#N/A"}}]
[null,null,null,null,{"$f":"INDEX(Lookup!$I$9:$I$24,MATCH('Interior Lighting'!D284,Lookup!$C$9:$C$24,0))","v":{"$error":"#N/A"}},null,null,null,{"$error":"#N/A"},null,0,{"$error":"#DIV/0!"},"N/A",{"$f":"IF($D$20=\"Space-By-Space (90.1-2010)\",INDEX(LPD2010SS,MATCH('Interior Lighting'!D284,LightingSpaceType,0)*W284),INDEX(LPD2010WB,MATCH('Interior Lighting'!D284,LightingSpaceType,0)))","v":{"$error":"#N/A"}},0,{"$error":"#N/A"},{"$error":"#N/A"},{"$error":"#N/A"},0,"",null,null,1,null,{"$error":"#N/A"},{"$error":"#N/A"},{"$f":"INDEX(Lookup!$O$9:$O$24,MATCH('Interior Lighting'!Z284,Lookup!$K$9:$K$24,0))","v":{"$error":"#N/A"}},{"$f":"IF(E284=\"A\",INDEX(Lookup!$L$9:$L$24,MATCH(Z284,Lookup!$K$9:$K$24,0)),IF(E284=\"B\",INDEX(Lookup!$M$9:$M$24,MATCH(Z284,Lookup!$K$9:$K$24,0)),IF(E284=\"C\",INDEX(Lookup!$N$9:$N$24,MATCH(Z284,Lookup!$K$9:$K$24,0)),\"N/A\")))","v":{"$error":"#N/A"}}]
[null,null,null,null,{"$f":"INDEX(Lookup!$I$9:$I$24,MATCH('Interior Lighting'!D285,Lookup!$C$9:$C$24,0))","v":{"$error":"#N/A"}},null,null,null,{"$error":"#N/A"},null,0,{"$error":"#DIV/0!"},"N/A",{"$f":"IF($D$20=\"Space-By-Space (90.1-2010)\",INDEX(LPD2010SS,MATCH('Interior Lighting'!D285,LightingSpaceType,0)*W285),INDEX(LPD2010WB,MATCH('Interior Lighting'!D285,LightingSpaceType,0)))","v":{"$error":"#N/A"}},0,{"$error":"#N/A"},{"$error":"#N/A"},{"$error":"#N/A"},0,"",null,null,1,null,{"$error":"#N/A"},{"$error":"#N/A"},{"$f":"INDEX(Lookup!$O$9:$O$24,MATCH('Interior Lighting'!Z285,Lookup!$K$9:$K$24,0))","v":{"$error":"#N/A"}},{"$f":"IF(E285=\"A\",INDEX(Lookup!$L$9:$L$24,MATCH(Z285,Lookup!$K$9:$K$24,0)),IF(E285=\"B\",INDEX(Lookup!$M$9:$M$24,MATCH(Z285,Lookup!$K$9:$K$24,0)),IF(E285=\"C\",INDEX(Lookup!$N$9:$N$24,MATCH(Z285,Lookup!$K$9:$K$24,0)),\"N/A\")))","v":{"$error":"#N/A"}}]
[null,null,null,null,{"$f":"INDEX(Lookup!$I$9:$I$24,MATCH('Interior Lighting'!D286,Lookup!$C$9:$C$24,0))","v":{"$error":"#N/A"}},null,null,null,{"$error":"#N/A"},null,0,{"$error":"#DIV/0!"},"N/A",{"$f":"IF($D$20=\"Space-By-Space (90.1-2010)\",INDEX(LPD2010SS,MATCH('Interior Lighting'!D286,LightingSpaceType,0)*W286),INDEX(LPD2010WB,MATCH('Interior Lighting'!D286,LightingSpaceType,0)))","v":{"$error":"#N/A"}},0,{"$f":"Y286*AA286*AB286","v":{"$error":"#N/A"}},{"$error":"#N/A"},{"$f":"INDEX(Footcandles,MATCH(D286,LightingSpaceType,0))","v":{"$error":"#N/A"}},{"$f":"J286*B286","v":0},{"$f":"IF(F286>0, IF(Q286<R286, \"Insufficient lighting to meet IESNA footcandle recommendations.\", \"\"), \"\")","v":""},null,null,{"$f":"IF(A286=\"Yes\",1.2,1)","v":1},null,{"$f":"INDEX($M$4:$M$27,MATCH(G286,$J$4:$J$27,0))","v":{"$error":"#N/A"}},{"$f":"INDEX($K$4:$K$27,MATCH(G286,$J$4:$J$27,0))","v":{"$error":"#N/A"}},{"$f":"INDEX(Lookup!$O$9:$O$24,MATCH('Interior Lighting'!Z286,Lookup!$K$9:$K$24,0))","v":{"$error":"#N/A"}},{"$f":"IF(E286=\"A\",INDEX(Lookup!$L$9:$L$24,MATCH(Z286,Lookup!$K$9:$K$24,0)),IF(E286=\"B\",INDEX(Lookup!$M$9:$M$24,MATCH(Z286,Lookup!$K$9:$K$24,0)),IF(E286=\"C\",INDEX(Lookup!$N$9:$N$24,MATCH(Z286,Lookup!$K$9:$K$24,0)),\"N/A\")))","v":{"$error":"#N/A"}}]
[null,null,null,null,{"$f":"INDEX(Lookup!$I$9:$I$24,MATCH('Interior Lighting'!D287,Lookup!$C$9:$C$24,0))","v":{"$error":"#N/A"}},null,null,null,{"$f":"INDEX($L$4:$L$27,MATCH(G287,$J$4:$J$27,0))","v":{"$error":"#N/A"}},null,{"$f":"IF(F287>0, F287*I287*J287, 0)","v":0},{"$f":"IF(D287=\"Exit Signs\",\"convert to kW\", K287/S287)","v":{"$error":"#DIV/0!"}},{"$f":"IF(H287=\"Yes\",IF(D287=\"Corridor/Transition\",0.75*L287,1*L287),\"N/A\")","v":"N/A"},{"$f":"IF($D$20=\"Space-By-Space (90.1-2010)\",INDEX(LPD2010SS,MATCH('Interior Lighting'!D287,LightingSpaceType,0)*W287),INDEX(LPD2010WB,MATCH('Interior Lighting'!D287,LightingSpaceType,0)))","v":{"$error":"#N/A"}},{"$f":"IF(D287=\"Exit Signs\", 5*F287*J287, IF(B287>0, N287*S287, 0))","v":0},{"$error":"#N/A"},{"$f":"IF(D287=\"Exit Signs\",\"NA\", K287*P287/S287)","v":{"$error":"#N/A"}},{"$error":"#N/A"},0,"",null,null,1,null,{"$error":"#N/A"},{"$error":"#N/A"},{"$f":"INDEX(Lookup!$O$9:$O$24,MATCH('Interior Lighting'!Z287,Lookup!$K$9:$K$24,0))","v":{"$error":"#N/A"}},{"$f":"IF(E287=\"A\",INDEX(Lookup!$L$9:$L$24,MATCH(Z287,Lookup!$K$9:$K$24,0)),IF(E287=\"B\",INDEX(Lookup!$M$9:$M$24,MATCH(Z287,Lookup!$K$9:$K$24,0)),IF(E287=\"C\",INDEX(Lookup!$N$9:$N$24,MATCH(Z287,Lookup!$K$9:$K$24,0)),\"N/A\")))","v":{"$error":"#N/A"}}]
[null,null,null,null,{"$f":"INDEX(Lookup!$I$9:$I$24,MATCH('Interior Lighting'!D288,Lookup!$C$9:$C$24,0))","v":{"$error":"#N/A"}},null,null,null,{"$error":"#N/A"},null,0,{"$error":"#DIV/0!"},"N/A",{"$f":"IF($D$20=\"Space-By-Space (90.1-2010)\",INDEX(LPD2010SS,MATCH('Interior Lighting'!D288,LightingSpaceType,0)*W288),INDEX(LPD2010WB,MATCH('Interior Lighting'!D288,LightingSpaceType,0)))","v":{"$error":"#N/A"}},0,{"$error":"#N/A"},{"$error":"#N/A"},{"$error":"#N/A"},0,"",null,null,1,null,{"$error":"#N/A"},{"$error":"#N/A"},{"$f":"INDEX(Lookup!$O$9:$O$24,MATCH('Interior Lighting'!Z288,Lookup!$K$9:$K$24,0))","v":{"$error":"#N/A"}},{"$f":"IF(E288=\"A\",INDEX(Lookup!$L$9:$L$24,MATCH(Z288,Lookup!$K$9:$K$24,0)),IF(E288=\"B\",INDEX(Lookup!$M$9:$M$24,MATCH(Z288,Lookup!$K$9:$K$24,0)),IF(E288=\"C\",INDEX(Lookup!$N$9:$N$24,MATCH(Z288,Lookup!$K$9:$K$24,0)),\"N/A\")))","v":{"$error":"#N/A"}}]
[null,null,null,null,{"$f":"INDEX(Lookup!$I$9:$I$24,MATCH('Interior Lighting'!D289,Lookup!$C$9:$C$24,0))","v":{"$error":"#N/A"}},null,null,null,{"$error":"#N/A"},null,0,{"$error":"#DIV/0!"},"N/A",{"$f":"IF($D$20=\"Space-By-Space (90.1-2010)\",INDEX(LPD2010SS,MATCH('Interior Lighting'!D289,LightingSpaceType,0)*W289),INDEX(LPD2010WB,MATCH('Interior Lighting'!D289,LightingSpaceType,0)))","v":{"$error":"#N/A"}},0,{"$error":"#N/A"},{"$error":"#N/A"},{"$error":"#N/A"},0,"",null,null,1,null,{"$error":"#N/A"},{"$error":"#N/A"},{"$f":"INDEX(Lookup!$O$9:$O$24,MATCH('Interior Lighting'!Z289,Lookup!$K$9:$K$24,0))","v":{"$error":"#N/A"}},{"$f":"IF(E289=\"A\",INDEX(Lookup!$L$9:$L$24,MATCH(Z289,Lookup!$K$9:$K$24,0)),IF(E289=\"B\",INDEX(Lookup!$M$9:$M$24,MATCH(Z289,Lookup!$K$9:$K$24,0)),IF(E289=\"C\",INDEX(Lookup!$N$9:$N$24,MATCH(Z289,Lookup!$K$9:$K$24,0)),\"N/A\")))","v":{"$error":"#N/A"}}]
[null,null,null,null,{"$f":"INDEX(Lookup!$I$9:$I$24,MATCH('Interior Lighting'!D290,Lookup!$C$9:$C$24,0))","v":{"$error":"#N/A"}},null,null,null,{"$error":"#N/A"},null,0,{"$error":"#DIV/0!"},"N/A",{"$f":"IF($D$20=\"Space-By-Space (90.1-2010)\",INDEX(LPD2010SS,MATCH('Interior Lighting'!D290,LightingSpaceType,0)*W290),INDEX(LPD2010WB,MATCH('Interior Lighting'!D290,LightingSpaceType,0)))","v":{"$error":"#N/A"}},0,{"$error":"#N/A"},{"$error":"#N/A"},{"$error":"#N/A"},0,"",null,null,1,null,{"$error":"#N/A"},{"$error":"#N/A"},{"$f":"INDEX(Lookup!$O$9:$O$24,MATCH('Interior Lighting'!Z290,Lookup!$K$9:$K$24,0))","v":{"$error":"#N/A"}},{"$f":"IF(E290=\"A\",INDEX(Lookup!$L$9:$L$24,MATCH(Z290,Lookup!$K$9:$K$24,0)),IF(E290=\"B\",INDEX(Lookup!$M$9:$M$24,MATCH(Z290,Lookup!$K$9:$K$24,0)),IF(E290=\"C\",INDEX(Lookup!$N$9:$N$24,MATCH(Z290,Lookup!$K$9:$K$24,0)),\"N/A\")))","v":{"$error":"#N/A"}}]
[null,null,null,null,{"$f":"INDEX(Lookup!$I$9:$I$24,MATCH('Interior Lighting'!D291,Lookup!$C$9:$C$24,0))","v":{"$error":"#N/A"}},null,null,null,{"$error":"#N/A"},null,0,{"$error":"#DIV/0!"},"N/A",{"$f":"IF($D$20=\"Space-By-Space (90.1-2010)\",INDEX(LPD2010SS,MATCH('Interior Lighting'!D291,LightingSpaceType,0)*W291),INDEX(LPD2010WB,MATCH('Interior Lighting'!D291,LightingSpaceType,0)))","v":{"$error":"#N/A"}},0,{"$error":"#N/A"},{"$error":"#N/A"},{"$error":"#N/A"},0,"",null,null,1,null,{"$error":"#N/A"},{"$error":"#N/A"},{"$f":"INDEX(Lookup!$O$9:$O$24,MATCH('Interior Lighting'!Z291,Lookup!$K$9:$K$24,0))","v":{"$error":"#N/A"}},{"$f":"IF(E291=\"A\",INDEX(Lookup!$L$9:$L$24,MATCH(Z291,Lookup!$K$9:$K$24,0)),IF(E291=\"B\",INDEX(Lookup!$M$9:$M$24,MATCH(Z291,Lookup!$K$9:$K$24,0)),IF(E291=\"C\",INDEX(Lookup!$N$9:$N$24,MATCH(Z291,Lookup!$K$9:$K$24,0)),\"N/A\")))","v":{"$error":"#N/A"}}]
[null,null,null,null,{"$f":"INDEX(Lookup!$I$9:$I$24,MATCH('Interior Lighting'!D292,Lookup!$C$9:$C$24,0))","v":{"$error":"#N/A"}},null,null,null,{"$error":"#N/A"},null,0,{"$error":"#DIV/0!"},"N/A",{"$f":"IF($D$20=\"Space-By-Space (90.1-2010)\",INDEX(LPD2010SS,MATCH('Interior Lighting'!D292,LightingSpaceType,0)*W292),INDEX(LPD2010WB,MATCH('Interior Lighting'!D292,LightingSpaceType,0)))","v":{"$error":"#N/A"}},0,{"$error":"#N/A"},{"$error":"#N/A"},{"$error":"#N/A"},0,"",null,null,1,null,{"$error":"#N/A"},{"$error":"#N/A"},{"$f":"INDEX(Lookup!$O$9:$O$24,MATCH('Interior Lighting'!Z292,Lookup!$K$9:$K$24,0))","v":{"$error":"#N/A"}},{"$f":"IF(E292=\"A\",INDEX(Lookup!$L$9:$L$24,MATCH(Z292,Lookup!$K$9:$K$24,0)),IF(E292=\"B\",INDEX(Lookup!$M$9:$M$24,MATCH(Z292,Lookup!$K$9:$K$24,0)),IF(E292=\"C\",INDEX(Lookup!$N$9:$N$24,MATCH(Z292,Lookup!$K$9:$K$24,0)),\"N/A\")))","v":{"$error":"#N/A"}}]
[null,null,null,null,{"$f":"INDEX(Lookup!$I$9:$I$24,MATCH('Interior Lighting'!D293,Lookup!$C$9:$C$24,0))","v":{"$error":"#N/A"}},null,null,null,{"$error":"#N/A"},null,0,{"$error":"#DIV/0!"},"N/A",{"$f":"IF($D$20=\"Space-By-Space (90.1-2010)\",INDEX(LPD2010SS,MATCH('Interior Lighting'!D293,LightingSpaceType,0)*W293),INDEX(LPD2010WB,MATCH('Interior Lighting'!D293,LightingSpaceType,0)))","v":{"$error":"#N/A"}},0,{"$error":"#N/A"},{"$error":"#N/A"},{"$error":"#N/A"},0,"",null,null,1,null,{"$error":"#N/A"},{"$error":"#N/A"},{"$f":"INDEX(Lookup!$O$9:$O$24,MATCH('Interior Lighting'!Z293,Lookup!$K$9:$K$24,0))","v":{"$error":"#N/A"}},{"$f":"IF(E293=\"A\",INDEX(Lookup!$L$9:$L$24,MATCH(Z293,Lookup!$K$9:$K$24,0)),IF(E293=\"B\",INDEX(Lookup!$M$9:$M$24,MATCH(Z293,Lookup!$K$9:$K$24,0)),IF(E293=\"C\",INDEX(Lookup!$N$9:$N$24,MATCH(Z293,Lookup!$K$9:$K$24,0)),\"N/A\")))","v":{"$error":"#N/A"}}]
[null,null,null,null,{"$f":"INDEX(Lookup!$I$9:$I$24,MATCH('Interior Lighting'!D294,Lookup!$C$9:$C$24,0))","v":{"$error":"#N/A"}},null,null,null,{"$error":"#N/A"},null,0,{"$error":"#DIV/0!"},"N/A",{"$f":"IF($D$20=\"Space-By-Space (90.1-2010)\",INDEX(LPD2010SS,MATCH('Interior Lighting'!D294,LightingSpaceType,0)*W294),INDEX(LPD2010WB,MATCH('Interior Lighting'!D294,LightingSpaceType,0)))","v":{"$error":"#N/A"}},0,{"$error":"#N/A"},{"$error":"#N/A"},{"$error":"#N/A"},0,"",null,null,1,null,{"$error":"#N/A"},{"$error":"#N/A"},{"$f":"INDEX(Lookup!$O$9:$O$24,MATCH('Interior Lighting'!Z294,Lookup!$K$9:$K$24,0))","v":{"$error":"#N/A"}},{"$f":"IF(E294=\"A\",INDEX(Lookup!$L$9:$L$24,MATCH(Z294,Lookup!$K$9:$K$24,0)),IF(E294=\"B\",INDEX(Lookup!$M$9:$M$24,MATCH(Z294,Lookup!$K$9:$K$24,0)),IF(E294=\"C\",INDEX(Lookup!$N$9:$N$24,MATCH(Z294,Lookup!$K$9:$K$24,0)),\"N/A\")))","v":{"$error":"#N/A"}}]
[null,null,null,null,{"$f":"INDEX(Lookup!$I$9:$I$24,MATCH('Interior Lighting'!D295,Lookup!$C$9:$C$24,0))","v":{"$error":"#N/A"}},null,null,null,{"$error":"#N/A"},null,0,{"$error":"#DIV/0!"},"N/A",{"$f":"IF($D$20=\"Space-By-Space (90.1-2010)\",INDEX(LPD2010SS,MATCH('Interior Lighting'!D295,LightingSpaceType,0)*W295),INDEX(LPD2010WB,MATCH('Interior Lighting'!D295,LightingSpaceType,0)))","v":{"$error":"#N/A"}},0,{"$error":"#N/A"},{"$error":"#N/A"},{"$error":"#N/A"},0,"",null,null,1,null,{"$error":"#N/A"},{"$error":"#N/A"},{"$f":"INDEX(Lookup!$O$9:$O$24,MATCH('Interior Lighting'!Z295,Lookup!$K$9:$K$24,0))","v":{"$error":"#N/A"}},{"$f":"IF(E295=\"A\",INDEX(Lookup!$L$9:$L$24,MATCH(Z295,Lookup!$K$9:$K$24,0)),IF(E295=\"B\",INDEX(Lookup!$M$9:$M$24,MATCH(Z295,Lookup!$K$9:$K$24,0)),IF(E295=\"C\",INDEX(Lookup!$N$9:$N$24,MATCH(Z295,Lookup!$K$9:$K$24,0)),\"N/A\")))","v":{"$error":"#N/A"}}]
[null,null,null,null,{"$f":"INDEX(Lookup!$I$9:$I$24,MATCH('Interior Lighting'!D296,Lookup!$C$9:$C$24,0))","v":{"$error":"#N/A"}},null,null,null,{"$error":"#N/A"},null,0,{"$error":"#DIV/0!"},"N/A",{"$f":"IF($D$20=\"Space-By-Space (90.1-2010)\",INDEX(LPD2010SS,MATCH('Interior Lighting'!D296,LightingSpaceType,0)*W296),INDEX(LPD2010WB,MATCH('Interior Lighting'!D296,LightingSpaceType,0)))","v":{"$error":"#N/A"}},0,{"$error":"#N/A"},{"$error":"#N/A"},{"$error":"#N/A"},0,"",null,null,1,null,{"$error":"#N/A"},{"$error":"#N/A"},{"$f":"INDEX(Lookup!$O$9:$O$24,MATCH('Interior Lighting'!Z296,Lookup!$K$9:$K$24,0))","v":{"$error":"#N/A"}},{"$f":"IF(E296=\"A\",INDEX(Lookup!$L$9:$L$24,MATCH(Z296,Lookup!$K$9:$K$24,0)),IF(E296=\"B\",INDEX(Lookup!$M$9:$M$24,MATCH(Z296,Lookup!$K$9:$K$24,0)),IF(E296=\"C\",INDEX(Lookup!$N$9:$N$24,MATCH(Z296,Lookup!$K$9:$K$24,0)),\"N/A\")))","v":{"$error":"#N/A"}}]
[null,null,null,null,{"$f":"INDEX(Lookup!$I$9:$I$24,MATCH('Interior Lighting'!D297,Lookup!$C$9:$C$24,0))","v":{"$error":"#N/A"}},null,null,null,{"$error":"#N/A"},null,0,{"$error":"#DIV/0!"},"N/A",{"$f":"IF($D$20=\"Space-By-Space (90.1-2010)\",INDEX(LPD2010SS,MATCH('Interior Lighting'!D297,LightingSpaceType,0)*W297),INDEX(LPD2010WB,MATCH('Interior Lighting'!D297,LightingSpaceType,0)))","v":{"$error":"#N/A"}},0,{"$error":"#N/A"},{"$error":"#N/A"},{"$error":"#N/A"},0,"",null,null,1,null,{"$error":"#N/A"},{"$error":"#N/A"},{"$f":"INDEX(Lookup!$O$9:$O$24,MATCH('Interior Lighting'!Z297,Lookup!$K$9:$K$24,0))","v":{"$error":"#N/A"}},{"$f":"IF(E297=\"A\",INDEX(Lookup!$L$9:$L$24,MATCH(Z297,Lookup!$K$9:$K$24,0)),IF(E297=\"B\",INDEX(Lookup!$M$9:$M$24,MATCH(Z297,Lookup!$K$9:$K$24,0)),IF(E297=\"C\",INDEX(Lookup!$N$9:$N$24,MATCH(Z297,Lookup!$K$9:$K$24,0)),\"N/A\")))","v":{"$error":"#N/A"}}]
[null,null,null,null,{"$f":"INDEX(Lookup!$I$9:$I$24,MATCH('Interior Lighting'!D298,Lookup!$C$9:$C$24,0))","v":{"$error":"#N/A"}},null,null,null,{"$error":"#N/A"},null,0,{"$error":"#DIV/0!"},"N/A",{"$f":"IF($D$20=\"Space-By-Space (90.1-2010)\",INDEX(LPD2010SS,MATCH('Interior Lighting'!D298,LightingSpaceType,0)*W298),INDEX(LPD2010WB,MATCH('Interior Lighting'!D298,LightingSpaceType,0)))","v":{"$error":"#N/A"}},0,{"$error":"#N/A"},{"$error":"#N/A"},{"$error":"#N/A"},0,"",null,null,1,null,{"$error":"#N/A"},{"$error":"#N/A"},{"$f":"INDEX(Lookup!$O$9:$O$24,MATCH('Interior Lighting'!Z298,Lookup!$K$9:$K$24,0))","v":{"$error":"#N/A"}},{"$f":"IF(E298=\"A\",INDEX(Lookup!$L$9:$L$24,MATCH(Z298,Lookup!$K$9:$K$24,0)),IF(E298=\"B\",INDEX(Lookup!$M$9:$M$24,MATCH(Z298,Lookup!$K$9:$K$24,0)),IF(E298=\"C\",INDEX(Lookup!$N$9:$N$24,MATCH(Z298,Lookup!$K$9:$K$24,0)),\"N/A\")))","v":{"$error":"#N/A"}}]
[null,null,null,null,{"$f":"INDEX(Lookup!$I$9:$I$24,MATCH('Interior Lighting'!D299,Lookup!$C$9:$C$24,0))","v":{"$error":"#N/A"}},null,null,null,{"$error":"#N/A"},null,0,{"$error":"#DIV/0!"},"N/A",{"$f":"IF($D$20=\"Space-By-Space (90.1-2010)\",INDEX(LPD2010SS,MATCH('Interior Lighting'!D299,LightingSpaceType,0)*W299),INDEX(LPD2010WB,MATCH('Interior Lighting'!D299,LightingSpaceType,0)))","v":{"$error":"#N/A"}},0,{"$error":"#N/A"},{"$error":"#N/A"},{"$error":"#N/A"},0,"",null,null,1,null,{"$error":"#N/A"},{"$error":"#N/A"},{"$f":"INDEX(Lookup!$O$9:$O$24,MATCH('Interior Lighting'!Z299,Lookup!$K$9:$K$24,0))","v":{"$error":"#N/A"}},{"$f":"IF(E299=\"A\",INDEX(Lookup!$L$9:$L$24,MATCH(Z299,Lookup!$K$9:$K$24,0)),IF(E299=\"B\",INDEX(Lookup!$M$9:$M$24,MATCH(Z299,Lookup!$K$9:$K$24,0)),IF(E299=\"C\",INDEX(Lookup!$N$9:$N$24,MATCH(Z299,Lookup!$K$9:$K$24,0)),\"N/A\")))","v":{"$error":"#N/A"}}]
[null,null,null,null,{"$f":"INDEX(Lookup!$I$9:$I$24,MATCH('Interior Lighting'!D300,Lookup!$C$9:$C$24,0))","v":{"$error":"#N/A"}},null,null,null,{"$error":"#N/A"},null,0,{"$error":"#DIV/0!"},"N/A",{"$f":"IF($D$20=\"Space-By-Space (90.1-2010)\",INDEX(LPD2010SS,MATCH('Interior Lighting'!D300,LightingSpaceType,0)*W300),INDEX(LPD2010WB,MATCH('Interior Lighting'!D300,LightingSpaceType,0)))","v":{"$error":"#N/A"}},0,{"$error":"#N/A"},{"$error":"#N/A"},{"$error":"#N/A"},0,"",null,null,1,null,{"$error":"#N/A"},{"$error":"#N/A"},{"$f":"INDEX(Lookup!$O$9:$O$24,MATCH('Interior Lighting'!Z300,Lookup!$K$9:$K$24,0))","v":{"$error":"#N/A"}},{"$f":"IF(E300=\"A\",INDEX(Lookup!$L$9:$L$24,MATCH(Z300,Lookup!$K$9:$K$24,0)),IF(E300=\"B\",INDEX(Lookup!$M$9:$M$24,MATCH(Z300,Lookup!$K$9:$K$24,0)),IF(E300=\"C\",INDEX(Lookup!$N$9:$N$24,MATCH(Z300,Lookup!$K$9:$K$24,0)),\"N/A\")))","v":{"$error":"#N/A"}}]
[null,null,null,null,{"$f":"INDEX(Lookup!$I$9:$I$24,MATCH('Interior Lighting'!D301,Lookup!$C$9:$C$24,0))","v":{"$error":"#N/A"}},null,null,null,{"$error":"#N/A"},null,0,{"$error":"#DIV/0!"},"N/A",{"$f":"IF($D$20=\"Space-By-Space (90.1-2010)\",INDEX(LPD2010SS,MATCH('Interior Lighting'!D301,LightingSpaceType,0)*W301),INDEX(LPD2010WB,MATCH('Interior Lighting'!D301,LightingSpaceType,0)))","v":{"$error":"#N/A"}},0,{"$error":"#N/A"},{"$error":"#N/A"},{"$error":"#N/A"},0,"",null,null,1,null,{"$error":"#N/A"},{"$error":"#N/A"},{"$f":"INDEX(Lookup!$O$9:$O$24,MATCH('Interior Lighting'!Z301,Lookup!$K$9:$K$24,0))","v":{"$error":"#N/A"}},{"$f":"IF(E301=\"A\",INDEX(Lookup!$L$9:$L$24,MATCH(Z301,Lookup!$K$9:$K$24,0)),IF(E301=\"B\",INDEX(Lookup!$M$9:$M$24,MATCH(Z301,Lookup!$K$9:$K$24,0)),IF(E301=\"C\",INDEX(Lookup!$N$9:$N$24,MATCH(Z301,Lookup!$K$9:$K$24,0)),\"N/A\")))","v":{"$error":"#N/A"}}]
[null,null,null,null,{"$f":"INDEX(Lookup!$I$9:$I$24,MATCH('Interior Lighting'!D302,Lookup!$C$9:$C$24,0))","v":{"$error":"#N/A"}},null,null,null,{"$error":"#N/A"},null,0,{"$error":"#DIV/0!"},"N/A",{"$f":"IF($D$20=\"Space-By-Space (90.1-2010)\",INDEX(LPD2010SS,MATCH('Interior Lighting'!D302,LightingSpaceType,0)*W302),INDEX(LPD2010WB,MATCH('Interior Lighting'!D302,LightingSpaceType,0)))","v":{"$error":"#N/A"}},0,{"$error":"#N/A"},{"$error":"#N/A"},{"$error":"#N/A"},0,"",null,null,1,null,{"$error":"#N/A"},{"$error":"#N/A"},{"$f":"INDEX(Lookup!$O$9:$O$24,MATCH('Interior Lighting'!Z302,Lookup!$K$9:$K$24,0))","v":{"$error":"#N/A"}},{"$f":"IF(E302=\"A\",INDEX(Lookup!$L$9:$L$24,MATCH(Z302,Lookup!$K$9:$K$24,0)),IF(E302=\"B\",INDEX(Lookup!$M$9:$M$24,MATCH(Z302,Lookup!$K$9:$K$24,0)),IF(E302=\"C\",INDEX(Lookup!$N$9:$N$24,MATCH(Z302,Lookup!$K$9:$K$24,0)),\"N/A\")))","v":{"$error":"#N/A"}}]
[null,null,null,null,{"$f":"INDEX(Lookup!$I$9:$I$24,MATCH('Interior Lighting'!D303,Lookup!$C$9:$C$24,0))","v":{"$error":"#N/A"}},null,null,null,{"$error":"#N/A"},null,0,{"$error":"#DIV/0!"},"N/A",{"$f":"IF($D$20=\"Space-By-Space (90.1-2010)\",INDEX(LPD2010SS,MATCH('Interior Lighting'!D303,LightingSpaceType,0)*W303),INDEX(LPD2010WB,MATCH('Interior Lighting'!D303,LightingSpaceType,0)))","v":{"$error":"#N/A"}},0,{"$error":"#N/A"},{"$error":"#N/A"},{"$error":"#N/A"},0,"",null,null,1,null,{"$error":"#N/A"},{"$error":"#N/A"},{"$f":"INDEX(Lookup!$O$9:$O$24,MATCH('Interior Lighting'!Z303,Lookup!$K$9:$K$24,0))","v":{"$error":"#N/A"}},{"$f":"IF(E303=\"A\",INDEX(Lookup!$L$9:$L$24,MATCH(Z303,Lookup!$K$9:$K$24,0)),IF(E303=\"B\",INDEX(Lookup!$M$9:$M$24,MATCH(Z303,Lookup!$K$9:$K$24,0)),IF(E303=\"C\",INDEX(Lookup!$N$9:$N$24,MATCH(Z303,Lookup!$K$9:$K$24,0)),\"N/A\")))","v":{"$error":"#N/A"}}]
[null,null,null,null,{"$f":"INDEX(Lookup!$I$9:$I$24,MATCH('Interior Lighting'!D304,Lookup!$C$9:$C$24,0))","v":{"$error":"#N/A"}},null,null,null,{"$error":"#N/A"},null,0,{"$error":"#DIV/0!"},"N/A",{"$f":"IF($D$20=\"Space-By-Space (90.1-2010)\",INDEX(LPD2010SS,MATCH('Interior Lighting'!D304,LightingSpaceType,0)*W304),INDEX(LPD2010WB,MATCH('Interior Lighting'!D304,LightingSpaceType,0)))","v":{"$error":"#N/A"}},0,{"$error":"#N/A"},{"$error":"#N/A"},{"$error":"#N/A"},0,"",null,null,1,null,{"$error":"#N/A"},{"$error":"#N/A"},{"$f":"INDEX(Lookup!$O$9:$O$24,MATCH('Interior Lighting'!Z304,Lookup!$K$9:$K$24,0))","v":{"$error":"#N/A"}},{"$f":"IF(E304=\"A\",INDEX(Lookup!$L$9:$L$24,MATCH(Z304,Lookup!$K$9:$K$24,0)),IF(E304=\"B\",INDEX(Lookup!$M$9:$M$24,MATCH(Z304,Lookup!$K$9:$K$24,0)),IF(E304=\"C\",INDEX(Lookup!$N$9:$N$24,MATCH(Z304,Lookup!$K$9:$K$24,0)),\"N/A\")))","v":{"$error":"#N/A"}}]
[null,null,null,null,{"$f":"INDEX(Lookup!$I$9:$I$24,MATCH('Interior Lighting'!D305,Lookup!$C$9:$C$24,0))","v":{"$error":"#N/A"}},null,null,null,{"$error":"#N/A"},null,0,{"$error":"#DIV/0!"},"N/A",{"$f":"IF($D$20=\"Space-By-Space (90.1-2010)\",INDEX(LPD2010SS,MATCH('Interior Lighting'!D305,LightingSpaceType,0)*W305),INDEX(LPD2010WB,MATCH('Interior Lighting'!D305,LightingSpaceType,0)))","v":{"$error":"#N/A"}},0,{"$error":"#N/A"},{"$error":"#N/A"},{"$error":"#N/A"},0,"",null,null,1,null,{"$error":"#N/A"},{"$error":"#N/A"},{"$f":"INDEX(Lookup!$O$9:$O$24,MATCH('Interior Lighting'!Z305,Lookup!$K$9:$K$24,0))","v":{"$error":"#N/A"}},{"$f":"IF(E305=\"A\",INDEX(Lookup!$L$9:$L$24,MATCH(Z305,Lookup!$K$9:$K$24,0)),IF(E305=\"B\",INDEX(Lookup!$M$9:$M$24,MATCH(Z305,Lookup!$K$9:$K$24,0)),IF(E305=\"C\",INDEX(Lookup!$N$9:$N$24,MATCH(Z305,Lookup!$K$9:$K$24,0)),\"N/A\")))","v":{"$error":"#N/A"}}]
[null,null,null,null,{"$f":"INDEX(Lookup!$I$9:$I$24,MATCH('Interior Lighting'!D306,Lookup!$C$9:$C$24,0))","v":{"$error":"#N/A"}},null,null,null,{"$error":"#N/A"},null,0,{"$error":"#DIV/0!"},"N/A",{"$f":"IF($D$20=\"Space-By-Space (90.1-2010)\",INDEX(LPD2010SS,MATCH('Interior Lighting'!D306,LightingSpaceType,0)*W306),INDEX(LPD2010WB,MATCH('Interior Lighting'!D306,LightingSpaceType,0)))","v":{"$error":"#N/A"}},0,{"$error":"#N/A"},{"$error":"#N/A"},{"$error":"#N/A"},0,"",null,null,1,null,{"$error":"#N/A"},{"$error":"#N/A"},{"$f":"INDEX(Lookup!$O$9:$O$24,MATCH('Interior Lighting'!Z306,Lookup!$K$9:$K$24,0))","v":{"$error":"#N/A"}},{"$f":"IF(E306=\"A\",INDEX(Lookup!$L$9:$L$24,MATCH(Z306,Lookup!$K$9:$K$24,0)),IF(E306=\"B\",INDEX(Lookup!$M$9:$M$24,MATCH(Z306,Lookup!$K$9:$K$24,0)),IF(E306=\"C\",INDEX(Lookup!$N$9:$N$24,MATCH(Z306,Lookup!$K$9:$K$24,0)),\"N/A\")))","v":{"$error":"#N/A"}}]
[null,null,null,null,{"$f":"INDEX(Lookup!$I$9:$I$24,MATCH('Interior Lighting'!D307,Lookup!$C$9:$C$24,0))","v":{"$error":"#N/A"}},null,null,null,{"$error":"#N/A"},null,0,{"$error":"#DIV/0!"},"N/A",{"$f":"IF($D$20=\"Space-By-Space (90.1-2010)\",INDEX(LPD2010SS,MATCH('Interior Lighting'!D307,LightingSpaceType,0)*W307),INDEX(LPD2010WB,MATCH('Interior Lighting'!D307,LightingSpaceType,0)))","v":{"$error":"#N/A"}},0,{"$error":"#N/A"},{"$error":"#N/A"},{"$error":"#N/A"},0,"",null,null,1,null,{"$error":"#N/A"},{"$error":"#N/A"},{"$f":"INDEX(Lookup!$O$9:$O$24,MATCH('Interior Lighting'!Z307,Lookup!$K$9:$K$24,0))","v":{"$error":"#N/A"}},{"$f":"IF(E307=\"A\",INDEX(Lookup!$L$9:$L$24,MATCH(Z307,Lookup!$K$9:$K$24,0)),IF(E307=\"B\",INDEX(Lookup!$M$9:$M$24,MATCH(Z307,Lookup!$K$9:$K$24,0)),IF(E307=\"C\",INDEX(Lookup!$N$9:$N$24,MATCH(Z307,Lookup!$K$9:$K$24,0)),\"N/A\")))","v":{"$error":"#N/A"}}]
[null,null,null,null,{"$f":"INDEX(Lookup!$I$9:$I$24,MATCH('Interior Lighting'!D308,Lookup!$C$9:$C$24,0))","v":{"$error":"#N/A"}},null,null,null,{"$error":"#N/A"},null,0,{"$error":"#DIV/0!"},"N/A",{"$f":"IF($D$20=\"Space-By-Space (90.1-2010)\",INDEX(LPD2010SS,MATCH('Interior Lighting'!D308,LightingSpaceType,0)*W308),INDEX(LPD2010WB,MATCH('Interior Lighting'!D308,LightingSpaceType,0)))","v":{"$error":"#N/A"}},0,{"$error":"#N/A"},{"$error":"#N/A"},{"$error":"#N/A"},0,"",null,null,1,null,{"$error":"#N/A"},{"$error":"#N/A"},{"$f":"INDEX(Lookup!$O$9:$O$24,MATCH('Interior Lighting'!Z308,Lookup!$K$9:$K$24,0))","v":{"$error":"#N/A"}},{"$f":"IF(E308=\"A\",INDEX(Lookup!$L$9:$L$24,MATCH(Z308,Lookup!$K$9:$K$24,0)),IF(E308=\"B\",INDEX(Lookup!$M$9:$M$24,MATCH(Z308,Lookup!$K$9:$K$24,0)),IF(E308=\"C\",INDEX(Lookup!$N$9:$N$24,MATCH(Z308,Lookup!$K$9:$K$24,0)),\"N/A\")))","v":{"$error":"#N/A"}}]
[null,null,null,null,{"$f":"INDEX(Lookup!$I$9:$I$24,MATCH('Interior Lighting'!D309,Lookup!$C$9:$C$24,0))","v":{"$error":"#N/A"}},null,null,null,{"$error":"#N/A"},null,0,{"$error":"#DIV/0!"},"N/A",{"$f":"IF($D$20=\"Space-By-Space (90.1-2010)\",INDEX(LPD2010SS,MATCH('Interior Lighting'!D309,LightingSpaceType,0)*W309),INDEX(LPD2010WB,MATCH('Interior Lighting'!D309,LightingSpaceType,0)))","v":{"$error":"#N/A"}},0,{"$error":"#N/A"},{"$error":"#N/A"},{"$error":"#N/A"},0,"",null,null,1,null,{"$error":"#N/A"},{"$error":"#N/A"},{"$f":"INDEX(Lookup!$O$9:$O$24,MATCH('Interior Lighting'!Z309,Lookup!$K$9:$K$24,0))","v":{"$error":"#N/A"}},{"$f":"IF(E309=\"A\",INDEX(Lookup!$L$9:$L$24,MATCH(Z309,Lookup!$K$9:$K$24,0)),IF(E309=\"B\",INDEX(Lookup!$M$9:$M$24,MATCH(Z309,Lookup!$K$9:$K$24,0)),IF(E309=\"C\",INDEX(Lookup!$N$9:$N$24,MATCH(Z309,Lookup!$K$9:$K$24,0)),\"N/A\")))","v":{"$error":"#N/A"}}]
[null,null,null,null,{"$f":"INDEX(Lookup!$I$9:$I$24,MATCH('Interior Lighting'!D310,Lookup!$C$9:$C$24,0))","v":{"$error":"#N/A"}},null,null,null,{"$error":"#N/A"},null,0,{"$error":"#DIV/0!"},"N/A",{"$f":"IF($D$20=\"Space-By-Space (90.1-2010)\",INDEX(LPD2010SS,MATCH('Interior Lighting'!D310,LightingSpaceType,0)*W310),INDEX(LPD2010WB,MATCH('Interior Lighting'!D310,LightingSpaceType,0)))","v":{"$error":"#N/A"}},0,{"$error":"#N/A"},{"$error":"#N/A"},{"$error":"#N/A"},0,"",null,null,1,null,{"$error":"#N/A"},{"$error":"#N/A"},{"$f":"INDEX(Lookup!$O$9:$O$24,MATCH('Interior Lighting'!Z310,Lookup!$K$9:$K$24,0))","v":{"$error":"#N/A"}},{"$f":"IF(E310=\"A\",INDEX(Lookup!$L$9:$L$24,MATCH(Z310,Lookup!$K$9:$K$24,0)),IF(E310=\"B\",INDEX(Lookup!$M$9:$M$24,MATCH(Z310,Lookup!$K$9:$K$24,0)),IF(E310=\"C\",INDEX(Lookup!$N$9:$N$24,MATCH(Z310,Lookup!$K$9:$K$24,0)),\"N/A\")))","v":{"$error":"#N/A"}}]
[null,null,null,null,{"$f":"INDEX(Lookup!$I$9:$I$24,MATCH('Interior Lighting'!D311,Lookup!$C$9:$C$24,0))","v":{"$error":"#N/A"}},null,null,null,{"$error":"#N/A"},null,0,{"$error":"#DIV/0!"},"N/A",{"$f":"IF($D$20=\"Space-By-Space (90.1-2010)\",INDEX(LPD2010SS,MATCH('Interior Lighting'!D311,LightingSpaceType,0)*W311),INDEX(LPD2010WB,MATCH('Interior Lighting'!D311,LightingSpaceType,0)))","v":{"$error":"#N/A"}},0,{"$error":"#N/A"},{"$error":"#N/A"},{"$error":"#N/A"},0,"",null,null,1,null,{"$error":"#N/A"},{"$error":"#N/A"},{"$f":"INDEX(Lookup!$O$9:$O$24,MATCH('Interior Lighting'!Z311,Lookup!$K$9:$K$24,0))","v":{"$error":"#N/A"}},{"$f":"IF(E311=\"A\",INDEX(Lookup!$L$9:$L$24,MATCH(Z311,Lookup!$K$9:$K$24,0)),IF(E311=\"B\",INDEX(Lookup!$M$9:$M$24,MATCH(Z311,Lookup!$K$9:$K$24,0)),IF(E311=\"C\",INDEX(Lookup!$N$9:$N$24,MATCH(Z311,Lookup!$K$9:$K$24,0)),\"N/A\")))","v":{"$error":"#N/A"}}]
[null,null,null,null,{"$f":"INDEX(Lookup!$I$9:$I$24,MATCH('Interior Lighting'!D312,Lookup!$C$9:$C$24,0))","v":{"$error":"#N/A"}},null,null,null,{"$error":"#N/A"},null,0,{"$error":"#DIV/0!"},"N/A",{"$f":"IF($D$20=\"Space-By-Space (90.1-2010)\",INDEX(LPD2010SS,MATCH('Interior Lighting'!D312,LightingSpaceType,0)*W312),INDEX(LPD2010WB,MATCH('Interior Lighting'!D312,LightingSpaceType,0)))","v":{"$error":"#N/A"}},0,{"$error":"#N/A"},{"$error":"#N/A"},{"$error":"#N/A"},0,"",null,null,1,null,{"$error":"#N/A"},{"$error":"#N/A"},{"$f":"INDEX(Lookup!$O$9:$O$24,MATCH('Interior Lighting'!Z312,Lookup!$K$9:$K$24,0))","v":{"$error":"#N/A"}},{"$f":"IF(E312=\"A\",INDEX(Lookup!$L$9:$L$24,MATCH(Z312,Lookup!$K$9:$K$24,0)),IF(E312=\"B\",INDEX(Lookup!$M$9:$M$24,MATCH(Z312,Lookup!$K$9:$K$24,0)),IF(E312=\"C\",INDEX(Lookup!$N$9:$N$24,MATCH(Z312,Lookup!$K$9:$K$24,0)),\"N/A\")))","v":{"$error":"#N/A"}}]
[null,null,null,null,{"$f":"INDEX(Lookup!$I$9:$I$24,MATCH('Interior Lighting'!D313,Lookup!$C$9:$C$24,0))","v":{"$error":"#N/A"}},null,null,null,{"$error":"#N/A"},null,0,{"$error":"#DIV/0!"},"N/A",{"$f":"IF($D$20=\"Space-By-Space (90.1-2010)\",INDEX(LPD2010SS,MATCH('Interior Lighting'!D313,LightingSpaceType,0)*W313),INDEX(LPD2010WB,MATCH('Interior Lighting'!D313,LightingSpaceType,0)))","v":{"$error":"#N/A"}},0,{"$error":"#N/A"},{"$error":"#N/A"},{"$error":"#N/A"},0,"",null,null,1,null,{"$error":"#N/A"},{"$error":"#N/A"},{"$f":"INDEX(Lookup!$O$9:$O$24,MATCH('Interior Lighting'!Z313,Lookup!$K$9:$K$24,0))","v":{"$error":"#N/A"}},{"$f":"IF(E313=\"A\",INDEX(Lookup!$L$9:$L$24,MATCH(Z313,Lookup!$K$9:$K$24,0)),IF(E313=\"B\",INDEX(Lookup!$M$9:$M$24,MATCH(Z313,Lookup!$K$9:$K$24,0)),IF(E313=\"C\",INDEX(Lookup!$N$9:$N$24,MATCH(Z313,Lookup!$K$9:$K$24,0)),\"N/A\")))","v":{"$error":"#N/A"}}]
[null,null,null,null,{"$f":"INDEX(Lookup!$I$9:$I$24,MATCH('Interior Lighting'!D314,Lookup!$C$9:$C$24,0))","v":{"$error":"#N/A"}},null,null,null,{"$error":"#N/A"},null,0,{"$error":"#DIV/0!"},"N/A",{"$f":"IF($D$20=\"Space-By-Space (90.1-2010)\",INDEX(LPD2010SS,MATCH('Interior Lighting'!D314,LightingSpaceType,0)*W314),INDEX(LPD2010WB,MATCH('Interior Lighting'!D314,LightingSpaceType,0)))","v":{"$error":"#N/A"}},0,{"$error":"#N/A"},{"$error":"#N/A"},{"$error":"#N/A"},0,"",null,null,1,null,{"$error":"#N/A"},{"$error":"#N/A"},{"$f":"INDEX(Lookup!$O$9:$O$24,MATCH('Interior Lighting'!Z314,Lookup!$K$9:$K$24,0))","v":{"$error":"#N/A"}},{"$f":"IF(E314=\"A\",INDEX(Lookup!$L$9:$L$24,MATCH(Z314,Lookup!$K$9:$K$24,0)),IF(E314=\"B\",INDEX(Lookup!$M$9:$M$24,MATCH(Z314,Lookup!$K$9:$K$24,0)),IF(E314=\"C\",INDEX(Lookup!$N$9:$N$24,MATCH(Z314,Lookup!$K$9:$K$24,0)),\"N/A\")))","v":{"$error":"#N/A"}}]
[null,null,null,null,{"$f":"INDEX(Lookup!$I$9:$I$24,MATCH('Interior Lighting'!D315,Lookup!$C$9:$C$24,0))","v":{"$error":"#N/A"}},null,null,null,{"$error":"#N/A"},null,0,{"$error":"#DIV/0!"},"N/A",{"$f":"IF($D$20=\"Space-By-Space (90.1-2010)\",INDEX(LPD2010SS,MATCH('Interior Lighting'!D315,LightingSpaceType,0)*W315),INDEX(LPD2010WB,MATCH('Interior Lighting'!D315,LightingSpaceType,0)))","v":{"$error":"#N/A"}},0,{"$error":"#N/A"},{"$error":"#N/A"},{"$error":"#N/A"},0,"",null,null,1,null,{"$error":"#N/A"},{"$error":"#N/A"},{"$f":"INDEX(Lookup!$O$9:$O$24,MATCH('Interior Lighting'!Z315,Lookup!$K$9:$K$24,0))","v":{"$error":"#N/A"}},{"$f":"IF(E315=\"A\",INDEX(Lookup!$L$9:$L$24,MATCH(Z315,Lookup!$K$9:$K$24,0)),IF(E315=\"B\",INDEX(Lookup!$M$9:$M$24,MATCH(Z315,Lookup!$K$9:$K$24,0)),IF(E315=\"C\",INDEX(Lookup!$N$9:$N$24,MATCH(Z315,Lookup!$K$9:$K$24,0)),\"N/A\")))","v":{"$error":"#N/A"}}]
[null,null,null,null,{"$f":"INDEX(Lookup!$I$9:$I$24,MATCH('Interior Lighting'!D316,Lookup!$C$9:$C$24,0))","v":{"$error":"#N/A"}},null,null,null,{"$error":"#N/A"},null,0,{"$error":"#DIV/0!"},"N/A",{"$f":"IF($D$20=\"Space-By-Space (90.1-2010)\",INDEX(LPD2010SS,MATCH('Interior Lighting'!D316,LightingSpaceType,0)*W316),INDEX(LPD2010WB,MATCH('Interior Lighting'!D316,LightingSpaceType,0)))","v":{"$error":"#N/A"}},0,{"$error":"#N/A"},{"$error":"#N/A"},{"$error":"#N/A"},0,"",null,null,1,null,{"$error":"#N/A"},{"$error":"#N/A"},{"$f":"INDEX(Lookup!$O$9:$O$24,MATCH('Interior Lighting'!Z316,Lookup!$K$9:$K$24,0))","v":{"$error":"#N/A"}},{"$f":"IF(E316=\"A\",INDEX(Lookup!$L$9:$L$24,MATCH(Z316,Lookup!$K$9:$K$24,0)),IF(E316=\"B\",INDEX(Lookup!$M$9:$M$24,MATCH(Z316,Lookup!$K$9:$K$24,0)),IF(E316=\"C\",INDEX(Lookup!$N$9:$N$24,MATCH(Z316,Lookup!$K$9:$K$24,0)),\"N/A\")))","v":{"$error":"#N/A"}}]
[null,null,null,null,{"$f":"INDEX(Lookup!$I$9:$I$24,MATCH('Interior Lighting'!D317,Lookup!$C$9:$C$24,0))","v":{"$error":"#N/A"}},null,null,null,{"$error":"#N/A"},null,0,{"$error":"#DIV/0!"},"N/A",{"$f":"IF($D$20=\"Space-By-Space (90.1-2010)\",INDEX(LPD2010SS,MATCH('Interior Lighting'!D317,LightingSpaceType,0)*W317),INDEX(LPD2010WB,MATCH('Interior Lighting'!D317,LightingSpaceType,0)))","v":{"$error":"#N/A"}},0,{"$error":"#N/A"},{"$error":"#N/A"},{"$error":"#N/A"},0,"",null,null,1,null,{"$error":"#N/A"},{"$error":"#N/A"},{"$f":"INDEX(Lookup!$O$9:$O$24,MATCH('Interior Lighting'!Z317,Lookup!$K$9:$K$24,0))","v":{"$error":"#N/A"}},{"$f":"IF(E317=\"A\",INDEX(Lookup!$L$9:$L$24,MATCH(Z317,Lookup!$K$9:$K$24,0)),IF(E317=\"B\",INDEX(Lookup!$M$9:$M$24,MATCH(Z317,Lookup!$K$9:$K$24,0)),IF(E317=\"C\",INDEX(Lookup!$N$9:$N$24,MATCH(Z317,Lookup!$K$9:$K$24,0)),\"N/A\")))","v":{"$error":"#N/A"}}]
[null,null,null,null,{"$f":"INDEX(Lookup!$I$9:$I$24,MATCH('Interior Lighting'!D318,Lookup!$C$9:$C$24,0))","v":{"$error":"#N/A"}},null,null,null,{"$error":"#N/A"},null,0,{"$error":"#DIV/0!"},"N/A",{"$f":"IF($D$20=\"Space-By-Space (90.1-2010)\",INDEX(LPD2010SS,MATCH('Interior Lighting'!D318,LightingSpaceType,0)*W318),INDEX(LPD2010WB,MATCH('Interior Lighting'!D318,LightingSpaceType,0)))","v":{"$error":"#N/A"}},0,{"$error":"#N/A"},{"$error":"#N/A"},{"$error":"#N/A"},0,"",null,null,1,null,{"$error":"#N/A"},{"$error":"#N/A"},{"$f":"INDEX(Lookup!$O$9:$O$24,MATCH('Interior Lighting'!Z318,Lookup!$K$9:$K$24,0))","v":{"$error":"#N/A"}},{"$f":"IF(E318=\"A\",INDEX(Lookup!$L$9:$L$24,MATCH(Z318,Lookup!$K$9:$K$24,0)),IF(E318=\"B\",INDEX(Lookup!$M$9:$M$24,MATCH(Z318,Lookup!$K$9:$K$24,0)),IF(E318=\"C\",INDEX(Lookup!$N$9:$N$24,MATCH(Z318,Lookup!$K$9:$K$24,0)),\"N/A\")))","v":{"$error":"#N/A"}}]
[null,null,null,null,{"$f":"INDEX(Lookup!$I$9:$I$24,MATCH('Interior Lighting'!D319,Lookup!$C$9:$C$24,0))","v":{"$error":"#N/A"}},null,null,null,{"$error":"#N/A"},null,0,{"$error":"#DIV/0!"},"N/A",{"$f":"IF($D$20=\"Space-By-Space (90.1-2010)\",INDEX(LPD2010SS,MATCH('Interior Lighting'!D319,LightingSpaceType,0)*W319),INDEX(LPD2010WB,MATCH('Interior Lighting'!D319,LightingSpaceType,0)))","v":{"$error":"#N/A"}},0,{"$error":"#N/A"},{"$error":"#N/A"},{"$error":"#N/A"},0,"",null,null,1,null,{"$error":"#N/A"},{"$error":"#N/A"},{"$f":"INDEX(Lookup!$O$9:$O$24,MATCH('Interior Lighting'!Z319,Lookup!$K$9:$K$24,0))","v":{"$error":"#N/A"}},{"$f":"IF(E319=\"A\",INDEX(Lookup!$L$9:$L$24,MATCH(Z319,Lookup!$K$9:$K$24,0)),IF(E319=\"B\",INDEX(Lookup!$M$9:$M$24,MATCH(Z319,Lookup!$K$9:$K$24,0)),IF(E319=\"C\",INDEX(Lookup!$N$9:$N$24,MATCH(Z319,Lookup!$K$9:$K$24,0)),\"N/A\")))","v":{"$error":"#N/A"}}]
[null,null,null,null,{"$f":"INDEX(Lookup!$I$9:$I$24,MATCH('Interior Lighting'!D320,Lookup!$C$9:$C$24,0))","v":{"$error":"#N/A"}},null,null,null,{"$error":"#N/A"},null,0,{"$error":"#DIV/0!"},"N/A",{"$f":"IF($D$20=\"Space-By-Space (90.1-2010)\",INDEX(LPD2010SS,MATCH('Interior Lighting'!D320,LightingSpaceType,0)*W320),INDEX(LPD2010WB,MATCH('Interior Lighting'!D320,LightingSpaceType,0)))","v":{"$error":"#N/A"}},0,{"$error":"#N/A"},{"$error":"#N/A"},{"$error":"#N/A"},0,"",null,null,1,null,{"$error":"#N/A"},{"$error":"#N/A"},{"$f":"INDEX(Lookup!$O$9:$O$24,MATCH('Interior Lighting'!Z320,Lookup!$K$9:$K$24,0))","v":{"$error":"#N/A"}},{"$f":"IF(E320=\"A\",INDEX(Lookup!$L$9:$L$24,MATCH(Z320,Lookup!$K$9:$K$24,0)),IF(E320=\"B\",INDEX(Lookup!$M$9:$M$24,MATCH(Z320,Lookup!$K$9:$K$24,0)),IF(E320=\"C\",INDEX(Lookup!$N$9:$N$24,MATCH(Z320,Lookup!$K$9:$K$24,0)),\"N/A\")))","v":{"$error":"#N/A"}}]
[null,null,null,null,{"$f":"INDEX(Lookup!$I$9:$I$24,MATCH('Interior Lighting'!D321,Lookup!$C$9:$C$24,0))","v":{"$error":"#N/A"}},null,null,null,{"$error":"#N/A"},null,0,{"$error":"#DIV/0!"},"N/A",{"$f":"IF($D$20=\"Space-By-Space (90.1-2010)\",INDEX(LPD2010SS,MATCH('Interior Lighting'!D321,LightingSpaceType,0)*W321),INDEX(LPD2010WB,MATCH('Interior Lighting'!D321,LightingSpaceType,0)))","v":{"$error":"#N/A"}},0,{"$error":"#N/A"},{"$error":"#N/A"},{"$error":"#N/A"},0,"",null,null,1,null,{"$error":"#N/A"},{"$error":"#N/A"},{"$f":"INDEX(Lookup!$O$9:$O$24,MATCH('Interior Lighting'!Z321,Lookup!$K$9:$K$24,0))","v":{"$error":"#N/A"}},{"$f":"IF(E321=\"A\",INDEX(Lookup!$L$9:$L$24,MATCH(Z321,Lookup!$K$9:$K$24,0)),IF(E321=\"B\",INDEX(Lookup!$M$9:$M$24,MATCH(Z321,Lookup!$K$9:$K$24,0)),IF(E321=\"C\",INDEX(Lookup!$N$9:$N$24,MATCH(Z321,Lookup!$K$9:$K$24,0)),\"N/A\")))","v":{"$error":"#N/A"}}]
[null,null,null,null,{"$f":"INDEX(Lookup!$I$9:$I$24,MATCH('Interior Lighting'!D322,Lookup!$C$9:$C$24,0))","v":{"$error":"#N/A"}},null,null,null,{"$error":"#N/A"},null,0,{"$error":"#DIV/0!"},"N/A",{"$f":"IF($D$20=\"Space-By-Space (90.1-2010)\",INDEX(LPD2010SS,MATCH('Interior Lighting'!D322,LightingSpaceType,0)*W322),INDEX(LPD2010WB,MATCH('Interior Lighting'!D322,LightingSpaceType,0)))","v":{"$error":"#N/A"}},0,{"$error":"#N/A"},{"$error":"#N/A"},{"$error":"#N/A"},0,"",null,null,1,null,{"$error":"#N/A"},{"$error":"#N/A"},{"$f":"INDEX(Lookup!$O$9:$O$24,MATCH('Interior Lighting'!Z322,Lookup!$K$9:$K$24,0))","v":{"$error":"#N/A"}},{"$f":"IF(E322=\"A\",INDEX(Lookup!$L$9:$L$24,MATCH(Z322,Lookup!$K$9:$K$24,0)),IF(E322=\"B\",INDEX(Lookup!$M$9:$M$24,MATCH(Z322,Lookup!$K$9:$K$24,0)),IF(E322=\"C\",INDEX(Lookup!$N$9:$N$24,MATCH(Z322,Lookup!$K$9:$K$24,0)),\"N/A\")))","v":{"$error":"#N/A"}}]
[null,null,null,null,{"$f":"INDEX(Lookup!$I$9:$I$24,MATCH('Interior Lighting'!D323,Lookup!$C$9:$C$24,0))","v":{"$error":"#N/A"}},null,null,null,{"$error":"#N/A"},null,0,{"$error":"#DIV/0!"},"N/A",{"$f":"IF($D$20=\"Space-By-Space (90.1-2010)\",INDEX(LPD2010SS,MATCH('Interior Lighting'!D323,LightingSpaceType,0)*W323),INDEX(LPD2010WB,MATCH('Interior Lighting'!D323,LightingSpaceType,0)))","v":{"$error":"#N/A"}},0,{"$error":"#N/A"},{"$error":"#N/A"},{"$error":"#N/A"},0,"",null,null,1,null,{"$error":"#N/A"},{"$error":"#N/A"},{"$f":"INDEX(Lookup!$O$9:$O$24,MATCH('Interior Lighting'!Z323,Lookup!$K$9:$K$24,0))","v":{"$error":"#N/A"}},{"$f":"IF(E323=\"A\",INDEX(Lookup!$L$9:$L$24,MATCH(Z323,Lookup!$K$9:$K$24,0)),IF(E323=\"B\",INDEX(Lookup!$M$9:$M$24,MATCH(Z323,Lookup!$K$9:$K$24,0)),IF(E323=\"C\",INDEX(Lookup!$N$9:$N$24,MATCH(Z323,Lookup!$K$9:$K$24,0)),\"N/A\")))","v":{"$error":"#N/A"}}]
[null,null,null,null,{"$f":"INDEX(Lookup!$I$9:$I$24,MATCH('Interior Lighting'!D324,Lookup!$C$9:$C$24,0))","v":{"$error":"#N/A"}},null,null,null,{"$error":"#N/A"},null,0,{"$error":"#DIV/0!"},"N/A",{"$f":"IF($D$20=\"Space-By-Space (90.1-2010)\",INDEX(LPD2010SS,MATCH('Interior Lighting'!D324,LightingSpaceType,0)*W324),INDEX(LPD2010WB,MATCH('Interior Lighting'!D324,LightingSpaceType,0)))","v":{"$error":"#N/A"}},0,{"$error":"#N/A"},{"$error":"#N/A"},{"$error":"#N/A"},0,"",null,null,1,null,{"$error":"#N/A"},{"$error":"#N/A"},{"$f":"INDEX(Lookup!$O$9:$O$24,MATCH('Interior Lighting'!Z324,Lookup!$K$9:$K$24,0))","v":{"$error":"#N/A"}},{"$f":"IF(E324=\"A\",INDEX(Lookup!$L$9:$L$24,MATCH(Z324,Lookup!$K$9:$K$24,0)),IF(E324=\"B\",INDEX(Lookup!$M$9:$M$24,MATCH(Z324,Lookup!$K$9:$K$24,0)),IF(E324=\"C\",INDEX(Lookup!$N$9:$N$24,MATCH(Z324,Lookup!$K$9:$K$24,0)),\"N/A\")))","v":{"$error":"#N/A"}}]
[null,null,null,null,{"$f":"INDEX(Lookup!$I$9:$I$24,MATCH('Interior Lighting'!D325,Lookup!$C$9:$C$24,0))","v":{"$error":"#N/A"}},null,null,null,{"$error":"#N/A"},null,0,{"$error":"#DIV/0!"},"N/A",{"$f":"IF($D$20=\"Space-By-Space (90.1-2010)\",INDEX(LPD2010SS,MATCH('Interior Lighting'!D325,LightingSpaceType,0)*W325),INDEX(LPD2010WB,MATCH('Interior Lighting'!D325,LightingSpaceType,0)))","v":{"$error":"#N/A"}},0,{"$error":"#N/A"},{"$error":"#N/A"},{"$error":"#N/A"},0,"",null,null,1,null,{"$error":"#N/A"},{"$error":"#N/A"},{"$f":"INDEX(Lookup!$O$9:$O$24,MATCH('Interior Lighting'!Z325,Lookup!$K$9:$K$24,0))","v":{"$error":"#N/A"}},{"$f":"IF(E325=\"A\",INDEX(Lookup!$L$9:$L$24,MATCH(Z325,Lookup!$K$9:$K$24,0)),IF(E325=\"B\",INDEX(Lookup!$M$9:$M$24,MATCH(Z325,Lookup!$K$9:$K$24,0)),IF(E325=\"C\",INDEX(Lookup!$N$9:$N$24,MATCH(Z325,Lookup!$K$9:$K$24,0)),\"N/A\")))","v":{"$error":"#N/A"}}]
[null,null,null,null,{"$f":"INDEX(Lookup!$I$9:$I$24,MATCH('Interior Lighting'!D326,Lookup!$C$9:$C$24,0))","v":{"$error":"#N/A"}},null,null,null,{"$error":"#N/A"},null,0,{"$error":"#DIV/0!"},"N/A",{"$f":"IF($D$20=\"Space-By-Space (90.1-2010)\",INDEX(LPD2010SS,MATCH('Interior Lighting'!D326,LightingSpaceType,0)*W326),INDEX(LPD2010WB,MATCH('Interior Lighting'!D326,LightingSpaceType,0)))","v":{"$error":"#N/A"}},0,{"$error":"#N/A"},{"$error":"#N/A"},{"$error":"#N/A"},0,"",null,null,1,null,{"$error":"#N/A"},{"$error":"#N/A"},{"$f":"INDEX(Lookup!$O$9:$O$24,MATCH('Interior Lighting'!Z326,Lookup!$K$9:$K$24,0))","v":{"$error":"#N/A"}},{"$f":"IF(E326=\"A\",INDEX(Lookup!$L$9:$L$24,MATCH(Z326,Lookup!$K$9:$K$24,0)),IF(E326=\"B\",INDEX(Lookup!$M$9:$M$24,MATCH(Z326,Lookup!$K$9:$K$24,0)),IF(E326=\"C\",INDEX(Lookup!$N$9:$N$24,MATCH(Z326,Lookup!$K$9:$K$24,0)),\"N/A\")))","v":{"$error":"#N/A"}}]
[null,null,null,null,{"$f":"INDEX(Lookup!$I$9:$I$24,MATCH('Interior Lighting'!D327,Lookup!$C$9:$C$24,0))","v":{"$error":"#N/A"}},null,null,null,{"$error":"#N/A"},null,0,{"$error":"#DIV/0!"},"N/A",{"$f":"IF($D$20=\"Space-By-Space (90.1-2010)\",INDEX(LPD2010SS,MATCH('Interior Lighting'!D327,LightingSpaceType,0)*W327),INDEX(LPD2010WB,MATCH('Interior Lighting'!D327,LightingSpaceType,0)))","v":{"$error":"#N/A"}},0,{"$error":"#N/A"},{"$error":"#N/A"},{"$error":"#N/A"},0,"",null,null,1,null,{"$error":"#N/A"},{"$error":"#N/A"},{"$f":"INDEX(Lookup!$O$9:$O$24,MATCH('Interior Lighting'!Z327,Lookup!$K$9:$K$24,0))","v":{"$error":"#N/A"}},{"$f":"IF(E327=\"A\",INDEX(Lookup!$L$9:$L$24,MATCH(Z327,Lookup!$K$9:$K$24,0)),IF(E327=\"B\",INDEX(Lookup!$M$9:$M$24,MATCH(Z327,Lookup!$K$9:$K$24,0)),IF(E327=\"C\",INDEX(Lookup!$N$9:$N$24,MATCH(Z327,Lookup!$K$9:$K$24,0)),\"N/A\")))","v":{"$error":"#N/A"}}]
[null,null,null,null,{"$f":"INDEX(Lookup!$I$9:$I$24,MATCH('Interior Lighting'!D328,Lookup!$C$9:$C$24,0))","v":{"$error":"#N/A"}},null,null,null,{"$error":"#N/A"},null,0,{"$error":"#DIV/0!"},"N/A",{"$f":"IF($D$20=\"Space-By-Space (90.1-2010)\",INDEX(LPD2010SS,MATCH('Interior Lighting'!D328,LightingSpaceType,0)*W328),INDEX(LPD2010WB,MATCH('Interior Lighting'!D328,LightingSpaceType,0)))","v":{"$error":"#N/A"}},0,{"$error":"#N/A"},{"$error":"#N/A"},{"$error":"#N/A"},0,"",null,null,1,null,{"$error":"#N/A"},{"$error":"#N/A"},{"$f":"INDEX(Lookup!$O$9:$O$24,MATCH('Interior Lighting'!Z328,Lookup!$K$9:$K$24,0))","v":{"$error":"#N/A"}},{"$f":"IF(E328=\"A\",INDEX(Lookup!$L$9:$L$24,MATCH(Z328,Lookup!$K$9:$K$24,0)),IF(E328=\"B\",INDEX(Lookup!$M$9:$M$24,MATCH(Z328,Lookup!$K$9:$K$24,0)),IF(E328=\"C\",INDEX(Lookup!$N$9:$N$24,MATCH(Z328,Lookup!$K$9:$K$24,0)),\"N/A\")))","v":{"$error":"#N/A"}}]
[null,null,null,null,{"$f":"INDEX(Lookup!$I$9:$I$24,MATCH('Interior Lighting'!D329,Lookup!$C$9:$C$24,0))","v":{"$error":"#N/A"}},null,null,null,{"$error":"#N/A"},null,0,{"$error":"#DIV/0!"},"N/A",{"$f":"IF($D$20=\"Space-By-Space (90.1-2010)\",INDEX(LPD2010SS,MATCH('Interior Lighting'!D329,LightingSpaceType,0)*W329),INDEX(LPD2010WB,MATCH('Interior Lighting'!D329,LightingSpaceType,0)))","v":{"$error":"#N/A"}},0,{"$error":"#N/A"},{"$error":"#N/A"},{"$error":"#N/A"},0,"",null,null,1,null,{"$error":"#N/A"},{"$error":"#N/A"},{"$f":"INDEX(Lookup!$O$9:$O$24,MATCH('Interior Lighting'!Z329,Lookup!$K$9:$K$24,0))","v":{"$error":"#N/A"}},{"$f":"IF(E329=\"A\",INDEX(Lookup!$L$9:$L$24,MATCH(Z329,Lookup!$K$9:$K$24,0)),IF(E329=\"B\",INDEX(Lookup!$M$9:$M$24,MATCH(Z329,Lookup!$K$9:$K$24,0)),IF(E329=\"C\",INDEX(Lookup!$N$9:$N$24,MATCH(Z329,Lookup!$K$9:$K$24,0)),\"N/A\")))","v":{"$error":"#N/A"}}]
[null,null,null,null,{"$f":"INDEX(Lookup!$I$9:$I$24,MATCH('Interior Lighting'!D330,Lookup!$C$9:$C$24,0))","v":{"$error":"#N/A"}},null,null,null,{"$error":"#N/A"},null,0,{"$error":"#DIV/0!"},"N/A",{"$f":"IF($D$20=\"Space-By-Space (90.1-2010)\",INDEX(LPD2010SS,MATCH('Interior Lighting'!D330,LightingSpaceType,0)*W330),INDEX(LPD2010WB,MATCH('Interior Lighting'!D330,LightingSpaceType,0)))","v":{"$error":"#N/A"}},0,{"$error":"#N/A"},{"$error":"#N/A"},{"$error":"#N/A"},0,"",null,null,1,null,{"$error":"#N/A"},{"$error":"#N/A"},{"$f":"INDEX(Lookup!$O$9:$O$24,MATCH('Interior Lighting'!Z330,Lookup!$K$9:$K$24,0))","v":{"$error":"#N/A"}},{"$f":"IF(E330=\"A\",INDEX(Lookup!$L$9:$L$24,MATCH(Z330,Lookup!$K$9:$K$24,0)),IF(E330=\"B\",INDEX(Lookup!$M$9:$M$24,MATCH(Z330,Lookup!$K$9:$K$24,0)),IF(E330=\"C\",INDEX(Lookup!$N$9:$N$24,MATCH(Z330,Lookup!$K$9:$K$24,0)),\"N/A\")))","v":{"$error":"#N/A"}}]
[null,null,null,null,{"$f":"INDEX(Lookup!$I$9:$I$24,MATCH('Interior Lighting'!D331,Lookup!$C$9:$C$24,0))","v":{"$error":"#N/A"}},null,null,null,{"$error":"#N/A"},null,0,{"$error":"#DIV/0!"},"N/A",{"$f":"IF($D$20=\"Space-By-Space (90.1-2010)\",INDEX(LPD2010SS,MATCH('Interior Lighting'!D331,LightingSpaceType,0)*W331),INDEX(LPD2010WB,MATCH('Interior Lighting'!D331,LightingSpaceType,0)))","v":{"$error":"#N/A"}},0,{"$error":"#N/A"},{"$error":"#N/A"},{"$error":"#N/A"},0,"",null,null,1,null,{"$error":"#N/A"},{"$error":"#N/A"},{"$f":"INDEX(Lookup!$O$9:$O$24,MATCH('Interior Lighting'!Z331,Lookup!$K$9:$K$24,0))","v":{"$error":"#N/A"}},{"$f":"IF(E331=\"A\",INDEX(Lookup!$L$9:$L$24,MATCH(Z331,Lookup!$K$9:$K$24,0)),IF(E331=\"B\",INDEX(Lookup!$M$9:$M$24,MATCH(Z331,Lookup!$K$9:$K$24,0)),IF(E331=\"C\",INDEX(Lookup!$N$9:$N$24,MATCH(Z331,Lookup!$K$9:$K$24,0)),\"N/A\")))","v":{"$error":"#N/A"}}]
[null,null,null,null,{"$f":"INDEX(Lookup!$I$9:$I$24,MATCH('Interior Lighting'!D332,Lookup!$C$9:$C$24,0))","v":{"$error":"#N/A"}},null,null,null,{"$error":"#N/A"},null,0,{"$error":"#DIV/0!"},"N/A",{"$f":"IF($D$20=\"Space-By-Space (90.1-2010)\",INDEX(LPD2010SS,MATCH('Interior Lighting'!D332,LightingSpaceType,0)*W332),INDEX(LPD2010WB,MATCH('Interior Lighting'!D332,LightingSpaceType,0)))","v":{"$error":"#N/A"}},0,{"$error":"#N/A"},{"$error":"#N/A"},{"$error":"#N/A"},0,"",null,null,1,null,{"$error":"#N/A"},{"$error":"#N/A"},{"$f":"INDEX(Lookup!$O$9:$O$24,MATCH('Interior Lighting'!Z332,Lookup!$K$9:$K$24,0))","v":{"$error":"#N/A"}},{"$f":"IF(E332=\"A\",INDEX(Lookup!$L$9:$L$24,MATCH(Z332,Lookup!$K$9:$K$24,0)),IF(E332=\"B\",INDEX(Lookup!$M$9:$M$24,MATCH(Z332,Lookup!$K$9:$K$24,0)),IF(E332=\"C\",INDEX(Lookup!$N$9:$N$24,MATCH(Z332,Lookup!$K$9:$K$24,0)),\"N/A\")))","v":{"$error":"#N/A"}}]
[null,null,null,null,{"$f":"INDEX(Lookup!$I$9:$I$24,MATCH('Interior Lighting'!D333,Lookup!$C$9:$C$24,0))","v":{"$error":"#N/A"}},null,null,null,{"$error":"#N/A"},null,0,{"$error":"#DIV/0!"},"N/A",{"$f":"IF($D$20=\"Space-By-Space (90.1-2010)\",INDEX(LPD2010SS,MATCH('Interior Lighting'!D333,LightingSpaceType,0)*W333),INDEX(LPD2010WB,MATCH('Interior Lighting'!D333,LightingSpaceType,0)))","v":{"$error":"#N/A"}},0,{"$error":"#N/A"},{"$error":"#N/A"},{"$error":"#N/A"},0,"",null,null,1,null,{"$error":"#N/A"},{"$error":"#N/A"},{"$f":"INDEX(Lookup!$O$9:$O$24,MATCH('Interior Lighting'!Z333,Lookup!$K$9:$K$24,0))","v":{"$error":"#N/A"}},{"$f":"IF(E333=\"A\",INDEX(Lookup!$L$9:$L$24,MATCH(Z333,Lookup!$K$9:$K$24,0)),IF(E333=\"B\",INDEX(Lookup!$M$9:$M$24,MATCH(Z333,Lookup!$K$9:$K$24,0)),IF(E333=\"C\",INDEX(Lookup!$N$9:$N$24,MATCH(Z333,Lookup!$K$9:$K$24,0)),\"N/A\")))","v":{"$error":"#N/A"}}]
[null,null,null,null,{"$f":"INDEX(Lookup!$I$9:$I$24,MATCH('Interior Lighting'!D334,Lookup!$C$9:$C$24,0))","v":{"$error":"#N/A"}},null,null,null,{"$error":"#N/A"},null,0,{"$error":"#DIV/0!"},"N/A",{"$f":"IF($D$20=\"Space-By-Space (90.1-2010)\",INDEX(LPD2010SS,MATCH('Interior Lighting'!D334,LightingSpaceType,0)*W334),INDEX(LPD2010WB,MATCH('Interior Lighting'!D334,LightingSpaceType,0)))","v":{"$error":"#N/A"}},0,{"$error":"#N/A"},{"$error":"#N/A"},{"$error":"#N/A"},0,"",null,null,1,null,{"$error":"#N/A"},{"$error":"#N/A"},{"$f":"INDEX(Lookup!$O$9:$O$24,MATCH('Interior Lighting'!Z334,Lookup!$K$9:$K$24,0))","v":{"$error":"#N/A"}},{"$f":"IF(E334=\"A\",INDEX(Lookup!$L$9:$L$24,MATCH(Z334,Lookup!$K$9:$K$24,0)),IF(E334=\"B\",INDEX(Lookup!$M$9:$M$24,MATCH(Z334,Lookup!$K$9:$K$24,0)),IF(E334=\"C\",INDEX(Lookup!$N$9:$N$24,MATCH(Z334,Lookup!$K$9:$K$24,0)),\"N/A\")))","v":{"$error":"#N/A"}}]
[null,null,null,null,{"$f":"INDEX(Lookup!$I$9:$I$24,MATCH('Interior Lighting'!D335,Lookup!$C$9:$C$24,0))","v":{"$error":"#N/A"}},null,null,null,{"$error":"#N/A"},null,0,{"$error":"#DIV/0!"},"N/A",{"$f":"IF($D$20=\"Space-By-Space (90.1-2010)\",INDEX(LPD2010SS,MATCH('Interior Lighting'!D335,LightingSpaceType,0)*W335),INDEX(LPD2010WB,MATCH('Interior Lighting'!D335,LightingSpaceType,0)))","v":{"$error":"#N/A"}},0,{"$error":"#N/A"},{"$error":"#N/A"},{"$error":"#N/A"},0,"",null,null,1,null,{"$error":"#N/A"},{"$error":"#N/A"},{"$f":"INDEX(Lookup!$O$9:$O$24,MATCH('Interior Lighting'!Z335,Lookup!$K$9:$K$24,0))","v":{"$error":"#N/A"}},{"$f":"IF(E335=\"A\",INDEX(Lookup!$L$9:$L$24,MATCH(Z335,Lookup!$K$9:$K$24,0)),IF(E335=\"B\",INDEX(Lookup!$M$9:$M$24,MATCH(Z335,Lookup!$K$9:$K$24,0)),IF(E335=\"C\",INDEX(Lookup!$N$9:$N$24,MATCH(Z335,Lookup!$K$9:$K$24,0)),\"N/A\")))","v":{"$error":"#N/A"}}]
[null,null,null,null,{"$f":"INDEX(Lookup!$I$9:$I$24,MATCH('Interior Lighting'!D336,Lookup!$C$9:$C$24,0))","v":{"$error":"#N/A"}},null,null,null,{"$error":"#N/A"},null,0,{"$error":"#DIV/0!"},"N/A",{"$f":"IF($D$20=\"Space-By-Space (90.1-2010)\",INDEX(LPD2010SS,MATCH('Interior Lighting'!D336,LightingSpaceType,0)*W336),INDEX(LPD2010WB,MATCH('Interior Lighting'!D336,LightingSpaceType,0)))","v":{"$error":"#N/A"}},0,{"$error":"#N/A"},{"$error":"#N/A"},{"$error":"#N/A"},0,"",null,null,1,null,{"$error":"#N/A"},{"$error":"#N/A"},{"$f":"INDEX(Lookup!$O$9:$O$24,MATCH('Interior Lighting'!Z336,Lookup!$K$9:$K$24,0))","v":{"$error":"#N/A"}},{"$f":"IF(E336=\"A\",INDEX(Lookup!$L$9:$L$24,MATCH(Z336,Lookup!$K$9:$K$24,0)),IF(E336=\"B\",INDEX(Lookup!$M$9:$M$24,MATCH(Z336,Lookup!$K$9:$K$24,0)),IF(E336=\"C\",INDEX(Lookup!$N$9:$N$24,MATCH(Z336,Lookup!$K$9:$K$24,0)),\"N/A\")))","v":{"$error":"#N/A"}}]
[null,null,null,null,{"$f":"INDEX(Lookup!$I$9:$I$24,MATCH('Interior Lighting'!D337,Lookup!$C$9:$C$24,0))","v":{"$error":"#N/A"}},null,null,null,{"$error":"#N/A"},null,0,{"$error":"#DIV/0!"},"N/A",{"$f":"IF($D$20=\"Space-By-Space (90.1-2010)\",INDEX(LPD2010SS,MATCH('Interior Lighting'!D337,LightingSpaceType,0)*W337),INDEX(LPD2010WB,MATCH('Interior Lighting'!D337,LightingSpaceType,0)))","v":{"$error":"#N/A"}},0,{"$error":"#N/A"},{"$error":"#N/A"},{"$error":"#N/A"},0,"",null,null,1,null,{"$error":"#N/A"},{"$error":"#N/A"},{"$f":"INDEX(Lookup!$O$9:$O$24,MATCH('Interior Lighting'!Z337,Lookup!$K$9:$K$24,0))","v":{"$error":"#N/A"}},{"$f":"IF(E337=\"A\",INDEX(Lookup!$L$9:$L$24,MATCH(Z337,Lookup!$K$9:$K$24,0)),IF(E337=\"B\",INDEX(Lookup!$M$9:$M$24,MATCH(Z337,Lookup!$K$9:$K$24,0)),IF(E337=\"C\",INDEX(Lookup!$N$9:$N$24,MATCH(Z337,Lookup!$K$9:$K$24,0)),\"N/A\")))","v":{"$error":"#N/A"}}]
[null,null,null,null,{"$f":"INDEX(Lookup!$I$9:$I$24,MATCH('Interior Lighting'!D338,Lookup!$C$9:$C$24,0))","v":{"$error":"#N/A"}},null,null,null,{"$error":"#N/A"},null,0,{"$error":"#DIV/0!"},"N/A",{"$f":"IF($D$20=\"Space-By-Space (90.1-2010)\",INDEX(LPD2010SS,MATCH('Interior Lighting'!D338,LightingSpaceType,0)*W338),INDEX(LPD2010WB,MATCH('Interior Lighting'!D338,LightingSpaceType,0)))","v":{"$error":"#N/A"}},0,{"$error":"#N/A"},{"$error":"#N/A"},{"$error":"#N/A"},0,"",null,null,1,null,{"$error":"#N/A"},{"$error":"#N/A"},{"$f":"INDEX(Lookup!$O$9:$O$24,MATCH('Interior Lighting'!Z338,Lookup!$K$9:$K$24,0))","v":{"$error":"#N/A"}},{"$f":"IF(E338=\"A\",INDEX(Lookup!$L$9:$L$24,MATCH(Z338,Lookup!$K$9:$K$24,0)),IF(E338=\"B\",INDEX(Lookup!$M$9:$M$24,MATCH(Z338,Lookup!$K$9:$K$24,0)),IF(E338=\"C\",INDEX(Lookup!$N$9:$N$24,MATCH(Z338,Lookup!$K$9:$K$24,0)),\"N/A\")))","v":{"$error":"#N/A"}}]
[null,null,null,null,{"$f":"INDEX(Lookup!$I$9:$I$24,MATCH('Interior Lighting'!D339,Lookup!$C$9:$C$24,0))","v":{"$error":"#N/A"}},null,null,null,{"$error":"#N/A"},null,0,{"$error":"#DIV/0!"},"N/A",{"$f":"IF($D$20=\"Space-By-Space (90.1-2010)\",INDEX(LPD2010SS,MATCH('Interior Lighting'!D339,LightingSpaceType,0)*W339),INDEX(LPD2010WB,MATCH('Interior Lighting'!D339,LightingSpaceType,0)))","v":{"$error":"#N/A"}},0,{"$error":"#N/A"},{"$error":"#N/A"},{"$error":"#N/A"},0,"",null,null,1,null,{"$error":"#N/A"},{"$error":"#N/A"},{"$f":"INDEX(Lookup!$O$9:$O$24,MATCH('Interior Lighting'!Z339,Lookup!$K$9:$K$24,0))","v":{"$error":"#N/A"}},{"$f":"IF(E339=\"A\",INDEX(Lookup!$L$9:$L$24,MATCH(Z339,Lookup!$K$9:$K$24,0)),IF(E339=\"B\",INDEX(Lookup!$M$9:$M$24,MATCH(Z339,Lookup!$K$9:$K$24,0)),IF(E339=\"C\",INDEX(Lookup!$N$9:$N$24,MATCH(Z339,Lookup!$K$9:$K$24,0)),\"N/A\")))","v":{"$error":"#N/A"}}]
[null,null,null,null,{"$f":"INDEX(Lookup!$I$9:$I$24,MATCH('Interior Lighting'!D340,Lookup!$C$9:$C$24,0))","v":{"$error":"#N/A"}},null,null,null,{"$error":"#N/A"},null,0,{"$error":"#DIV/0!"},"N/A",{"$f":"IF($D$20=\"Space-By-Space (90.1-2010)\",INDEX(LPD2010SS,MATCH('Interior Lighting'!D340,LightingSpaceType,0)*W340),INDEX(LPD2010WB,MATCH('Interior Lighting'!D340,LightingSpaceType,0)))","v":{"$error":"#N/A"}},0,{"$error":"#N/A"},{"$error":"#N/A"},{"$error":"#N/A"},0,"",null,null,1,null,{"$error":"#N/A"},{"$error":"#N/A"},{"$f":"INDEX(Lookup!$O$9:$O$24,MATCH('Interior Lighting'!Z340,Lookup!$K$9:$K$24,0))","v":{"$error":"#N/A"}},{"$f":"IF(E340=\"A\",INDEX(Lookup!$L$9:$L$24,MATCH(Z340,Lookup!$K$9:$K$24,0)),IF(E340=\"B\",INDEX(Lookup!$M$9:$M$24,MATCH(Z340,Lookup!$K$9:$K$24,0)),IF(E340=\"C\",INDEX(Lookup!$N$9:$N$24,MATCH(Z340,Lookup!$K$9:$K$24,0)),\"N/A\")))","v":{"$error":"#N/A"}}]
[null,null,null,null,{"$f":"INDEX(Lookup!$I$9:$I$24,MATCH('Interior Lighting'!D341,Lookup!$C$9:$C$24,0))","v":{"$error":"#N/A"}},null,null,null,{"$error":"#N/A"},null,0,{"$error":"#DIV/0!"},"N/A",{"$f":"IF($D$20=\"Space-By-Space (90.1-2010)\",INDEX(LPD2010SS,MATCH('Interior Lighting'!D341,LightingSpaceType,0)*W341),INDEX(LPD2010WB,MATCH('Interior Lighting'!D341,LightingSpaceType,0)))","v":{"$error":"#N/A"}},0,{"$error":"#N/A"},{"$error":"#N/A"},{"$error":"#N/A"},0,"",null,null,1,null,{"$error":"#N/A"},{"$error":"#N/A"},{"$f":"INDEX(Lookup!$O$9:$O$24,MATCH('Interior Lighting'!Z341,Lookup!$K$9:$K$24,0))","v":{"$error":"#N/A"}},{"$f":"IF(E341=\"A\",INDEX(Lookup!$L$9:$L$24,MATCH(Z341,Lookup!$K$9:$K$24,0)),IF(E341=\"B\",INDEX(Lookup!$M$9:$M$24,MATCH(Z341,Lookup!$K$9:$K$24,0)),IF(E341=\"C\",INDEX(Lookup!$N$9:$N$24,MATCH(Z341,Lookup!$K$9:$K$24,0)),\"N/A\")))","v":{"$error":"#N/A"}}]
[null,null,null,null,{"$f":"INDEX(Lookup!$I$9:$I$24,MATCH('Interior Lighting'!D342,Lookup!$C$9:$C$24,0))","v":{"$error":"#N/A"}},null,null,null,{"$error":"#N/A"},null,0,{"$error":"#DIV/0!"},"N/A",{"$f":"IF($D$20=\"Space-By-Space (90.1-2010)\",INDEX(LPD2010SS,MATCH('Interior Lighting'!D342,LightingSpaceType,0)*W342),INDEX(LPD2010WB,MATCH('Interior Lighting'!D342,LightingSpaceType,0)))","v":{"$error":"#N/A"}},0,{"$error":"#N/A"},{"$error":"#N/A"},{"$error":"#N/A"},0,"",null,null,1,null,{"$error":"#N/A"},{"$error":"#N/A"},{"$f":"INDEX(Lookup!$O$9:$O$24,MATCH('Interior Lighting'!Z342,Lookup!$K$9:$K$24,0))","v":{"$error":"#N/A"}},{"$f":"IF(E342=\"A\",INDEX(Lookup!$L$9:$L$24,MATCH(Z342,Lookup!$K$9:$K$24,0)),IF(E342=\"B\",INDEX(Lookup!$M$9:$M$24,MATCH(Z342,Lookup!$K$9:$K$24,0)),IF(E342=\"C\",INDEX(Lookup!$N$9:$N$24,MATCH(Z342,Lookup!$K$9:$K$24,0)),\"N/A\")))","v":{"$error":"#N/A"}}]
[null,null,null,null,{"$f":"INDEX(Lookup!$I$9:$I$24,MATCH('Interior Lighting'!D343,Lookup!$C$9:$C$24,0))","v":{"$error":"#N/A"}},null,null,null,{"$error":"#N/A"},null,0,{"$error":"#DIV/0!"},"N/A",{"$f":"IF($D$20=\"Space-By-Space (90.1-2010)\",INDEX(LPD2010SS,MATCH('Interior Lighting'!D343,LightingSpaceType,0)*W343),INDEX(LPD2010WB,MATCH('Interior Lighting'!D343,LightingSpaceType,0)))","v":{"$error":"#N/A"}},0,{"$error":"#N/A"},{"$error":"#N/A"},{"$error":"#N/A"},0,"",null,null,1,null,{"$error":"#N/A"},{"$error":"#N/A"},{"$f":"INDEX(Lookup!$O$9:$O$24,MATCH('Interior Lighting'!Z343,Lookup!$K$9:$K$24,0))","v":{"$error":"#N/A"}},{"$f":"IF(E343=\"A\",INDEX(Lookup!$L$9:$L$24,MATCH(Z343,Lookup!$K$9:$K$24,0)),IF(E343=\"B\",INDEX(Lookup!$M$9:$M$24,MATCH(Z343,Lookup!$K$9:$K$24,0)),IF(E343=\"C\",INDEX(Lookup!$N$9:$N$24,MATCH(Z343,Lookup!$K$9:$K$24,0)),\"N/A\")))","v":{"$error":"#N/A"}}]
[null,null,null,null,{"$f":"INDEX(Lookup!$I$9:$I$24,MATCH('Interior Lighting'!D344,Lookup!$C$9:$C$24,0))","v":{"$error":"#N/A"}},null,null,null,{"$error":"#N/A"},null,0,{"$error":"#DIV/0!"},"N/A",{"$f":"IF($D$20=\"Space-By-Space (90.1-2010)\",INDEX(LPD2010SS,MATCH('Interior Lighting'!D344,LightingSpaceType,0)*W344),INDEX(LPD2010WB,MATCH('Interior Lighting'!D344,LightingSpaceType,0)))","v":{"$error":"#N/A"}},0,{"$error":"#N/A"},{"$error":"#N/A"},{"$error":"#N/A"},0,"",null,null,1,null,{"$error":"#N/A"},{"$error":"#N/A"},{"$f":"INDEX(Lookup!$O$9:$O$24,MATCH('Interior Lighting'!Z344,Lookup!$K$9:$K$24,0))","v":{"$error":"#N/A"}},{"$f":"IF(E344=\"A\",INDEX(Lookup!$L$9:$L$24,MATCH(Z344,Lookup!$K$9:$K$24,0)),IF(E344=\"B\",INDEX(Lookup!$M$9:$M$24,MATCH(Z344,Lookup!$K$9:$K$24,0)),IF(E344=\"C\",INDEX(Lookup!$N$9:$N$24,MATCH(Z344,Lookup!$K$9:$K$24,0)),\"N/A\")))","v":{"$error":"#N/A"}}]
[null,null,null,null,{"$f":"INDEX(Lookup!$I$9:$I$24,MATCH('Interior Lighting'!D345,Lookup!$C$9:$C$24,0))","v":{"$error":"#N/A"}},null,null,null,{"$error":"#N/A"},null,0,{"$error":"#DIV/0!"},"N/A",{"$f":"IF($D$20=\"Space-By-Space (90.1-2010)\",INDEX(LPD2010SS,MATCH('Interior Lighting'!D345,LightingSpaceType,0)*W345),INDEX(LPD2010WB,MATCH('Interior Lighting'!D345,LightingSpaceType,0)))","v":{"$error":"#N/A"}},0,{"$error":"#N/A"},{"$error":"#N/A"},{"$error":"#N/A"},0,"",null,null,1,null,{"$error":"#N/A"},{"$error":"#N/A"},{"$f":"INDEX(Lookup!$O$9:$O$24,MATCH('Interior Lighting'!Z345,Lookup!$K$9:$K$24,0))","v":{"$error":"#N/A"}},{"$f":"IF(E345=\"A\",INDEX(Lookup!$L$9:$L$24,MATCH(Z345,Lookup!$K$9:$K$24,0)),IF(E345=\"B\",INDEX(Lookup!$M$9:$M$24,MATCH(Z345,Lookup!$K$9:$K$24,0)),IF(E345=\"C\",INDEX(Lookup!$N$9:$N$24,MATCH(Z345,Lookup!$K$9:$K$24,0)),\"N/A\")))","v":{"$error":"#N/A"}}]
[null,null,null,null,{"$f":"INDEX(Lookup!$I$9:$I$24,MATCH('Interior Lighting'!D346,Lookup!$C$9:$C$24,0))","v":{"$error":"#N/A"}},null,null,null,{"$error":"#N/A"},null,0,{"$error":"#DIV/0!"},"N/A",{"$f":"IF($D$20=\"Space-By-Space (90.1-2010)\",INDEX(LPD2010SS,MATCH('Interior Lighting'!D346,LightingSpaceType,0)*W346),INDEX(LPD2010WB,MATCH('Interior Lighting'!D346,LightingSpaceType,0)))","v":{"$error":"#N/A"}},0,{"$error":"#N/A"},{"$error":"#N/A"},{"$error":"#N/A"},0,"",null,null,1,null,{"$error":"#N/A"},{"$error":"#N/A"},{"$f":"INDEX(Lookup!$O$9:$O$24,MATCH('Interior Lighting'!Z346,Lookup!$K$9:$K$24,0))","v":{"$error":"#N/A"}},{"$f":"IF(E346=\"A\",INDEX(Lookup!$L$9:$L$24,MATCH(Z346,Lookup!$K$9:$K$24,0)),IF(E346=\"B\",INDEX(Lookup!$M$9:$M$24,MATCH(Z346,Lookup!$K$9:$K$24,0)),IF(E346=\"C\",INDEX(Lookup!$N$9:$N$24,MATCH(Z346,Lookup!$K$9:$K$24,0)),\"N/A\")))","v":{"$error":"#N/A"}}]
[null,null,null,null,{"$f":"INDEX(Lookup!$I$9:$I$24,MATCH('Interior Lighting'!D347,Lookup!$C$9:$C$24,0))","v":{"$error":"#N/A"}},null,null,null,{"$error":"#N/A"},null,0,{"$error":"#DIV/0!"},"N/A",{"$f":"IF($D$20=\"Space-By-Space (90.1-2010)\",INDEX(LPD2010SS,MATCH('Interior Lighting'!D347,LightingSpaceType,0)*W347),INDEX(LPD2010WB,MATCH('Interior Lighting'!D347,LightingSpaceType,0)))","v":{"$error":"#N/A"}},0,{"$error":"#N/A"},{"$error":"#N/A"},{"$error":"#N/A"},0,"",null,null,1,null,{"$error":"#N/A"},{"$error":"#N/A"},{"$f":"INDEX(Lookup!$O$9:$O$24,MATCH('Interior Lighting'!Z347,Lookup!$K$9:$K$24,0))","v":{"$error":"#N/A"}},{"$f":"IF(E347=\"A\",INDEX(Lookup!$L$9:$L$24,MATCH(Z347,Lookup!$K$9:$K$24,0)),IF(E347=\"B\",INDEX(Lookup!$M$9:$M$24,MATCH(Z347,Lookup!$K$9:$K$24,0)),IF(E347=\"C\",INDEX(Lookup!$N$9:$N$24,MATCH(Z347,Lookup!$K$9:$K$24,0)),\"N/A\")))","v":{"$error":"#N/A"}}]
[null,null,null,null,{"$f":"INDEX(Lookup!$I$9:$I$24,MATCH('Interior Lighting'!D348,Lookup!$C$9:$C$24,0))","v":{"$error":"#N/A"}},null,null,null,{"$error":"#N/A"},null,0,{"$error":"#DIV/0!"},"N/A",{"$f":"IF($D$20=\"Space-By-Space (90.1-2010)\",INDEX(LPD2010SS,MATCH('Interior Lighting'!D348,LightingSpaceType,0)*W348),INDEX(LPD2010WB,MATCH('Interior Lighting'!D348,LightingSpaceType,0)))","v":{"$error":"#N/A"}},0,{"$error":"#N/A"},{"$error":"#N/A"},{"$error":"#N/A"},0,"",null,null,1,null,{"$error":"#N/A"},{"$error":"#N/A"},{"$f":"INDEX(Lookup!$O$9:$O$24,MATCH('Interior Lighting'!Z348,Lookup!$K$9:$K$24,0))","v":{"$error":"#N/A"}},{"$f":"IF(E348=\"A\",INDEX(Lookup!$L$9:$L$24,MATCH(Z348,Lookup!$K$9:$K$24,0)),IF(E348=\"B\",INDEX(Lookup!$M$9:$M$24,MATCH(Z348,Lookup!$K$9:$K$24,0)),IF(E348=\"C\",INDEX(Lookup!$N$9:$N$24,MATCH(Z348,Lookup!$K$9:$K$24,0)),\"N/A\")))","v":{"$error":"#N/A"}}]
[null,null,null,null,{"$f":"INDEX(Lookup!$I$9:$I$24,MATCH('Interior Lighting'!D349,Lookup!$C$9:$C$24,0))","v":{"$error":"#N/A"}},null,null,null,{"$error":"#N/A"},null,0,{"$error":"#DIV/0!"},"N/A",{"$f":"IF($D$20=\"Space-By-Space (90.1-2010)\",INDEX(LPD2010SS,MATCH('Interior Lighting'!D349,LightingSpaceType,0)*W349),INDEX(LPD2010WB,MATCH('Interior Lighting'!D349,LightingSpaceType,0)))","v":{"$error":"#N/A"}},0,{"$error":"#N/A"},{"$error":"#N/A"},{"$error":"#N/A"},0,"",null,null,1,null,{"$error":"#N/A"},{"$error":"#N/A"},{"$f":"INDEX(Lookup!$O$9:$O$24,MATCH('Interior Lighting'!Z349,Lookup!$K$9:$K$24,0))","v":{"$error":"#N/A"}},{"$f":"IF(E349=\"A\",INDEX(Lookup!$L$9:$L$24,MATCH(Z349,Lookup!$K$9:$K$24,0)),IF(E349=\"B\",INDEX(Lookup!$M$9:$M$24,MATCH(Z349,Lookup!$K$9:$K$24,0)),IF(E349=\"C\",INDEX(Lookup!$N$9:$N$24,MATCH(Z349,Lookup!$K$9:$K$24,0)),\"N/A\")))","v":{"$error":"#N/A"}}]
[null,null,null,null,{"$f":"INDEX(Lookup!$I$9:$I$24,MATCH('Interior Lighting'!D350,Lookup!$C$9:$C$24,0))","v":{"$error":"#N/A"}},null,null,null,{"$error":"#N/A"},null,0,{"$error":"#DIV/0!"},"N/A",{"$f":"IF($D$20=\"Space-By-Space (90.1-2010)\",INDEX(LPD2010SS,MATCH('Interior Lighting'!D350,LightingSpaceType,0)*W350),INDEX(LPD2010WB,MATCH('Interior Lighting'!D350,LightingSpaceType,0)))","v":{"$error":"#N/A"}},0,{"$f":"Y350*AA350*AB350","v":{"$error":"#N/A"}},{"$error":"#N/A"},{"$f":"INDEX(Footcandles,MATCH(D350,LightingSpaceType,0))","v":{"$error":"#N/A"}},0,{"$f":"IF(F350>0, IF(Q350<R350, \"Insufficient lighting to meet IESNA footcandle recommendations.\", \"\"), \"\")","v":""},null,null,1,null,{"$f":"INDEX($M$4:$M$27,MATCH(G350,$J$4:$J$27,0))","v":{"$error":"#N/A"}},{"$f":"INDEX($K$4:$K$27,MATCH(G350,$J$4:$J$27,0))","v":{"$error":"#N/A"}},{"$f":"INDEX(Lookup!$O$9:$O$24,MATCH('Interior Lighting'!Z350,Lookup!$K$9:$K$24,0))","v":{"$error":"#N/A"}},{"$f":"IF(E350=\"A\",INDEX(Lookup!$L$9:$L$24,MATCH(Z350,Lookup!$K$9:$K$24,0)),IF(E350=\"B\",INDEX(Lookup!$M$9:$M$24,MATCH(Z350,Lookup!$K$9:$K$24,0)),IF(E350=\"C\",INDEX(Lookup!$N$9:$N$24,MATCH(Z350,Lookup!$K$9:$K$24,0)),\"N/A\")))","v":{"$error":"#N/A"}}]
[null,null,null,null,{"$f":"INDEX(Lookup!$I$9:$I$24,MATCH('Interior Lighting'!D351,Lookup!$C$9:$C$24,0))","v":{"$error":"#N/A"}},null,null,null,{"$f":"INDEX($L$4:$L$27,MATCH(G351,$J$4:$J$27,0))","v":{"$error":"#N/A"}},null,{"$f":"IF(F351>0, F351*I351*J351, 0)","v":0},{"$f":"IF(D351=\"Exit Signs\",\"convert to kW\", K351/S351)","v":{"$error":"#DIV/0!"}},{"$f":"IF(H351=\"Yes\",IF(D351=\"Corridor/Transition\",0.75*L351,1*L351),\"N/A\")","v":"N/A"},{"$f":"IF($D$20=\"Space-By-Space (90.1-2010)\",INDEX(LPD2010SS,MATCH('Interior Lighting'!D351,LightingSpaceType,0)*W351),INDEX(LPD2010WB,MATCH('Interior Lighting'!D351,LightingSpaceType,0)))","v":{"$error":"#N/A"}},{"$f":"IF(D351=\"Exit Signs\", 5*F351*J351, IF(B351>0, N351*S351, 0))","v":0},{"$error":"#N/A"},{"$f":"IF(D351=\"Exit Signs\",\"NA\", K351*P351/S351)","v":{"$error":"#N/A"}},{"$error":"#N/A"},{"$f":"J351*B351","v":0},"",null,null,{"$f":"IF(A351=\"Yes\",1.2,1)","v":1},null,{"$error":"#N/A"},{"$error":"#N/A"},{"$f":"INDEX(Lookup!$O$9:$O$24,MATCH('Interior Lighting'!Z351,Lookup!$K$9:$K$24,0))","v":{"$error":"#N/A"}},{"$f":"IF(E351=\"A\",INDEX(Lookup!$L$9:$L$24,MATCH(Z351,Lookup!$K$9:$K$24,0)),IF(E351=\"B\",INDEX(Lookup!$M$9:$M$24,MATCH(Z351,Lookup!$K$9:$K$24,0)),IF(E351=\"C\",INDEX(Lookup!$N$9:$N$24,MATCH(Z351,Lookup!$K$9:$K$24,0)),\"N/A\")))","v":{"$error":"#N/A"}}]
[null,null,null,null,{"$f":"INDEX(Lookup!$I$9:$I$24,MATCH('Interior Lighting'!D352,Lookup!$C$9:$C$24,0))","v":{"$error":"#N/A"}},null,null,null,{"$error":"#N/A"},null,0,{"$error":"#DIV/0!"},"N/A",{"$f":"IF($D$20=\"Space-By-Space (90.1-2010)\",INDEX(LPD2010SS,MATCH('Interior Lighting'!D352,LightingSpaceType,0)*W352),INDEX(LPD2010WB,MATCH('Interior Lighting'!D352,LightingSpaceType,0)))","v":{"$error":"#N/A"}},0,{"$error":"#N/A"},{"$error":"#N/A"},{"$error":"#N/A"},0,"",null,null,1,null,{"$error":"#N/A"},{"$error":"#N/A"},{"$f":"INDEX(Lookup!$O$9:$O$24,MATCH('Interior Lighting'!Z352,Lookup!$K$9:$K$24,0))","v":{"$error":"#N/A"}},{"$f":"IF(E352=\"A\",INDEX(Lookup!$L$9:$L$24,MATCH(Z352,Lookup!$K$9:$K$24,0)),IF(E352=\"B\",INDEX(Lookup!$M$9:$M$24,MATCH(Z352,Lookup!$K$9:$K$24,0)),IF(E352=\"C\",INDEX(Lookup!$N$9:$N$24,MATCH(Z352,Lookup!$K$9:$K$24,0)),\"N/A\")))","v":{"$error":"#N/A"}}]
[null,null,null,null,{"$f":"INDEX(Lookup!$I$9:$I$24,MATCH('Interior Lighting'!D353,Lookup!$C$9:$C$24,0))","v":{"$error":"#N/A"}},null,null,null,{"$error":"#N/A"},null,0,{"$error":"#DIV/0!"},"N/A",{"$f":"IF($D$20=\"Space-By-Space (90.1-2010)\",INDEX(LPD2010SS,MATCH('Interior Lighting'!D353,LightingSpaceType,0)*W353),INDEX(LPD2010WB,MATCH('Interior Lighting'!D353,LightingSpaceType,0)))","v":{"$error":"#N/A"}},0,{"$error":"#N/A"},{"$error":"#N/A"},{"$error":"#N/A"},0,"",null,null,1,null,{"$error":"#N/A"},{"$error":"#N/A"},{"$f":"INDEX(Lookup!$O$9:$O$24,MATCH('Interior Lighting'!Z353,Lookup!$K$9:$K$24,0))","v":{"$error":"#N/A"}},{"$f":"IF(E353=\"A\",INDEX(Lookup!$L$9:$L$24,MATCH(Z353,Lookup!$K$9:$K$24,0)),IF(E353=\"B\",INDEX(Lookup!$M$9:$M$24,MATCH(Z353,Lookup!$K$9:$K$24,0)),IF(E353=\"C\",INDEX(Lookup!$N$9:$N$24,MATCH(Z353,Lookup!$K$9:$K$24,0)),\"N/A\")))","v":{"$error":"#N/A"}}]
[null,null,null,null,{"$f":"INDEX(Lookup!$I$9:$I$24,MATCH('Interior Lighting'!D354,Lookup!$C$9:$C$24,0))","v":{"$error":"#N/A"}},null,null,null,{"$error":"#N/A"},null,0,{"$error":"#DIV/0!"},"N/A",{"$f":"IF($D$20=\"Space-By-Space (90.1-2010)\",INDEX(LPD2010SS,MATCH('Interior Lighting'!D354,LightingSpaceType,0)*W354),INDEX(LPD2010WB,MATCH('Interior Lighting'!D354,LightingSpaceType,0)))","v":{"$error":"#N/A"}},0,{"$error":"#N/A"},{"$error":"#N/A"},{"$error":"#N/A"},0,"",null,null,1,null,{"$error":"#N/A"},{"$error":"#N/A"},{"$f":"INDEX(Lookup!$O$9:$O$24,MATCH('Interior Lighting'!Z354,Lookup!$K$9:$K$24,0))","v":{"$error":"#N/A"}},{"$f":"IF(E354=\"A\",INDEX(Lookup!$L$9:$L$24,MATCH(Z354,Lookup!$K$9:$K$24,0)),IF(E354=\"B\",INDEX(Lookup!$M$9:$M$24,MATCH(Z354,Lookup!$K$9:$K$24,0)),IF(E354=\"C\",INDEX(Lookup!$N$9:$N$24,MATCH(Z354,Lookup!$K$9:$K$24,0)),\"N/A\")))","v":{"$error":"#N/A"}}]
[null,null,null,null,{"$f":"INDEX(Lookup!$I$9:$I$24,MATCH('Interior Lighting'!D355,Lookup!$C$9:$C$24,0))","v":{"$error":"#N/A"}},null,null,null,{"$error":"#N/A"},null,0,{"$error":"#DIV/0!"},"N/A",{"$f":"IF($D$20=\"Space-By-Space (90.1-2010)\",INDEX(LPD2010SS,MATCH('Interior Lighting'!D355,LightingSpaceType,0)*W355),INDEX(LPD2010WB,MATCH('Interior Lighting'!D355,LightingSpaceType,0)))","v":{"$error":"#N/A"}},0,{"$error":"#N/A"},{"$error":"#N/A"},{"$error":"#N/A"},0,"",null,null,1,null,{"$error":"#N/A"},{"$error":"#N/A"},{"$f":"INDEX(Lookup!$O$9:$O$24,MATCH('Interior Lighting'!Z355,Lookup!$K$9:$K$24,0))","v":{"$error":"#N/A"}},{"$f":"IF(E355=\"A\",INDEX(Lookup!$L$9:$L$24,MATCH(Z355,Lookup!$K$9:$K$24,0)),IF(E355=\"B\",INDEX(Lookup!$M$9:$M$24,MATCH(Z355,Lookup!$K$9:$K$24,0)),IF(E355=\"C\",INDEX(Lookup!$N$9:$N$24,MATCH(Z355,Lookup!$K$9:$K$24,0)),\"N/A\")))","v":{"$error":"#N/A"}}]
[null,null,null,null,{"$f":"INDEX(Lookup!$I$9:$I$24,MATCH('Interior Lighting'!D356,Lookup!$C$9:$C$24,0))","v":{"$error":"#N/A"}},null,null,null,{"$error":"#N/A"},null,0,{"$error":"#DIV/0!"},"N/A",{"$f":"IF($D$20=\"Space-By-Space (90.1-2010)\",INDEX(LPD2010SS,MATCH('Interior Lighting'!D356,LightingSpaceType,0)*W356),INDEX(LPD2010WB,MATCH('Interior Lighting'!D356,LightingSpaceType,0)))","v":{"$error":"#N/A"}},0,{"$error":"#N/A"},{"$error":"#N/A"},{"$error":"#N/A"},0,"",null,null,1,null,{"$error":"#N/A"},{"$error":"#N/A"},{"$f":"INDEX(Lookup!$O$9:$O$24,MATCH('Interior Lighting'!Z356,Lookup!$K$9:$K$24,0))","v":{"$error":"#N/A"}},{"$f":"IF(E356=\"A\",INDEX(Lookup!$L$9:$L$24,MATCH(Z356,Lookup!$K$9:$K$24,0)),IF(E356=\"B\",INDEX(Lookup!$M$9:$M$24,MATCH(Z356,Lookup!$K$9:$K$24,0)),IF(E356=\"C\",INDEX(Lookup!$N$9:$N$24,MATCH(Z356,Lookup!$K$9:$K$24,0)),\"N/A\")))","v":{"$error":"#N/A"}}]
[null,null,null,null,{"$f":"INDEX(Lookup!$I$9:$I$24,MATCH('Interior Lighting'!D357,Lookup!$C$9:$C$24,0))","v":{"$error":"#N/A"}},null,null,null,{"$error":"#N/A"},null,0,{"$error":"#DIV/0!"},"N/A",{"$f":"IF($D$20=\"Space-By-Space (90.1-2010)\",INDEX(LPD2010SS,MATCH('Interior Lighting'!D357,LightingSpaceType,0)*W357),INDEX(LPD2010WB,MATCH('Interior Lighting'!D357,LightingSpaceType,0)))","v":{"$error":"#N/A"}},0,{"$error":"#N/A"},{"$error":"#N/A"},{"$error":"#N/A"},0,"",null,null,1,null,{"$error":"#N/A"},{"$error":"#N/A"},{"$f":"INDEX(Lookup!$O$9:$O$24,MATCH('Interior Lighting'!Z357,Lookup!$K$9:$K$24,0))","v":{"$error":"#N/A"}},{"$f":"IF(E357=\"A\",INDEX(Lookup!$L$9:$L$24,MATCH(Z357,Lookup!$K$9:$K$24,0)),IF(E357=\"B\",INDEX(Lookup!$M$9:$M$24,MATCH(Z357,Lookup!$K$9:$K$24,0)),IF(E357=\"C\",INDEX(Lookup!$N$9:$N$24,MATCH(Z357,Lookup!$K$9:$K$24,0)),\"N/A\")))","v":{"$error":"#N/A"}}]
[null,null,null,null,{"$f":"INDEX(Lookup!$I$9:$I$24,MATCH('Interior Lighting'!D358,Lookup!$C$9:$C$24,0))","v":{"$error":"#N/A"}},null,null,null,{"$error":"#N/A"},null,0,{"$error":"#DIV/0!"},"N/A",{"$f":"IF($D$20=\"Space-By-Space (90.1-2010)\",INDEX(LPD2010SS,MATCH('Interior Lighting'!D358,LightingSpaceType,0)*W358),INDEX(LPD2010WB,MATCH('Interior Lighting'!D358,LightingSpaceType,0)))","v":{"$error":"#N/A"}},0,{"$error":"#N/A"},{"$error":"#N/A"},{"$error":"#N/A"},0,"",null,null,1,null,{"$error":"#N/A"},{"$error":"#N/A"},{"$f":"INDEX(Lookup!$O$9:$O$24,MATCH('Interior Lighting'!Z358,Lookup!$K$9:$K$24,0))","v":{"$error":"#N/A"}},{"$f":"IF(E358=\"A\",INDEX(Lookup!$L$9:$L$24,MATCH(Z358,Lookup!$K$9:$K$24,0)),IF(E358=\"B\",INDEX(Lookup!$M$9:$M$24,MATCH(Z358,Lookup!$K$9:$K$24,0)),IF(E358=\"C\",INDEX(Lookup!$N$9:$N$24,MATCH(Z358,Lookup!$K$9:$K$24,0)),\"N/A\")))","v":{"$error":"#N/A"}}]
[null,null,null,null,{"$f":"INDEX(Lookup!$I$9:$I$24,MATCH('Interior Lighting'!D359,Lookup!$C$9:$C$24,0))","v":{"$error":"#N/A"}},null,null,null,{"$error":"#N/A"},null,0,{"$error":"#DIV/0!"},"N/A",{"$f":"IF($D$20=\"Space-By-Space (90.1-2010)\",INDEX(LPD2010SS,MATCH('Interior Lighting'!D359,LightingSpaceType,0)*W359),INDEX(LPD2010WB,MATCH('Interior Lighting'!D359,LightingSpaceType,0)))","v":{"$error":"#N/A"}},0,{"$error":"#N/A"},{"$error":"#N/A"},{"$error":"#N/A"},0,"",null,null,1,null,{"$error":"#N/A"},{"$error":"#N/A"},{"$f":"INDEX(Lookup!$O$9:$O$24,MATCH('Interior Lighting'!Z359,Lookup!$K$9:$K$24,0))","v":{"$error":"#N/A"}},{"$f":"IF(E359=\"A\",INDEX(Lookup!$L$9:$L$24,MATCH(Z359,Lookup!$K$9:$K$24,0)),IF(E359=\"B\",INDEX(Lookup!$M$9:$M$24,MATCH(Z359,Lookup!$K$9:$K$24,0)),IF(E359=\"C\",INDEX(Lookup!$N$9:$N$24,MATCH(Z359,Lookup!$K$9:$K$24,0)),\"N/A\")))","v":{"$error":"#N/A"}}]
[null,null,null,null,{"$f":"INDEX(Lookup!$I$9:$I$24,MATCH('Interior Lighting'!D360,Lookup!$C$9:$C$24,0))","v":{"$error":"#N/A"}},null,null,null,{"$error":"#N/A"},null,0,{"$error":"#DIV/0!"},"N/A",{"$f":"IF($D$20=\"Space-By-Space (90.1-2010)\",INDEX(LPD2010SS,MATCH('Interior Lighting'!D360,LightingSpaceType,0)*W360),INDEX(LPD2010WB,MATCH('Interior Lighting'!D360,LightingSpaceType,0)))","v":{"$error":"#N/A"}},0,{"$error":"#N/A"},{"$error":"#N/A"},{"$error":"#N/A"},0,"",null,null,1,null,{"$error":"#N/A"},{"$error":"#N/A"},{"$f":"INDEX(Lookup!$O$9:$O$24,MATCH('Interior Lighting'!Z360,Lookup!$K$9:$K$24,0))","v":{"$error":"#N/A"}},{"$f":"IF(E360=\"A\",INDEX(Lookup!$L$9:$L$24,MATCH(Z360,Lookup!$K$9:$K$24,0)),IF(E360=\"B\",INDEX(Lookup!$M$9:$M$24,MATCH(Z360,Lookup!$K$9:$K$24,0)),IF(E360=\"C\",INDEX(Lookup!$N$9:$N$24,MATCH(Z360,Lookup!$K$9:$K$24,0)),\"N/A\")))","v":{"$error":"#N/A"}}]
[null,null,null,null,{"$f":"INDEX(Lookup!$I$9:$I$24,MATCH('Interior Lighting'!D361,Lookup!$C$9:$C$24,0))","v":{"$error":"#N/A"}},null,"a",null,0,null,0,{"$error":"#DIV/0!"},"N/A",{"$f":"IF($D$20=\"Space-By-Space (90.1-2010)\",INDEX(LPD2010SS,MATCH('Interior Lighting'!D361,LightingSpaceType,0)*W361),INDEX(LPD2010WB,MATCH('Interior Lighting'!D361,LightingSpaceType,0)))","v":{"$error":"#N/A"}},0,{"$error":"#N/A"},{"$error":"#N/A"},{"$error":"#N/A"},0,"",null,null,1,null,{"$error":"#N/A"},0,{"$f":"INDEX(Lookup!$O$9:$O$24,MATCH('Interior Lighting'!Z361,Lookup!$K$9:$K$24,0))","v":{"$error":"#N/A"}},{"$f":"IF(E361=\"A\",INDEX(Lookup!$L$9:$L$24,MATCH(Z361,Lookup!$K$9:$K$24,0)),IF(E361=\"B\",INDEX(Lookup!$M$9:$M$24,MATCH(Z361,Lookup!$K$9:$K$24,0)),IF(E361=\"C\",INDEX(Lookup!$N$9:$N$24,MATCH(Z361,Lookup!$K$9:$K$24,0)),\"N/A\")))","v":{"$error":"#N/A"}}]
[]
[]
[]
[]
[null,"Partner Notes - Use this section to include any notes about the information entered above."]

{"sheet":"In-Unit Lighting","index":21,"n_rows":75,"n_cols":23,"rows_kept":75,"cut":false,"hidden":false,"merged":[[54,1,54,6],[50,1,50,4],[51,1,51,4],[4,1,4,15],[6,1,6,15],[46,1,46,5],[47,1,47,4],[48,1,48,4],[49,1,49,4]]}
[null,"Calculator - In-Unit Lighting"]
[]
[null,"Instructions:"]
[1,"Include all in-unit hard-wired lighting in this table. Rated wattage must include ballast (follow 90.1 User's manual or Appendix B of Performance Path Requirements)."]
[2,"Only the rooms for which there are specified hard-wired lighting fixtures should be entered in this table. Therefore, the total square feet that you list in this table might be smaller than the total square feet of the apartments. If there are multiple fixtures per room, distribute area accordingly."]
[3,"Rooms with more than one fixture type should be entered using multiple rows; square footage should be distributed between entries."]
[4,"Likewise, for some rooms, the areas for which lighting is specified may be LESS than the total area of the room. If the specified fixtures are intended to light only a portion of the room, enter the square feet of the lighted area only, per your own estimation, but not to exceed 3 square feet per Watt. (Ex. A 13 Watt wall sconce in a bedroom can light at most 39 square feet and should not be modeled as lighting the entire space.)"]
[5,"Enter data in the cells highlighted in this color. "]
[6,"Do not edit cells highlighted in this color."]
[7,"Do not edit cells highlighted in this color. These calculated values are to be entered into software as W/SF for Apartment zones."]
[8,"Cells highlighted in yellow indicate spaces where estimated lumen output of fixture does not provide minimum illumination (10 lumens/SqFt) per IESNA."]
[]
[]
[null,"In-Unit Lighting Table"]
[null,"Room Name","Room Area, SqFt","Quantity","Fixture Code (from Interior Lighting tab)","Fixture Wattage","TEF","Lm/W","Light Source & Distribution","LLF","Cu","Number of such rooms in the building","Total Area, SqFt","Total Installed Wattage, W","Illumination (footcandles or\nlumens/SqFt)","Room Lighting Power Density, W/SF"]
[null,null,null,null,null,{"$f":"IF(E16=\"\",0,INDEX('Interior Lighting'!$L$4:$L$27,MATCH(E16,'Interior Lighting'!$J$4:$J$27,0)))","v":0},{"$f":"H16*J16*K16","v":{"$error":"#N/A"}},{"$f":"INDEX('Interior Lighting'!$M$4:$M$27,MATCH(E16,'Interior Lighting'!$J$4:$J$27,0))","v":{"$error":"#N/A"}},{"$f":"INDEX('Interior Lighting'!$K$4:$K$27,MATCH(E16,'Interior Lighting'!$J$4:$J$27,0))","v":{"$error":"#N/A"}},{"$f":"INDEX(Lookup!$O$9:$O$24,MATCH(I16,Lookup!$K$9:$K$24,0))","v":{"$error":"#N/A"}},{"$f":"INDEX(Lookup!$M$9:$M$24,MATCH(I16,Lookup!$K$9:$K$24,0))","v":{"$error":"#N/A"}},null,{"$f":"C16*L16","v":0},{"$f":"D16*F16*L16","v":0},{"$f":"IF(G16>0, D16*F16*G16/C16, \"0.0\")","v":{"$error":"#N/A"}},{"$f":"F16*D16/C16","v":{"$error":"#DIV/0!"}},{"$f":"IF(C16>0, IF(C16>3*D16*F16, \" Confirm that instruction 4 above has been followed.\", \"\"), \"\")","v":""},null,null,null,null,null,{"$f":"O16*C16*L16","v":{"$error":"#N/A"}}]
[null,null,null,null,null,{"$f":"IF(E17=\"\",0,INDEX('Interior Lighting'!$L$4:$L$27,MATCH(E17,'Interior Lighting'!$J$4:$J$27,0)))","v":0},{"$f":"H17*J17*K17","v":{"$error":"#N/A"}},{"$f":"INDEX('Interior Lighting'!$M$4:$M$27,MATCH(E17,'Interior Lighting'!$J$4:$J$27,0))","v":{"$error":"#N/A"}},{"$f":"INDEX('Interior Lighting'!$K$4:$K$27,MATCH(E17,'Interior Lighting'!$J$4:$J$27,0))","v":{"$error":"#N/A"}},{"$f":"INDEX(Lookup!$O$9:$O$24,MATCH(I17,Lookup!$K$9:$K$24,0))","v":{"$error":"#N/A"}},{"$f":"INDEX(Lookup!$M$9:$M$24,MATCH(I17,Lookup!$K$9:$K$24,0))","v":{"$error":"#N/A"}},null,{"$f":"C17*L17","v":0},{"$f":"D17*F17*L17","v":0},{"$f":"IF(G17>0, D17*F17*G17/C17, \"0.0\")","v":{"$error":"#N/A"}},{"$f":"F17*D17/C17","v":{"$error":"#DIV/0!"}},{"$f":"IF(C17>0, IF(C17>3*D17*F17, \" Confirm that instruction 4 above has been followed.\", \"\"), \"\")","v":""},null,null,null,null,null,{"$f":"O17*C17*L17","v":{"$error":"#N/A"}}]
[null,null,null,null,null,{"$f":"IF(E18=\"\",0,INDEX('Interior Lighting'!$L$4:$L$27,MATCH(E18,'Interior Lighting'!$J$4:$J$27,0)))","v":0},{"$error":"#N/A"},{"$f":"INDEX('Interior Lighting'!$M$4:$M$27,MATCH(E18,'Interior Lighting'!$J$4:$J$27,0))","v":{"$error":"#N/A"}},{"$f":"INDEX('Interior Lighting'!$K$4:$K$27,MATCH(E18,'Interior Lighting'!$J$4:$J$27,0))","v":{"$error":"#N/A"}},{"$f":"INDEX(Lookup!$O$9:$O$24,MATCH(I18,Lookup!$K$9:$K$24,0))","v":{"$error":"#N/A"}},{"$f":"INDEX(Lookup!$M$9:$M$24,MATCH(I18,Lookup!$K$9:$K$24,0))","v":{"$error":"#N/A"}},null,0,0,{"$error":"#N/A"},{"$error":"#DIV/0!"},"",null,null,null,null,null,{"$error":"#N/A"}]
[null,null,null,null,null,{"$f":"IF(E19=\"\",0,INDEX('Interior Lighting'!$L$4:$L$27,MATCH(E19,'Interior Lighting'!$J$4:$J$27,0)))","v":0},{"$error":"#N/A"},{"$f":"INDEX('Interior Lighting'!$M$4:$M$27,MATCH(E19,'Interior Lighting'!$J$4:$J$27,0))","v":{"$error":"#N/A"}},{"$f":"INDEX('Interior Lighting'!$K$4:$K$27,MATCH(E19,'Interior Lighting'!$J$4:$J$27,0))","v":{"$error":"#N/A"}},{"$f":"INDEX(Lookup!$O$9:$O$24,MATCH(I19,Lookup!$K$9:$K$24,0))","v":{"$error":"#N/A"}},{"$f":"INDEX(Lookup!$M$9:$M$24,MATCH(I19,Lookup!$K$9:$K$24,0))","v":{"$error":"#N/A"}},null,0,0,{"$error":"#N/A"},{"$error":"#DIV/0!"},"",null,null,null,null,null,{"$error":"#N/A"}]
[null,null,null,null,null,{"$f":"IF(E20=\"\",0,INDEX('Interior Lighting'!$L$4:$L$27,MATCH(E20,'Interior Lighting'!$J$4:$J$27,0)))","v":0},{"$error":"#N/A"},{"$f":"INDEX('Interior Lighting'!$M$4:$M$27,MATCH(E20,'Interior Lighting'!$J$4:$J$27,0))","v":{"$error":"#N/A"}},{"$f":"INDEX('Interior Lighting'!$K$4:$K$27,MATCH(E20,'Interior Lighting'!$J$4:$J$27,0))","v":{"$error":"#N/A"}},{"$f":"INDEX(Lookup!$O$9:$O$24,MATCH(I20,Lookup!$K$9:$K$24,0))","v":{"$error":"#N/A"}},{"$f":"INDEX(Lookup!$M$9:$M$24,MATCH(I20,Lookup!$K$9:$K$24,0))","v":{"$error":"#N/A"}},null,0,0,{"$error":"#N/A"},{"$error":"#DIV/0!"},"",null,null,null,null,null,{"$error":"#N/A"}]
[null,null,null,null,null,{"$f":"IF(E21=\"\",0,INDEX('Interior Lighting'!$L$4:$L$27,MATCH(E21,'Interior Lighting'!$J$4:$J$27,0)))","v":0},{"$error":"#N/A"},{"$f":"INDEX('Interior Lighting'!$M$4:$M$27,MATCH(E21,'Interior Lighting'!$J$4:$J$27,0))","v":{"$error":"#N/A"}},{"$f":"INDEX('Interior Lighting'!$K$4:$K$27,MATCH(E21,'Interior Lighting'!$J$4:$J$27,0))","v":{"$error":"#N/A"}},{"$f":"INDEX(Lookup!$O$9:$O$24,MATCH(I21,Lookup!$K$9:$K$24,0))","v":{"$error":"#N/A"}},{"$f":"INDEX(Lookup!$M$9:$M$24,MATCH(I21,Lookup!$K$9:$K$24,0))","v":{"$error":"#N/A"}},null,0,0,{"$error":"#N/A"},{"$error":"#DIV/0!"},"",null,null,null,null,null,{"$error":"#N/A"}]
[null,null,null,null,null,{"$f":"IF(E22=\"\",0,INDEX('Interior Lighting'!$L$4:$L$27,MATCH(E22,'Interior Lighting'!$J$4:$J$27,0)))","v":0},{"$error":"#N/A"},{"$f":"INDEX('Interior Lighting'!$M$4:$M$27,MATCH(E22,'Interior Lighting'!$J$4:$J$27,0))","v":{"$error":"#N/A"}},{"$f":"INDEX('Interior Lighting'!$K$4:$K$27,MATCH(E22,'Interior Lighting'!$J$4:$J$27,0))","v":{"$error":"#N/A"}},{"$f":"INDEX(Lookup!$O$9:$O$24,MATCH(I22,Lookup!$K$9:$K$24,0))","v":{"$error":"#N/A"}},{"$f":"INDEX(Lookup!$M$9:$M$24,MATCH(I22,Lookup!$K$9:$K$24,0))","v":{"$error":"#N/A"}},null,0,0,{"$error":"#N/A"},{"$error":"#DIV/0!"},"",null,null,null,null,null,{"$error":"#N/A"}]
[null,null,null,null,null,{"$f":"IF(E23=\"\",0,INDEX('Interior Lighting'!$L$4:$L$27,MATCH(E23,'Interior Lighting'!$J$4:$J$27,0)))","v":0},{"$error":"#N/A"},{"$f":"INDEX('Interior Lighting'!$M$4:$M$27,MATCH(E23,'Interior Lighting'!$J$4:$J$27,0))","v":{"$error":"#N/A"}},{"$f":"INDEX('Interior Lighting'!$K$4:$K$27,MATCH(E23,'Interior Lighting'!$J$4:$J$27,0))","v":{"$error":"#N/A"}},{"$f":"INDEX(Lookup!$O$9:$O$24,MATCH(I23,Lookup!$K$9:$K$24,0))","v":{"$error":"#N/A"}},{"$f":"INDEX(Lookup!$M$9:$M$24,MATCH(I23,Lookup!$K$9:$K$24,0))","v":{"$error":"#N/A"}},null,0,0,{"$error":"#N/A"},{"$error":"#DIV/0!"},"",null,null,null,null,null,{"$error":"#N/A"}]
[null,null,null,null,null,{"$f":"IF(E24=\"\",0,INDEX('Interior Lighting'!$L$4:$L$27,MATCH(E24,'Interior Lighting'!$J$4:$J$27,0)))","v":0},{"$error":"#N/A"},{"$f":"INDEX('Interior Lighting'!$M$4:$M$27,MATCH(E24,'Interior Lighting'!$J$4:$J$27,0))","v":{"$error":"#N/A"}},{"$f":"INDEX('Interior Lighting'!$K$4:$K$27,MATCH(E24,'Interior Lighting'!$J$4:$J$27,0))","v":{"$error":"#N/A"}},{"$f":"INDEX(Lookup!$O$9:$O$24,MATCH(I24,Lookup!$K$9:$K$24,0))","v":{"$error":"#N/A"}},{"$f":"INDEX(Lookup!$M$9:$M$24,MATCH(I24,Lookup!$K$9:$K$24,0))","v":{"$error":"#N/A"}},null,0,0,{"$error":"#N/A"},{"$error":"#DIV/0!"},"",null,null,null,null,null,{"$error":"#N/A"}]
[null,null,null,null,null,{"$f":"IF(E25=\"\",0,INDEX('Interior Lighting'!$L$4:$L$27,MATCH(E25,'Interior Lighting'!$J$4:$J$27,0)))","v":0},{"$error":"#N/A"},{"$f":"INDEX('Interior Lighting'!$M$4:$M$27,MATCH(E25,'Interior Lighting'!$J$4:$J$27,0))","v":{"$error":"#N/A"}},{"$f":"INDEX('Interior Lighting'!$K$4:$K$27,MATCH(E25,'Interior Lighting'!$J$4:$J$27,0))","v":{"$error":"#N/A"}},{"$f":"INDEX(Lookup!$O$9:$O$24,MATCH(I25,Lookup!$K$9:$K$24,0))","v":{"$error":"#N/A"}},{"$f":"INDEX(Lookup!$M$9:$M$24,MATCH(I25,Lookup!$K$9:$K$24,0))","v":{"$error":"#N/A"}},null,0,0,{"$error":"#N/A"},{"$error":"#DIV/0!"},"",null,null,null,null,null,{"$error":"#N/A"}]
[null,null,null,null,null,{"$f":"IF(E26=\"\",0,INDEX('Interior Lighting'!$L$4:$L$27,MATCH(E26,'Interior Lighting'!$J$4:$J$27,0)))","v":0},{"$error":"#N/A"},{"$f":"INDEX('Interior Lighting'!$M$4:$M$27,MATCH(E26,'Interior Lighting'!$J$4:$J$27,0))","v":{"$error":"#N/A"}},{"$f":"INDEX('Interior Lighting'!$K$4:$K$27,MATCH(E26,'Interior Lighting'!$J$4:$J$27,0))","v":{"$error":"#N/A"}},{"$f":"INDEX(Lookup!$O$9:$O$24,MATCH(I26,Lookup!$K$9:$K$24,0))","v":{"$error":"#N/A"}},{"$f":"INDEX(Lookup!$M$9:$M$24,MATCH(I26,Lookup!$K$9:$K$24,0))","v":{"$error":"#N/A"}},null,0,0,{"$error":"#N/A"},{"$error":"#DIV/0!"},"",null,null,null,null,null,{"$error":"#N/A"}]
[null,null,null,null,null,{"$f":"IF(E27=\"\",0,INDEX('Interior Lighting'!$L$4:$L$27,MATCH(E27,'Interior Lighting'!$J$4:$J$27,0)))","v":0},{"$error":"#N/A"},{"$f":"INDEX('Interior Lighting'!$M$4:$M$27,MATCH(E27,'Interior Lighting'!$J$4:$J$27,0))","v":{"$error":"#N/A"}},{"$f":"INDEX('Interior Lighting'!$K$4:$K$27,MATCH(E27,'Interior Lighting'!$J$4:$J$27,0))","v":{"$error":"#N/A"}},{"$f":"INDEX(Lookup!$O$9:$O$24,MATCH(I27,Lookup!$K$9:$K$24,0))","v":{"$error":"#N/A"}},{"$f":"INDEX(Lookup!$M$9:$M$24,MATCH(I27,Lookup!$K$9:$K$24,0))","v":{"$error":"#N/A"}},null,0,0,{"$error":"#N/A"},{"$error":"#DIV/0!"},"",null,null,null,null,null,{"$error":"#N/A"}]
[null,null,null,null,null,{"$f":"IF(E28=\"\",0,INDEX('Interior Lighting'!$L$4:$L$27,MATCH(E28,'Interior Lighting'!$J$4:$J$27,0)))","v":0},{"$error":"#N/A"},{"$f":"INDEX('Interior Lighting'!$M$4:$M$27,MATCH(E28,'Interior Lighting'!$J$4:$J$27,0))","v":{"$error":"#N/A"}},{"$f":"INDEX('Interior Lighting'!$K$4:$K$27,MATCH(E28,'Interior Lighting'!$J$4:$J$27,0))","v":{"$error":"#N/A"}},{"$f":"INDEX(Lookup!$O$9:$O$24,MATCH(I28,Lookup!$K$9:$K$24,0))","v":{"$error":"#N/A"}},{"$f":"INDEX(Lookup!$M$9:$M$24,MATCH(I28,Lookup!$K$9:$K$24,0))","v":{"$error":"#N/A"}},null,0,0,{"$error":"#N/A"},{"$error":"#DIV/0!"},"",null,null,null,null,null,{"$error":"#N/A"}]
[null,null,null,null,null,{"$f":"IF(E29=\"\",0,INDEX('Interior Lighting'!$L$4:$L$27,MATCH(E29,'Interior Lighting'!$J$4:$J$27,0)))","v":0},{"$error":"#N/A"},{"$f":"INDEX('Interior Lighting'!$M$4:$M$27,MATCH(E29,'Interior Lighting'!$J$4:$J$27,0))","v":{"$error":"#N/A"}},{"$f":"INDEX('Interior Lighting'!$K$4:$K$27,MATCH(E29,'Interior Lighting'!$J$4:$J$27,0))","v":{"$error":"#N/A"}},{"$f":"INDEX(Lookup!$O$9:$O$24,MATCH(I29,Lookup!$K$9:$K$24,0))","v":{"$error":"#N/A"}},{"$f":"INDEX(Lookup!$M$9:$M$24,MATCH(I29,Lookup!$K$9:$K$24,0))","v":{"$error":"#N/A"}},null,0,0,{"$error":"#N/A"},{"$error":"#DIV/0!"},"",null,null,null,null,null,{"$error":"#N/A"}]
[null,null,null,null,null,{"$f":"IF(E30=\"\",0,INDEX('Interior Lighting'!$L$4:$L$27,MATCH(E30,'Interior Lighting'!$J$4:$J$27,0)))","v":0},{"$error":"#N/A"},{"$f":"INDEX('Interior Lighting'!$M$4:$M$27,MATCH(E30,'Interior Lighting'!$J$4:$J$27,0))","v":{"$error":"#N/A"}},{"$f":"INDEX('Interior Lighting'!$K$4:$K$27,MATCH(E30,'Interior Lighting'!$J$4:$J$27,0))","v":{"$error":"#N/A"}},{"$f":"INDEX(Lookup!$O$9:$O$24,MATCH(I30,Lookup!$K$9:$K$24,0))","v":{"$error":"#N/A"}},{"$f":"INDEX(Lookup!$M$9:$M$24,MATCH(I30,Lookup!$K$9:$K$24,0))","v":{"$error":"#N/A"}},null,0,0,{"$error":"#N/A"},{"$error":"#DIV/0!"},"",null,null,null,null,null,{"$error":"#N/A"}]
[null,null,null,null,null,{"$f":"IF(E31=\"\",0,INDEX('Interior Lighting'!$L$4:$L$27,MATCH(E31,'Interior Lighting'!$J$4:$J$27,0)))","v":0},{"$error":"#N/A"},{"$f":"INDEX('Interior Lighting'!$M$4:$M$27,MATCH(E31,'Interior Lighting'!$J$4:$J$27,0))","v":{"$error":"#N/A"}},{"$f":"INDEX('Interior Lighting'!$K$4:$K$27,MATCH(E31,'Interior Lighting'!$J$4:$J$27,0))","v":{"$error":"#N/A"}},{"$f":"INDEX(Lookup!$O$9:$O$24,MATCH(I31,Lookup!$K$9:$K$24,0))","v":{"$error":"#N/A"}},{"$f":"INDEX(Lookup!$M$9:$M$24,MATCH(I31,Lookup!$K$9:$K$24,0))","v":{"$error":"#N/A"}},null,0,0,{"$error":"#N/A"},{"$error":"#DIV/0!"},"",null,null,null,null,null,{"$error":"#N/A"}]
[null,null,null,null,null,{"$f":"IF(E32=\"\",0,INDEX('Interior Lighting'!$L$4:$L$27,MATCH(E32,'Interior Lighting'!$J$4:$J$27,0)))","v":0},{"$error":"#N/A"},{"$f":"INDEX('Interior Lighting'!$M$4:$M$27,MATCH(E32,'Interior Lighting'!$J$4:$J$27,0))","v":{"$error":"#N/A"}},{"$f":"INDEX('Interior Lighting'!$K$4:$K$27,MATCH(E32,'Interior Lighting'!$J$4:$J$27,0))","v":{"$error":"#N/A"}},{"$f":"INDEX(Lookup!$O$9:$O$24,MATCH(I32,Lookup!$K$9:$K$24,0))","v":{"$error":"#N/A"}},{"$f":"INDEX(Lookup!$M$9:$M$24,MATCH(I32,Lookup!$K$9:$K$24,0))","v":{"$error":"#N/A"}},null,0,0,{"$error":"#N/A"},{"$error":"#DIV/0!"},"",null,null,null,null,null,{"$error":"#N/A"}]
[null,null,null,null,null,{"$f":"IF(E33=\"\",0,INDEX('Interior Lighting'!$L$4:$L$27,MATCH(E33,'Interior Lighting'!$J$4:$J$27,0)))","v":0},{"$error":"#N/A"},{"$f":"INDEX('Interior Lighting'!$M$4:$M$27,MATCH(E33,'Interior Lighting'!$J$4:$J$27,0))","v":{"$error":"#N/A"}},{"$f":"INDEX('Interior Lighting'!$K$4:$K$27,MATCH(E33,'Interior Lighting'!$J$4:$J$27,0))","v":{"$error":"#N/A"}},{"$f":"INDEX(Lookup!$O$9:$O$24,MATCH(I33,Lookup!$K$9:$K$24,0))","v":{"$error":"#N/A"}},{"$f":"INDEX(Lookup!$M$9:$M$24,MATCH(I33,Lookup!$K$9:$K$24,0))","v":{"$error":"#N/A"}},null,0,0,{"$error":"#N/A"},{"$error":"#DIV/0!"},"",null,null,null,null,null,{"$error":"#N/A"}]
[null,null,null,null,null,{"$f":"IF(E34=\"\",0,INDEX('Interior Lighting'!$L$4:$L$27,MATCH(E34,'Interior Lighting'!$J$4:$J$27,0)))","v":0},{"$error":"#N/A"},{"$f":"INDEX('Interior Lighting'!$M$4:$M$27,MATCH(E34,'Interior Lighting'!$J$4:$J$27,0))","v":{"$error":"#N/A"}},{"$f":"INDEX('Interior Lighting'!$K$4:$K$27,MATCH(E34,'Interior Lighting'!$J$4:$J$27,0))","v":{"$error":"#N/A"}},{"$f":"INDEX(Lookup!$O$9:$O$24,MATCH(I34,Lookup!$K$9:$K$24,0))","v":{"$error":"#N/A"}},{"$f":"INDEX(Lookup!$M$9:$M$24,MATCH(I34,Lookup!$K$9:$K$24,0))","v":{"$error":"#N/A"}},null,0,0,{"$error":"#N/A"},{"$error":"#DIV/0!"},"",null,null,null,null,null,{"$error":"#N/A"}]
[null,null,null,null,null,{"$f":"IF(E35=\"\",0,INDEX('Interior Lighting'!$L$4:$L$27,MATCH(E35,'Interior Lighting'!$J$4:$J$27,0)))","v":0},{"$error":"#N/A"},{"$f":"INDEX('Interior Lighting'!$M$4:$M$27,MATCH(E35,'Interior Lighting'!$J$4:$J$27,0))","v":{"$error":"#N/A"}},{"$f":"INDEX('Interior Lighting'!$K$4:$K$27,MATCH(E35,'Interior Lighting'!$J$4:$J$27,0))","v":{"$error":"#N/A"}},{"$f":"INDEX(Lookup!$O$9:$O$24,MATCH(I35,Lookup!$K$9:$K$24,0))","v":{"$error":"#N/A"}},{"$f":"INDEX(Lookup!$M$9:$M$24,MATCH(I35,Lookup!$K$9:$K$24,0))","v":{"$error":"#N/A"}},null,0,0,{"$error":"#N/A"},{"$error":"#DIV/0!"},"",null,null,null,null,null,{"$error":"#N/A"}]
[null,null,null,null,null,{"$f":"IF(E36=\"\",0,INDEX('Interior Lighting'!$L$4:$L$27,MATCH(E36,'Interior Lighting'!$J$4:$J$27,0)))","v":0},{"$error":"#N/A"},{"$f":"INDEX('Interior Lighting'!$M$4:$M$27,MATCH(E36,'Interior Lighting'!$J$4:$J$27,0))","v":{"$error":"#N/A"}},{"$f":"INDEX('Interior Lighting'!$K$4:$K$27,MATCH(E36,'Interior Lighting'!$J$4:$J$27,0))","v":{"$error":"#N/A"}},{"$f":"INDEX(Lookup!$O$9:$O$24,MATCH(I36,Lookup!$K$9:$K$24,0))","v":{"$error":"#N/A"}},{"$f":"INDEX(Lookup!$M$9:$M$24,MATCH(I36,Lookup!$K$9:$K$24,0))","v":{"$error":"#N/A"}},null,0,0,{"$error":"#N/A"},{"$error":"#DIV/0!"},"",null,null,null,null,null,{"$error":"#N/A"}]
[null,null,null,null,null,{"$f":"IF(E37=\"\",0,INDEX('Interior Lighting'!$L$4:$L$27,MATCH(E37,'Interior Lighting'!$J$4:$J$27,0)))","v":0},{"$error":"#N/A"},{"$f":"INDEX('Interior Lighting'!$M$4:$M$27,MATCH(E37,'Interior Lighting'!$J$4:$J$27,0))","v":{"$error":"#N/A"}},{"$f":"INDEX('Interior Lighting'!$K$4:$K$27,MATCH(E37,'Interior Lighting'!$J$4:$J$27,0))","v":{"$error":"#N/A"}},{"$f":"INDEX(Lookup!$O$9:$O$24,MATCH(I37,Lookup!$K$9:$K$24,0))","v":{"$error":"#N/A"}},{"$f":"INDEX(Lookup!$M$9:$M$24,MATCH(I37,Lookup!$K$9:$K$24,0))","v":{"$error":"#N/A"}},null,0,0,{"$error":"#N/A"},{"$error":"#DIV/0!"},"",null,null,null,null,null,{"$error":"#N/A"}]
[null,null,null,null,null,{"$f":"IF(E38=\"\",0,INDEX('Interior Lighting'!$L$4:$L$27,MATCH(E38,'Interior Lighting'!$J$4:$J$27,0)))","v":0},{"$error":"#N/A"},{"$f":"INDEX('Interior Lighting'!$M$4:$M$27,MATCH(E38,'Interior Lighting'!$J$4:$J$27,0))","v":{"$error":"#N/A"}},{"$f":"INDEX('Interior Lighting'!$K$4:$K$27,MATCH(E38,'Interior Lighting'!$J$4:$J$27,0))","v":{"$error":"#N/A"}},{"$f":"INDEX(Lookup!$O$9:$O$24,MATCH(I38,Lookup!$K$9:$K$24,0))","v":{"$error":"#N/A"}},{"$f":"INDEX(Lookup!$M$9:$M$24,MATCH(I38,Lookup!$K$9:$K$24,0))","v":{"$error":"#N/A"}},null,0,0,{"$error":"#N/A"},{"$error":"#DIV/0!"},"",null,null,null,null,null,{"$error":"#N/A"}]
[null,null,null,null,null,{"$f":"IF(E39=\"\",0,INDEX('Interior Lighting'!$L$4:$L$27,MATCH(E39,'Interior Lighting'!$J$4:$J$27,0)))","v":0},{"$error":"#N/A"},{"$f":"INDEX('Interior Lighting'!$M$4:$M$27,MATCH(E39,'Interior Lighting'!$J$4:$J$27,0))","v":{"$error":"#N/A"}},{"$f":"INDEX('Interior Lighting'!$K$4:$K$27,MATCH(E39,'Interior Lighting'!$J$4:$J$27,0))","v":{"$error":"#N/A"}},{"$f":"INDEX(Lookup!$O$9:$O$24,MATCH(I39,Lookup!$K$9:$K$24,0))","v":{"$error":"#N/A"}},{"$f":"INDEX(Lookup!$M$9:$M$24,MATCH(I39,Lookup!$K$9:$K$24,0))","v":{"$error":"#N/A"}},null,0,0,{"$error":"#N/A"},{"$error":"#DIV/0!"},"",null,null,null,null,null,{"$error":"#N/A"}]
[null,null,null,null,null,{"$f":"IF(E40=\"\",0,INDEX('Interior Lighting'!$L$4:$L$27,MATCH(E40,'Interior Lighting'!$J$4:$J$27,0)))","v":0},{"$error":"#N/A"},{"$f":"INDEX('Interior Lighting'!$M$4:$M$27,MATCH(E40,'Interior Lighting'!$J$4:$J$27,0))","v":{"$error":"#N/A"}},{"$f":"INDEX('Interior Lighting'!$K$4:$K$27,MATCH(E40,'Interior Lighting'!$J$4:$J$27,0))","v":{"$error":"#N/A"}},{"$f":"INDEX(Lookup!$O$9:$O$24,MATCH(I40,Lookup!$K$9:$K$24,0))","v":{"$error":"#N/A"}},{"$f":"INDEX(Lookup!$M$9:$M$24,MATCH(I40,Lookup!$K$9:$K$24,0))","v":{"$error":"#N/A"}},null,0,0,{"$error":"#N/A"},{"$error":"#DIV/0!"},"",null,null,null,null,null,{"$error":"#N/A"}]
[null,null,null,null,null,{"$f":"IF(E41=\"\",0,INDEX('Interior Lighting'!$L$4:$L$27,MATCH(E41,'Interior Lighting'!$J$4:$J$27,0)))","v":0},{"$error":"#N/A"},{"$f":"INDEX('Interior Lighting'!$M$4:$M$27,MATCH(E41,'Interior Lighting'!$J$4:$J$27,0))","v":{"$error":"#N/A"}},{"$f":"INDEX('Interior Lighting'!$K$4:$K$27,MATCH(E41,'Interior Lighting'!$J$4:$J$27,0))","v":{"$error":"#N/A"}},{"$f":"INDEX(Lookup!$O$9:$O$24,MATCH(I41,Lookup!$K$9:$K$24,0))","v":{"$error":"#N/A"}},{"$f":"INDEX(Lookup!$M$9:$M$24,MATCH(I41,Lookup!$K$9:$K$24,0))","v":{"$error":"#N/A"}},null,0,0,{"$error":"#N/A"},{"$error":"#DIV/0!"},"",null,null,null,null,null,{"$error":"#N/A"}]
[null,null,null,null,null,{"$f":"IF(E42=\"\",0,INDEX('Interior Lighting'!$L$4:$L$27,MATCH(E42,'Interior Lighting'!$J$4:$J$27,0)))","v":0},{"$error":"#N/A"},{"$f":"INDEX('Interior Lighting'!$M$4:$M$27,MATCH(E42,'Interior Lighting'!$J$4:$J$27,0))","v":{"$error":"#N/A"}},{"$f":"INDEX('Interior Lighting'!$K$4:$K$27,MATCH(E42,'Interior Lighting'!$J$4:$J$27,0))","v":{"$error":"#N/A"}},{"$f":"INDEX(Lookup!$O$9:$O$24,MATCH(I42,Lookup!$K$9:$K$24,0))","v":{"$error":"#N/A"}},{"$f":"INDEX(Lookup!$M$9:$M$24,MATCH(I42,Lookup!$K$9:$K$24,0))","v":{"$error":"#N/A"}},null,0,0,{"$error":"#N/A"},{"$error":"#DIV/0!"},"",null,null,null,null,null,{"$error":"#N/A"}]
[null,null,null,null,null,{"$f":"IF(E43=\"\",0,INDEX('Interior Lighting'!$L$4:$L$27,MATCH(E43,'Interior Lighting'!$J$4:$J$27,0)))","v":0},{"$error":"#N/A"},{"$f":"INDEX('Interior Lighting'!$M$4:$M$27,MATCH(E43,'Interior Lighting'!$J$4:$J$27,0))","v":{"$error":"#N/A"}},{"$f":"INDEX('Interior Lighting'!$K$4:$K$27,MATCH(E43,'Interior Lighting'!$J$4:$J$27,0))","v":{"$error":"#N/A"}},{"$f":"INDEX(Lookup!$O$9:$O$24,MATCH(I43,Lookup!$K$9:$K$24,0))","v":{"$error":"#N/A"}},{"$f":"INDEX(Lookup!$M$9:$M$24,MATCH(I43,Lookup!$K$9:$K$24,0))","v":{"$error":"#N/A"}},null,0,0,{"$error":"#N/A"},{"$error":"#DIV/0!"},"",null,null,null,null,null,{"$error":"#N/A"}]
[null,null,null,null,null,{"$f":"IF(E44=\"\",0,INDEX('Interior Lighting'!$L$4:$L$27,MATCH(E44,'Interior Lighting'!$J$4:$J$27,0)))","v":0},{"$error":"#N/A"},{"$f":"INDEX('Interior Lighting'!$M$4:$M$27,MATCH(E44,'Interior Lighting'!$J$4:$J$27,0))","v":{"$error":"#N/A"}},{"$f":"INDEX('Interior Lighting'!$K$4:$K$27,MATCH(E44,'Interior Lighting'!$J$4:$J$27,0))","v":{"$error":"#N/A"}},{"$f":"INDEX(Lookup!$O$9:$O$24,MATCH(I44,Lookup!$K$9:$K$24,0))","v":{"$error":"#N/A"}},{"$f":"INDEX(Lookup!$M$9:$M$24,MATCH(I44,Lookup!$K$9:$K$24,0))","v":{"$error":"#N/A"}},null,0,0,{"$error":"#N/A"},{"$error":"#DIV/0!"},"",null,null,null,null,null,{"$error":"#N/A"}]
[]
[]
[null,"Summary",null,null,null,null,null,null,null,null,null,null,{"$f":"SUM(W16:W44)/F48","v":{"$error":"#N/A"}},"Weighted Average of installed footcandles must exceed 10"]
[null,"Total in-unit area with specified lighting, SqFt",null,null,null,{"$f":"SUM(M16:M44)","v":0}]
[null,"Total specified lighting, W",null,null,null,{"$f":"SUM(N16:N44)","v":0}]
[null,"Specified lighting power density, W/SqFt",null,null,null,{"$f":"IF(F48=0,\"NA\",F49/F48)","v":"NA"}]
[null,"Proposed lighting power density, W/SqFt",null,null,null,{"$f":"(F49+F52*('Basic Info'!C16-F48))/('Basic Info'!C16)","v":{"$error":"#DIV/0!"}}]
[null,"Baseline lighting power density, W/SqFt",null,null,null,0.6]
[]
[]
[null,"Partner Notes - Use this section to include any notes about the information entered above."]
[]
[]
[]
[]
[]
[]
[]
[]
[null,"Room Types"]
[null,"Bathroom"]
[null,"Bedroom"]
[null,"Closet"]
[null,"Dining Room"]
[null,"Family Room"]
[null,"Hall"]
[null,"Kitchen"]
[null,"Living Room"]
[null,"Office"]
[null,"Utility Room"]
[null,"Other"]

{"sheet":"Exterior Lighting","index":22,"n_rows":44,"n_cols":10,"rows_kept":44,"cut":false,"hidden":false,"merged":[[12,1,13,1],[43,1,43,6],[19,9,19,13],[12,2,12,4],[21,2,21,4]]}
[null,"Calculator - Exterior Lighting"]
[]
[null,"Instructions:"]
[1,"Select \"Exterior Lighting Zone\" from drop down list, based on exterior lighting zone type identified in 90.1-2010 Table 9.4.3A."]
[2,"Enter data in the cells highlighted with this color. "]
[3,"Use values from the cells highlighted in this color in the energy simulations. "]
[4,"In eQuest, exterior lighting should be entered in the \"Utility & Economics\" section, under Electric Meter as a Direct Exterior Load, with Exterior Usage enduse and a 12 hr/day schedule."]
[5,"For proposed design simulation enter exterior lighting specified on drawings."]
[6,"Apartment balcony lighting should be evaluated as Tradable Surfaces \"Other Doors\", and modeled using the 2.34 hr/day schedule. In eQUEST, assign to \"Exterior\" end use."]
[]
[null,"Exterior Lighting Zone","Zone 2"]
[]
[null,"Area Type","Lighting Power Density (W/sqft)",null,null,"Area","Baseline Lighting Allowance","Proposed Lighting","Proposed Fixture Description"]
[null,null,"Zone 2","Zone 3","Zone 4","SqFt","W","W"]
[null,"Uncovered parking lots and drives",0.06,0.1,0.13,null,{"$f":"IF($C$11=\"Zone 2\",C15*F15,IF($C$11=\"Zone 3\",D15*F15,IF($C$11=\"Zone 4\",E15*F15,\"\")))","v":0}]
[null,"Walkways 10ft wide or greater/Plaza areas/Special feature areas",0.14000000000000001,0.16,0.2,null,{"$f":"IF($C$11=\"Zone 2\",C16*F16,IF($C$11=\"Zone 3\",D16*F16,IF($C$11=\"Zone 4\",E16*F16,\"\")))","v":0}]
[null,"Stairways",1,1,1,null,0]
[null,"Entry canopies",0.25,0.4,0.4,null,0]
[null,"Landscaping",0.05,0.05,0.05,null,0]
[null,"Building Facades  (1)",0.1,0.15,0.2,null,0,null,null,{"$f":"IF(C36<H20,\"Proposed façade lighting cannot exceed Baseline allowance.\",\"\")","v":""}]
[]
[null,"Area Type","Lighting Power (W/linear foot)",null,null,"Linear feet","Baseline Lighting Allowance","Proposed Lighting","Proposed Fixture Description"]
[null,null,"Zone 2","Zone 3","Zone 4","Ft","W","W"]
[null,"Walkways less than 10 ft wide",0.7,0.8,1,null,{"$f":"IF($C$11=\"Zone 2\",C24*F24,IF($C$11=\"Zone 3\",D24*F24,IF($C$11=\"Zone 4\",E24*F24,\"\")))","v":0}]
[null,"Main entries (2)",20,30,30,null,{"$f":"IF($C$11=\"Zone 2\",C25*F25,IF($C$11=\"Zone 3\",D25*F25,IF($C$11=\"Zone 4\",E25*F25,\"\")))","v":0}]
[null,"Other doors (2)",20,20,20,null,0]
[null,"Apartment Balcony Doors (2)",20,20,20,null,0]
[null,"Building Facades  (3)",2.5,3.75,5,null,0]
[]
[null,"Base Site Allowance added to:","Non-Tradable"]
[null,"Base Site Allowance equal to:",{"$f":"IF(C11=\"Zone 2\",600,IF(C11=\"Zone 3\",750,IF(C11=\"Zone 4\",1300,\"\")))","v":600}]
[]
[null,"Total Exterior Building Allowance to be entered in Energy Models (4)"]
[null,null,"Baseline","Proposed"]
[null,"Tradable",{"$f":"IF(C30=\"Non-Tradable\",SUM(G15:G19)+SUM(G24:G27),SUM(G15:G19)+SUM(G24:G27)+C31)","v":0},{"$f":"SUM(H15:H19)+SUM(H24:H27)","v":0},"Watts"]
[null,"Non-Tradable",{"$f":"IF(C30=\"Tradable\",1.05*MAX(G20,G28),1.05*MAX(G20,G28)+C31)","v":600},{"$f":"IF(H20>C36, H20, C36)","v":600},"Watts","If Proposed façade lighting is less than Baseline allowance, model baseline the same as proposed. "]
[null,null,{"$f":"SUM(C35:C36)","v":600},{"$f":"SUM(D35:D36)","v":600},"Watts"]
[null,"Notes:"]
[null,"(1) Enter area of all illuminated walls or surfaces in the Area column "]
[null,"(2) Enter total linear foot of door width for main entrance doors"]
[null,"(3) Enter total linear foot of all illuminated wall or surface length"]
[null,"(4) Total values include additional 5% allowance per Section 9.4.5"]
[]
[null,"Partner Notes - Use this section to include any notes about the information entered above."]

{"sheet":"Infiltration&Ventilation","index":23,"n_rows":77,"n_cols":10,"rows_kept":77,"cut":false,"hidden":false,"merged":[[18,2,18,3],[19,2,19,3],[54,2,54,3],[54,4,54,5],[54,6,54,7],[54,8,54,9],[62,4,62,5],[62,6,62,7],[62,8,62,9],[63,2,63,3],[63,4,63,5],[63,6,63,7],[63,8,63,9],[76,1,76,6],[65,2,65,3],[65,4,65,5],[65,6,65,7],[65,8,65,9],[68,2,68,3],[68,4,68,5],[68,6,68,7],[68,8,68,9]]}
[null,"Infiltration & Ventilation"]
[]
[null,"Instructions: "]
[1,"Fill in cells highlighted with this color."]
[2,"Data to be entered into simulation software."]
[3,"Supply and exhaust ventilation CFM and fan power must be modeled explicitly and cannot be combined with infiltration"]
[5,"Red cells flag incorrect or missing inputs or design parameters"]
[]
[null,null,null,"Baseline","Proposed / As-built"]
[null,"Cs",null,0.16170000000000001,0.16170000000000001]
[null,"P","kg/m3",1.18,1.18]
[null,"Uh","m/s",4.47,4.47]
[null,"n",null,0.65,0.65]
[null,"alfa bldg",null,0.22,0.22]
[null,"Infiltration Input Type",null,{"$f":"IF(C21=\"75 Pa\",75,IF(C21=\"50 Pa\",50,\"\"))","v":""},{"$f":"IF(D21=\"75 Pa\",75,IF(D21=\"50 Pa\",50,\"\"))","v":""}]
[null,"I design","CFM/SF envelope area",{"$f":"(D14+1)*C22*(0.5*D10*D11*D12^2/D15)^D13","v":{"$error":"#VALUE!"}},{"$f":"(E14+1)*D22*(0.5*E10*E11*E12^2/E15)^E13","v":{"$error":"#VALUE!"}}]
[]
[null,"Infiltration Inputs Calculator (90.1 2013 G3.1.1.4)","Baseline","Proposed"]
[null,"Total Area of the Envelope Air Pressure Boundary, S [SqFt] (includes area of the lowest floor, any below- or above-grade walls, and roof (or ceiling) including windows and skylights, separating the interior conditioned space from the unconditioned environment)"]
[null,"Total Conditioned Volume, V [CuFt] "]
[null,"Air Leakage Test Pressure Differential",null,{"$f":"C21","v":0}]
[null,"Air leakge CFM per SqFt of total area of the envelope air pressure boundary @ specified pressure differential",{"$f":"IF(C21=\"75 pa\",0.4,0.3)","v":0.3}]
[]
[]
[null,"Local Exhaust (62.2-2010)"]
[null,"Average Kitchen Area, SF:"]
[null,"Kitchen Ceiling height, Ft:"]
[null,"Continuous CFM equivalent to 5ACH (62.2-2010):",{"$f":"5*C26*C27/60","v":0}]
[]
[null,"ASHRAE 62.2 Requirements","Kitchen (CFM, each)","Bathroom (CFM, each)"]
[null,"CONTINUOUS BASELINE EXHAUST VENTILATION:",{"$f":"C28","v":0},20]
[null,"INTERMITTENT BASELINE EXHAUST VENTILATION:",100,50]
[]
[null,null,"Kitchen","Bathroom"]
[null,"Intermittent or Continuous?"]
[null,"Fan Type"]
[null,"Proposed CFM per Room:"]
[null,"Baseline CFM per Room:",{"$f":"IF(C35=\"Intermittent\",C32,C31)","v":0},{"$f":"IF(D35=\"Intermittent\",D32,D31)","v":20}]
[null,"Number of Rooms",{"$f":"'DHW Demand'!L27","v":0},{"$f":"'DHW Demand'!L28","v":0},"Update, if inaccurate."]
[null,"PROPOSED CFM TOTAL",{"$f":"C37*C39","v":0},{"$f":"D37*D39","v":0}]
[null,"BASELINE CFM TOTAL",{"$f":"C38*C39","v":0},{"$f":"D38*D39","v":0}]
[null,null,{"$f":"IF(C40=\"\",\"\",IF(C40>C41, \"\", IF(C40<C41, \"Insufficient Ventilation\", \"\")))","v":""},{"$f":"IF(D40=\"\",\"\",IF(D40>D41, \"\", IF(D40<D41, \"Insufficient Ventilation\", \"\")))","v":""}]
[null,"Whole Unit Ventilation Rate (62.2-2010)"]
[null,null,"Studios","1BR","2BR","3BR","4BR"]
[null,"Average Area (SqFt):",{"$f":"'Reporting Summary'!D28","v":0},{"$f":"'Reporting Summary'!E28","v":0},{"$f":"'Reporting Summary'!F28","v":0},{"$f":"'Reporting Summary'!G28","v":0},{"$f":"'Reporting Summary'!H28","v":0}]
[null,"Baseline CFM (62.2-2010):",{"$f":"0.01*C45+7.5*(2)","v":15},{"$f":"0.01*D45+7.5*(2)","v":15},{"$f":"0.01*E45+7.5*(3)","v":22.5},{"$f":"0.01*F45+7.5*(4)","v":30},{"$f":"0.01*G45+7.5*(5)","v":37.5}]
[null,"Proposed OA Supply CFM:"]
[null,"Trickle Vents?"]
[null,"Number of Units",{"$f":"'Basic Info'!C8","v":0},{"$f":"'Basic Info'!C9","v":0},{"$f":"'Basic Info'!C10","v":0},{"$f":"'Basic Info'!C11","v":0},{"$f":"'Basic Info'!C12","v":0}]
[null,"BASELINE CFM TOTAL",{"$f":"C46*C49","v":0},{"$f":"D46*D49","v":0},0,0,0]
[null,"PROPOSED CFM TOTAL INCLUDING CONTINUOUS EXHAUST",{"$f":"MAX(C47,IF($C$35=\"Continuous\",$C$37,0)+IF($D$35=\"Continuous\",$D$37,0))*C49","v":0},{"$f":"MAX(D47,IF($C$35=\"Continuous\",$C$37,0)+IF($D$35=\"Continuous\",$D$37,0))*D49","v":0},0,0,0]
[null,null,{"$f":"IF(C47=\"\",\"\",IF(C51>C50, \"\", IF(C51<C50, \"Insufficient Ventilation\", \"\")))","v":""},{"$f":"IF(D47=\"\",\"\",IF(D51>D50, \"\", IF(D51<D50, \"Insufficient Ventilation\", \"\")))","v":""},{"$f":"IF(E47=\"\",\"\",IF(E51>E50, \"\", IF(E51<E50, \"Insufficient Ventilation\", \"\")))","v":""},{"$f":"IF(F47=\"\",\"\",IF(F51>F50, \"\", IF(F51<F50, \"Insufficient Ventilation\", \"\")))","v":""},{"$f":"IF(G47=\"\",\"\",IF(G51>G50, \"\", IF(G51<G50, \"Insufficient Ventilation\", \"\")))","v":""}]
[]
[null,null,"Baseline","Proposed","Baseline","Proposed","Baseline","Proposed","Baseline","Proposed"]
[null,"Space Type","Apartments",null,"Corridors",null,"Laundry Room"]
[null,"Continuous Exhaust Ventilation, CFM",{"$f":"MIN(IF(C35=\"Continuous\",C41,0)+IF(D35=\"Continuous\",D41,0),D56)","v":0},{"$f":"IF(C35=\"Continuous\",C40,0)+IF(D35=\"Continuous\",D40,0)","v":0}]
[null,"Continuous Ventilation Duct Leakage (Baseline add 10 CFM/floor per shaft)"]
[null,"Continuous Exhaust Fan Power, kW (total for all fans serving the space type); Note 1","Calculated",null,"Calculated"]
[null,"Intermittent Exhaust Ventilation, CFM",{"$f":"MIN(IF(C35=\"Intermittent\",C41,0)+IF(D35=\"Intermittent\",D41,0),D59)","v":0},{"$f":"IF(C35=\"Continuous\",0,C40)+IF(D35=\"Continuous\",0,D40)","v":0},{"$f":"F59","v":0}]
[null,"Intermittent Exhaust Fan Power, kW (total for all fans serving the space type); Note 1",null,null,{"$f":"F60","v":0}]
[null,"Outdoor Air (OA) CFM",{"$f":"MIN(D61,SUMPRODUCT(C46:G46,C49:G49))","v":0},{"$f":"SUMPRODUCT(C47:G47,C49:G49)","v":0},{"$f":"'Basic Info'!C20*0.06","v":0}]
[null,"Fan Power of Dedicated OA System Fans, kW",0,null,0]
[null,"Infiltration ACH; Note 2",{"$f":"IF($C$20=0,0,D16*$C$19/$C$20*60)","v":0},{"$f":"IF($C$20=0,0,E16*$C$19/$C$20*60)","v":0},"same in the baseline and proposed",null,"same in the baseline and proposed",null,"same in the baseline and proposed"]
[null,"Infiltration Schedule ","Set all hourly fractions to 0.5",null,"same in the baseline and proposed",null,"same in the baseline and proposed",null,"same in the baseline and proposed"]
[null,"Continuous Exhaust, CFM",{"$f":"C56+C57+C59*2/24","v":0},{"$f":"D56+D57+D59*2/24","v":0},{"$f":"E56","v":0},0,0,0,0,0]
[null,"Continuous Exhaust Schedule","Set all hourly fractions to 1",null,"Set all hourly fractions to 1",null,"Set all hourly fractions to 1",null,"Set all hourly fractions to 1"]
[null,"Continuous Exhaust Fan Power, kW/CFM",0,{"$f":"IF(D65=0,0,(D58+D60*2/24)/D65)","v":0},0,{"$f":"F58","v":0},0,{"$f":"H58","v":0},0,{"$f":"J58","v":0}]
[null,"Intermittent Exhaust Fan Power, kW/CFM",{"$f":"C60","v":0},{"$f":"D60","v":0},0,0,0,0,0,0]
[null,"Intermittent Exhaust Schedule","Fan motor runs 2 hours per day",null,"same in the baseline and proposed",null,"same in the baseline and proposed",null,"same in the baseline and proposed"]
[null,"Dedicated OA Supply Fan Power, kW",0,{"$f":"D62","v":0},0,{"$f":"F62","v":0}]
[null,"Outdoor Air, CFM",{"$f":"C61","v":0},{"$f":"D61","v":0},{"$f":"'Basic Info'!C20*0.06","v":0},{"$f":"F61","v":0},{"$f":"G61","v":0},{"$f":"H61","v":0},{"$f":"I61","v":0},{"$f":"J61","v":0}]
[null,null,null,null,{"$f":"IF(F71<E71,\"Insufficient Ventilation\",\"\")","v":""}]
[null,"Notes"]
[1,"Calculate Fan kW for the proposed design as BHP*0.746 / Motor Efficiency. If BHP is unknown, which may be the case for small packaged systems, it may be estimated as 85% of rated fan motor HP."]
[2,"Set Infiltration Method to \"Air Change\" in eQUEST"]
[]
[null,"Partner Notes - Use this section to include any notes about the information entered above."]

{"sheet":"EIR for PTAC and PTHP","index":24,"n_rows":39,"n_cols":16,"rows_kept":39,"cut":false,"hidden":false,"merged":[[38,1,38,6],[11,12,11,14],[10,2,10,3],[10,4,10,10],[23,2,23,3],[23,4,23,10]]}
[null,"eQUEST Calculator - EIR for PTAC and PTHP"]
[]
[null,"Instructions: "]
[1,"For gas heated buildings using System 1 - PTAC, use the top chart to calculate cooling-EIR"]
[2,"For electric heated buildings using System 2 - PTHP, use the bottom chart to calculate cooling-EIR"]
[3,"Baseline PTAC fan energy should be simulated as 0.3 W/CFM"]
[4,"Fill in cells highlighted with this color."]
[5,"Data to be entered in simulation software."]
[6,"Data to be entered in this spreadsheet and in simulation software."]
[]
[null,null,"Baseline Design",null,"Proposed Design"]
[null,null,"Common Space Systems","Apartment Systems","Apartment Systems","Common Space System1","Common Space System2","Common Space System3","Common Space System4","Common Space System5","Common Space System6",null,"Efficiency Conversion Calculators \n(ASHRAE 90.1-2013, Appendix G, G3.1.2.1)"]
[null,"System Type","PTAC","PTAC",null,null,null,null,null,null,null,null,"SEER","COPnfcooling","EIR"]
[null,"EER",{"$f":"IF(C15>15000,9.305,IF(C15<7000,11.009,12.5-(0.213*C15/1000)))","v":11.009},{"$f":"IF(D15>15000,9.305,IF(D15<7000,11.009,12.5-(0.213*D15/1000)))","v":11.009},null,null,null,null,null,null,null,null,null,{"$f":"-0.0076*M14^2+0.3796*M14","v":0},{"$f":"1/N14","v":{"$error":"#DIV/0!"}}]
[null,"Net Cooling Capacity (ARI Cond), Btu/Hr"]
[null,"Fan BHP, actual","N/A","N/A",null,null,null,null,null,null,null,null,"EER","Capacity, Btu/hr","COPnfcooling","EIR"]
[null,"Fan Motor Efficiency, actual","N/A","N/A",null,null,null,null,null,null,null,null,null,null,{"$f":"7.84*10^(-8)*N17+0.338*M17","v":0},{"$f":"1/O17","v":{"$error":"#DIV/0!"}}]
[null,"CFM, actual","N/A","N/A"]
[null,"Fan kW/CFM",2.9999999999999997E-4,2.9999999999999997E-4,{"$f":"IF(E18+E17=0,0,E16*0.746/E18/E17)","v":0},{"$f":"IF(F18+F17=0,0,F16*0.746/F18/F17)","v":0},0,0,0,0,0,null,"HSPF","COPnfheating","EIR"]
[null,"EIR or 1/COP",{"$f":"(1/C14-0.365*400/12000)/((1/3.413)+0.365*400/12000)","v":0.2577895729181931},{"$f":"(1/D14-0.365*400/12000)/((1/3.413)+0.365*400/12000)","v":0.2577895729181931},{"$f":"IF(E14=0,0,(1/E14-0.365*400/12000)/((1/3.413)+0.365*400/12000))","v":0},{"$f":"IF(F14=0,0,(1/F14-0.365*400/12000)/((1/3.413)+0.365*400/12000))","v":0},0,0,0,0,0,null,null,{"$f":"-0.0296*M20^2+0.7134*M20","v":0},{"$f":"1/N20","v":{"$error":"#DIV/0!"}}]
[]
[]
[]
[null,null,"Baseline Design",null,"Proposed Design"]
[null,null,"Common Space Systems","Apartment Systems","Apartment Systems","Common Space System1","Common Space System2","Common Space System3","Common Space System4","Common Space System5","Common Space System6"]
[null,"System Type","PTHP","PTHP"]
[null,"EER",{"$f":"IF(C28>15000,9.105,IF(C28<7000,10.809,12.3-(0.213*C28/1000)))","v":10.808999999999999},{"$f":"IF(D28>15000,9.105,IF(D28<7000,10.809,12.3-(0.213*D28/1000)))","v":10.808999999999999}]
[null,"Net Cooling Capacity (ARI Cond), Btu/Hr"]
[null,"Fan BHP, actual","N/A","N/A"]
[null,"Fan Motor Efficiency, actual","N/A","N/A"]
[null,"CFM, actual","N/A","N/A"]
[null,"Fan kW/CFM",2.9999999999999997E-4,2.9999999999999997E-4,{"$f":"IF(E31+E30=0,0,E29*0.746/E31/E30)","v":0},0,0,0,0,0,0]
[null,"EIR or 1/COP (Cooling)",{"$f":"(1/C27-0.365*400/12000)/((1/3.413)+0.365*400/12000)","v":0.26329718401113056},{"$f":"(1/D27-0.365*400/12000)/((1/3.413)+0.365*400/12000)","v":0.26329718401113056},{"$f":"IF(E27=0,0,(1/E27-0.365*400/12000)/((1/3.413)+0.365*400/12000))","v":0},{"$f":"IF(F27=0,0,(1/F27-0.365*400/12000)/((1/3.413)+0.365*400/12000))","v":0},0,0,0,0,0]
[null,"Net Heating Capacity, Btu/Hr"]
[null,"COP (HEATING)",{"$f":"IF(C34>15000,2.81,IF(C34<7000,3.018,3.2-(0.026*C34/1000)))","v":3.0179999999999998},{"$f":"IF(D34>15000,2.81,IF(D34<7000,3.018,3.2-(0.026*D34/1000)))","v":3.0179999999999998}]
[null,"EIR or 1/COP (HEATING)",{"$f":"1/C35","v":0.3313452617627568},0.3313452617627568,{"$error":"#DIV/0!"},{"$error":"#DIV/0!"},{"$error":"#DIV/0!"},{"$error":"#DIV/0!"},{"$error":"#DIV/0!"},{"$error":"#DIV/0!"},{"$error":"#DIV/0!"}]
[]
[]
[null,"Partner Notes - Use this section to include any notes about the information entered above."]