{"text_format":"1","workbook":"xlsx","n_sheets":25,"sheets":["NYSERDA Reporting","ERMs","GHSF Calculator","Demand Savings Lookup","Lookup","Drop Down","Introduction","Version History","Basic Info","Model Inputs","Reporting Summary","Detailed Measures","Simulation Summary","Results from eQUEST","SG Appx Intro","Windows eQuest","DHW Demand","Water Savings","Appliances","Lighting Schedule","Interior Lighting","In-Unit Lighting","Exterior Lighting","Infiltration&Ventilation","EIR for PTAC and PTHP"],"not_rendered":{"charts":0,"images":0,"macros":1,"external_links":2,"defined_names":61,"comments":5,"pivot_tables":0},"unopened":[],"bounds":{"document_bytes":16777216,"sheet_cells":100000,"rows_first":2000,"rows_last":500,"rows_between":2000,"halvings":0,"cell_chars":16384,"cell_head_chars":4096},"cells_cut":0,"cells_raw":0,"read":"whole","date_system":"1900"}

{"sheet":"NYSERDA Reporting","index":0,"n_rows":52,"n_cols":11,"rows_kept":52,"cut":false,"hidden":true,"merged":[]}
[null,"Project Energy Savings and Financial Summary per Building"]
[]
[null,"Projected Annual Cost Savings ($)",{"$f":"'NYSERDA Reporting'!E14","v":{"$error":"#DIV/0!"}}]
[null,"Projected Annual Cost Savings (%)",{"$f":"'NYSERDA Reporting'!F14","v":{"$error":"#DIV/0!"}}]
[null,"Minimum Performance Target (%)",{"$f":"IF('Basic Info'!C48=1,15%,IF('Basic Info'!C48=2,25%,30%))","v":0.3}]
[null,"Project Exceeds Performance Target By",{"$f":" C4-C5","v":{"$error":"#DIV/0!"}}]
{"$rows_left_out":47}
{"sheet":"ERMs","index":1,"n_rows":85,"n_cols":5,"rows_kept":85,"cut":false,"hidden":true,"merged":[[74,0,75,0]]}
[]
[{"$f":"'Basic Info'!C37&\" Building Components\"","v":" Building Components"}]
[null,"Measure #","Proposed Method of Compliance \n(by PM/client)","Values Used in Energy Model  \n(Modeling Submittal Notes)","Baseline"]
["APPLIANCES"]
["Refrigerator",{"$f":"'Model Inputs'!C52","v":0},{"$f":"IF('Model Inputs'!G52=0,\"N/A\",'Model Inputs'!$G$52&\"  \"& 'Model Inputs'!$J$52& \" Refrigerators, \"&'Model Inputs'!$H$52&\" \"&'Model Inputs'!$I$52)","v":"N/A"},{"$f":"IF('Model Inputs'!G52=0,\"N/A\",\"Baseline: \"&'Model Inputs'!$E$52&\" kWh/yr\nProposed: \"&'Model Inputs'!$F$52&\" kWh/yr\")","v":"N/A"},{"$f":"IF(C5=\"N/A\", \"N/A\",'Model Inputs'!G52&\" \"&'Model Inputs'!D52)","v":"N/A"}]
["Dishwasher",{"$f":"'Model Inputs'!C53","v":0},{"$f":"IF('Model Inputs'!G53=0,\"N/A\",'Model Inputs'!$G$53&\"  \"& 'Model Inputs'!$J$53& \" Dishwashers, \"&'Model Inputs'!$H$53&\" \"&'Model Inputs'!$I$53)","v":"N/A"},{"$f":"IF('Model Inputs'!G53=0,\"N/A\",\"Baseline: \"&'Model Inputs'!$E$53&\" kWh/yr\" & \", \"&'Model Inputs'!$E$54&\" gal/yr\nProposed: \"&'Model Inputs'!$F$53&\" kWh/yr\" & \", \"&'Model Inputs'!$F$54&\" gal/yr\")","v":"N/A"},{"$f":"IF(C6=\"N/A\",\"N/A\",'Model Inputs'!G53&\" \"&'Model Inputs'!D53)","v":"N/A"}]
{"$rows_left_out":80}
{"sheet":"GHSF Calculator","index":2,"n_rows":18,"n_cols":5,"rows_kept":18,"cut":false,"hidden":true,"merged":[]}
[]
[null,"Building Area","Total Square Ft","Conditioned?","GHSF"]
[null,"Apartment",{"$f":"'Basic Info'!C16","v":0},{"$f":"'Basic Info'!D16","v":"N/A"},{"$f":"IF(OR(D3=\"Heated & Cooled\",D3=\"Heated-Only\")=TRUE,C3,0)","v":0}]
[null,"Storage, active",{"$f":"'Basic Info'!C17","v":0},{"$f":"'Basic Info'!D17","v":"N/A"},{"$f":"IF(OR(D4=\"Heated & Cooled\",D4=\"Heated-Only\")=TRUE,C4,0)","v":0}]
[null,"Storage, inactive",{"$f":"'Basic Info'!C18","v":0},{"$f":"'Basic Info'!D18","v":"N/A"},{"$f":"IF(OR(D5=\"Heated & Cooled\",D5=\"Heated-Only\")=TRUE,C5,0)","v":0}]
[null,"Lobby",{"$f":"'Basic Info'!C19","v":0},{"$f":"'Basic Info'!D19","v":"N/A"},0]
{"$rows_left_out":13}
{"sheet":"Demand Savings Lookup","index":3,"n_rows":52,"n_cols":7,"rows_kept":52,"cut":false,"hidden":true,"merged":[]}
["Measure","Upstate (non-cooling)","Upstate (cooling)","Downstate (non-cooling)","Downstate (cooling)","Measure Lifetime","Units"]
["Appliances - Clothes washers",1.1400000000000001E-4,1.8500000000000001E-3,1.1400000000000001E-4,1.1299999999999999E-3,14,"each"]
["Appliances - Dishwashers",1.1400000000000001E-4,1.8500000000000001E-3,1.1400000000000001E-4,1.1299999999999999E-3,13,"each"]
["Appliances - Refrigerator",1.1400000000000001E-4,1.8500000000000001E-3,1.1400000000000001E-4,1.1299999999999999E-3,15,"each"]
["DHW - Condensing boiler",1.1400000000000001E-4,1.8500000000000001E-3,1.1400000000000001E-4,1.1299999999999999E-3,13,"1000 Btu/hr"]
["DHW - Direct",1.1400000000000001E-4,1.8500000000000001E-3,1.1400000000000001E-4,1.1299999999999999E-3,13,"1000 Btu/hr"]
{"$rows_left_out":47}
{"sheet":"Lookup","index":4,"n_rows":24,"n_cols":17,"rows_kept":24,"cut":false,"hidden":true,"merged":[]}
[]
["Only use 'Unconditioned' for spaces that have no active heating or cooling AND are not indirectly conditioned by adjacent conditioned spaces."]
["As per Minimum Performance Standards, garages shall not be heated for comfort or to prevent pipes from freezing."]
["You must fill in the conditioned column."]
["You must fill in the mechanical ventilation column."]
[]
{"$rows_left_out":19}
{"sheet":"Drop Down","index":5,"n_rows":32,"n_cols":38,"rows_kept":32,"cut":false,"hidden":true,"merged":[[14,0,14,1],[24,0,25,0],[24,1,24,3],[23,0,23,4]]}
["Garage","Condition","YN","Milestone","Rev","Standard","Income","Construction","Fuel","DHW Method","Units","Energy Star","Water Sense","Pump Type","Pump Class","Fan Control","Heating Control","Fan","FanRate","Climate Zone","Windows","SpaceType","LightCalcMethod","LightingSpaceType","LPD2010SS","LPD2010WB","Footcandles","YesNo","Utility","UtilityLookup","Fuel","Funding","GasUtility",null,"Split type","BaseSite","ExtLightZone","PHStatus"]
["N/A","N/A","N/A","Please Select",0,"Please select","Please Select","Please Select","Please Select","Please Select",null,"Please Select","Please Select","Please Select","Please Select","Please Select","Please Select","Please Select","NA",1,"Wood Frame","Storage, active","Space-By-Space (90.1-2010)","Conference/meeting/multipurpose",1.23,0.6,30,"Please Select","Central Hudson",1,"N/A","Please select","Con Ed",2,"<Select one>","Tradable","Zone 2","Pre-Certified"]
["Under Ground Garage","Heated & Cooled","Yes","Proposed Design",1,"ASHRAE 90.1-2004 & Simulation Guidelines V4.0","Market Rate","New Construction","natural gas","Apartment Method","kBtu/hr","Not Applicable","Not Applicable","One-Speed","Standard","Variable Speed","Fixed","Ceiling ( 10-80 CFM)",1.2,2,"Other","Storage, inactive","Building Area (90.1-2010)","Corridor/Transition",0.66,0.6,10,"Yes","Con Ed",2,"gas - firm","EEPS-Gas","National Grid",5,"Measure cost","Non-Tradable","Zone 3","Certified"]
["Above Ground Garage","Heated-Only","No","As-Built",2,"RESNET HERS Technical Guidelines Standard","Low-to-Moderate Income","Gut-rehab","oil","Occupancy Method","cubic feet","None Installed","None Installed","Two-Speed","High Efficiency","Inlet","OA Reset","Ceiling (90-500 CFM)",2.2999999999999998,3,null,"Lobby",null,"Electrical/Mechanical",0.95,0.6,30,"No","NatGrid",3,"gas - non firm","EEPS-Electric","O & R",7,"Measure savings",null,"Zone 4"]
["Parking Lot","Cooled-Only",null,null,3,null,"Blended",null,"propane",null,"degrees","Non-Energy Star","Non-WaterSense","Variable Speed","Premium","Discharge","Scheduled","Inline or Range Hood",2.2999999999999998,4,null,"Corridor/Transition",null,"Exercise Area",0.72,0.6,30,null,"NYSEG",4,"oil","RGGI","KEDLI",6]
[null,"Unconditioned",null,null,4,null,null,null,"steam",null,"each","Energy Star","WaterSense","Cycle",null,"Cycling","Load Reset","Rooftop/Other","NA",5,null,"Stairs - Active",null,"Exit Signs","5 W/face","5 W/face","NA",null,"O & R",5,"propane","OHGAH","Other"]
{"$rows_left_out":27}
{"sheet":"Introduction","index":6,"n_rows":25,"n_cols":3,"rows_kept":25,"cut":false,"hidden":false,"merged":[[4,1,4,2],[6,1,6,2],[24,1,24,2]]}
[null,"Multifamily New Construction Program (MF NCP) "]
[null,"Building Performance Plan"]
[null,"Version 1.2 - ASHRAE 2010 - March 2017"]
[]
[null,"The following worksheets detail the information regarding the recommended scope of work and document the achievement of the project's Performance Target. Some cells are protected to prevent accidental over-writing of formulas. "]
[]
{"$rows_left_out":20}
{"sheet":"Version History","index":7,"n_rows":100,"n_cols":2,"rows_kept":100,"cut":false,"hidden":false,"merged":[]}
["BPP Version 1.2 - Bug fixes"]
["Exterior Lighting","Fixed error in calculations"]
["Water Savings","Fixed error in calculations"]
[]
[]
["BPP Version 1.1 - ASHRAE 2010 Updates"]
{"$rows_left_out":95}
{"sheet":"Basic Info","index":8,"n_rows":96,"n_cols":7,"rows_kept":96,"cut":false,"hidden":false,"merged":[[88,1,88,6],[95,1,95,6],[44,2,44,3],[36,2,36,3],[37,2,37,3],[38,2,38,3],[42,2,42,3],[39,2,39,3],[40,2,40,3],[43,2,43,3]]}
[null,"Basic Project Information"]
[]
[null,"Compliance Pathway","Performance Path"]
[null,{"$f":"IF(Path=\"Performance Path\",\"\",\"Passive House Certification Status\")","v":""}]
[null,{"$f":"IF(Path=\"PHIUS\",\"PHIUS Project #\",\"\")","v":""}]
[]
{"$rows_left_out":91}
{"sheet":"Model Inputs","index":9,"n_rows":205,"n_cols":28,"rows_kept":205,"cut":false,"hidden":false,"merged":[[65,1,65,8],[101,2,102,2],[81,1,81,8],[92,2,95,2],[113,2,114,2],[68,2,71,2],[72,2,75,2],[76,2,79,2],[184,2,185,2],[188,2,189,2],[128,3,133,3],[84,2,87,2],[88,2,91,2],[121,2,126,2],[110,2,112,2],[132,2,133,2],[128,2,131,2],[99,2,100,2],[59,2,61,2],[25,3,26,3],[27,3,28,3],[30,3,33,3],[36,3,37,3],[25,2,26,2],[27,2,28,2],[30,2,33,2],[52,2,53,2],[36,2,37,2],[54,2,55,2],[56,2,57,2],[34,3,35,3],[34,2,35,2],[42,2,43,2],[21,2,22,2],[12,3,13,3],[23,3,24,3],[23,2,24,2],[21,3,22,3],[9,1,9,6],[12,2,13,2],[14,2,15,2],[17,2,18,2],[19,2,20,2],[14,3,15,3],[17,3,18,3],[19,3,20,3],[204,1,204,6],[137,2,138,2],[134,2,136,2],[174,2,176,2],[163,2,167,2],[141,2,142,2],[154,2,155,2],[172,2,173,2],[168,2,171,2],[190,2,191,2],[192,2,193,2],[197,5,197,6],[198,5,198,6],[200,5,200,6],[196,1,196,6],[199,5,199,6]]}
[null,"Model Inputs Summary"]
[]
[null,"Measure #:  To auto-generate the measure descriptions in the Detailed Measures tab, number the appropriate rows in this column such that it matches the ID number (column A) on the Detailed Measures tab."]
[null,"Baseline Design:  In the blue cells, enter the baseline information used in the model.  If this project has a different baseline than listed in a white cell, you may overwrite that cell."]
[null,"Proposed Design/As-Built:  In the blue cells, enter the proposed design/as-built information used in the model and/or that matches the proposed/as-built building."]
[null,"Notes:  Read the notes, which are indicated by red corners, where appropriate to assist in properly completing this tab."]
{"$rows_left_out":200}
{"sheet":"Reporting Summary","index":10,"n_rows":138,"n_cols":39,"rows_kept":138,"cut":false,"hidden":false,"merged":[[5,8,5,11],[7,1,7,2],[7,3,7,5],[9,1,9,2],[9,3,9,5],[123,10,123,11],[1,1,2,11],[138,1,138,11],[4,1,4,11],[10,1,10,11],[15,1,15,11],[28,1,28,11],[37,1,37,11],[84,1,84,11],[110,1,110,11],[114,1,114,11],[127,1,127,11],[16,6,16,7],[21,6,21,7],[29,5,29,11],[96,6,96,7],[79,4,79,6],[79,1,79,2],[76,1,76,2],[81,1,81,2],[70,7,70,11],[68,1,68,2],[82,4,82,6],[87,6,87,7],[81,4,81,6],[77,1,77,11],[74,7,74,11],[82,1,82,2],[74,4,74,6],[83,1,83,2],[76,4,76,6],[75,7,75,11],[76,7,76,11],[85,10,85,11],[85,1,85,2],[69,4,69,6],[68,4,68,6],[78,1,78,2],[79,7,79,11],[81,7,81,11],[72,7,72,11],[71,1,71,11],[80,1,80,11],[47,7,47,11],[47,4,47,6],[52,1,52,11],[46,4,46,6],[48,7,48,11],[67,4,67,6],[54,1,54,2],[61,1,61,2],[64,1,64,2],[59,1,59,2],[58,1,58,2],[56,1,56,2],[51,7,51,11],[55,4,55,6],[60,4,60,6],[59,4,59,6],[54,4,54,6],[54,7,54,11],[48,4,48,6],[50,4,50,6],[41,4,41,6],[38,4,38,6],[38,1,38,2],[49,7,49,11],[45,7,45,11],[53,7,53,11],[55,7,55,11],[56,4,56,6],[56,7,56,11],[50,7,50,11],[53,4,53,6],[43,7,43,11],[43,4,43,6],[47,1,47,2],[55,1,55,2],[53,1,53,2],[50,1,50,2],[45,4,45,6],[48,1,48,2],[49,4,49,6],[43,1,43,2],[44,4,44,6],[44,1,44,2],[42,1,42,2],[40,1,40,2],[39,1,39,11],[40,4,40,6],[25,1,25,2],[31,1,31,3],[30,1,30,3],[27,1,27,2],[29,1,29,3],[26,1,26,2],[26,8,26,11],[27,8,27,11],[25,8,25,11],[38,7,38,11],[40,7,40,11],[33,1,33,3],[34,1,34,3],[35,1,35,3],[36,1,36,3],[30,5,36,11],[17,6,17,7],[17,1,17,2],[20,6,20,7],[23,1,24,5],[17,8,17,11],[18,8,18,11],[19,8,19,11],[17,3,17,5],[18,6,18,7],[18,1,18,2],[20,1,20,2],[18,3,18,5],[21,1,21,2],[19,1,19,2],[20,3,20,5],[20,8,20,11],[23,8,23,11],[23,6,23,7],[24,6,24,7],[21,8,21,11],[24,8,24,11],[14,8,14,11],[8,6,8,7],[8,3,8,5],[9,6,9,7],[9,8,9,11],[11,8,11,11],[11,6,11,7],[11,3,11,5],[12,3,12,5],[8,1,8,2],[6,6,6,7],[7,6,7,7],[22,3,22,5],[22,6,22,7],[22,8,22,11],[22,1,22,2],[11,1,11,2],[12,1,12,2],[13,1,13,2],[16,1,16,2],[14,1,14,2],[19,6,19,7],[19,3,19,5],[21,3,21,5],[16,3,16,5],[13,6,13,7],[16,8,16,11],[12,6,12,7],[14,6,14,7],[14,3,14,5],[13,3,13,5],[12,8,12,11],[13,8,13,11],[105,10,105,11],[105,1,105,2],[108,6,108,7],[107,4,107,5],[108,1,108,2],[106,1,106,11],[6,8,6,11],[7,8,7,11],[8,8,8,11],[59,7,59,11],[86,1,86,11],[89,4,89,5],[89,6,89,7],[91,4,91,5],[89,1,89,2],[89,8,89,9],[89,10,89,11],[87,8,87,9],[87,10,87,11],[88,8,88,9],[88,10,88,11],[87,1,87,2],[88,1,88,2],[87,4,87,5],[5,3,5,5],[6,3,6,5],[5,1,5,2],[98,4,98,5],[83,7,83,11],[82,7,82,11],[85,4,85,5],[85,6,85,7],[94,6,94,7],[95,4,95,5],[83,4,83,6],[6,1,6,2],[5,6,5,7],[91,1,91,2],[90,6,90,7],[94,1,94,2],[90,8,90,9],[90,4,90,5],[93,4,93,5],[95,8,95,9],[96,1,96,2],[88,6,88,7],[88,4,88,5],[85,8,85,9],[109,1,109,2],[108,4,108,5],[107,6,107,7],[105,4,105,5],[105,6,105,7],[105,8,105,9],[101,4,101,5],[101,6,101,7],[92,6,92,7],[92,4,92,5],[93,1,93,2],[92,1,92,2],[96,4,96,5],[94,4,94,5],[99,6,99,7],[98,1,98,2],[104,4,104,5],[103,6,103,7],[100,4,100,5],[103,4,103,5],[100,1,100,2],[104,6,104,7],[103,1,103,2],[99,1,99,2],[93,6,93,7],[95,6,95,7],[97,1,97,11],[98,6,98,7],[98,10,98,11],[99,4,99,5],[100,6,100,7],[98,8,98,9],[96,8,96,9],[96,10,96,11],[126,10,126,11],[122,10,122,11],[100,8,100,9],[100,10,100,11],[101,8,101,9],[101,10,101,11],[107,8,107,9],[107,10,107,11],[108,8,108,9],[108,10,108,11],[109,8,109,9],[109,10,109,11],[103,8,103,9],[103,10,103,11],[104,8,104,9],[104,10,104,11],[121,10,121,11],[115,9,116,9],[125,10,125,11],[118,10,118,11],[119,10,119,11],[124,10,124,11],[120,10,120,11],[117,10,117,11],[107,1,107,2],[104,1,104,2],[68,7,68,11],[63,1,63,2],[61,7,61,11],[73,1,73,2],[75,1,75,2],[75,4,75,6],[70,1,70,2],[70,4,70,6],[73,4,73,6],[72,4,72,6],[72,1,72,2],[74,1,74,2],[64,4,64,6],[63,4,63,6],[61,4,61,6],[69,7,69,11],[73,7,73,11],[69,1,69,2],[67,7,67,11],[67,1,67,2],[95,10,95,11],[101,1,101,2],[42,4,42,6],[41,7,41,11],[78,7,78,11],[78,4,78,6],[115,10,116,11],[115,6,115,8],[102,1,102,11],[91,6,91,7],[90,1,90,2],[115,2,115,4],[99,8,99,9],[99,10,99,11],[90,10,90,11],[91,8,91,9],[91,10,91,11],[92,8,92,9],[92,10,92,11],[93,8,93,9],[93,10,93,11],[94,8,94,9],[94,10,94,11],[95,1,95,2],[109,6,109,7],[109,4,109,5],[114,13,116,13],[114,14,116,14],[41,1,41,2],[60,7,60,11],[57,1,57,2],[57,7,57,11],[57,4,57,6],[65,1,65,2],[66,1,66,2],[65,4,65,6],[65,7,65,11],[66,4,66,6],[66,7,66,11],[63,7,63,11],[64,7,64,11],[58,7,58,11],[62,1,62,11],[60,1,60,2],[58,4,58,6],[44,7,44,11],[46,7,46,11],[51,4,51,6],[49,1,49,2],[42,7,42,11]]}
[]
[null,"ENERGY STAR Multifamily High Rise\nReporting Summary, Version 1.4"]
[]
[]
[null,"Table 1. General Project Information"]
[null,"Current Project Status:",null,null,null,null,"Project Name:",null,{"$f":"'Basic Info'!C37","v":0}]
{"$rows_left_out":133}
{"sheet":"Detailed Measures","index":11,"n_rows":46,"n_cols":21,"rows_kept":46,"cut":false,"hidden":false,"merged":[[4,0,6,0],[5,9,6,9],[5,6,6,6],[5,3,6,3],[4,6,4,11],[5,10,6,10],[5,11,6,11],[4,2,6,2],[4,1,6,1],[4,3,4,5],[5,4,6,4],[5,5,6,5],[5,7,6,7],[5,8,6,8],[45,1,45,6],[5,18,6,18],[4,12,4,20],[5,12,5,15],[5,20,6,20],[5,16,6,16],[5,17,6,17],[5,19,6,19]]}
[null,"Energy-Saving Measures"]
[]
[null,"Instructions:  Detailed instruction below table."]
[]
["ID","Parametric Run","Measure Category","Baseline Components",null,null,"Proposed Components",null,null,null,null,null,"Incremental Metrics"]
[null,null,null,"Description","Cost","Cost Source","Description","Cost","Cost Source","Lifetime\nyears","Quantity","Units","Energy Savings",null,null,null,"Demand Savings kW","Water Savings 1000 gal","O&M Savings \n$","Costs\n$","Cost Savings\n$"]
{"$rows_left_out":41}
{"sheet":"Simulation Summary","index":12,"n_rows":44,"n_cols":10,"rows_kept":44,"cut":false,"hidden":true,"merged":[[21,8,22,8],[5,1,5,10],[21,9,22,9],[8,3,8,9],[9,3,9,9],[10,3,10,9],[11,3,11,9],[12,3,12,9],[21,2,21,4],[21,5,21,7]]}
[null,"Instructions:"]
[1,"First fill in the Basic Info worksheet and copy results into Result Summary eQuest worksheet."]
[2,"Fill in cells highlighted with this color."]
[3,"If oil is used rather than natural gas, modifications to table are needed."]
[4,"Baseline and Proposed design fuel usage is copied from the corresponding rows in Result Summary eQuest worksheet."]
[5,"Performance rating is shown in Red Font"]
{"$rows_left_out":39}
{"sheet":"Results from eQUEST","index":13,"n_rows":53,"n_cols":77,"rows_kept":53,"cut":false,"hidden":false,"merged":[[18,1,18,11],[9,66,9,68],[9,71,9,76],[52,1,52,6]]}
[null,"Results from eQUEST Parms.csv file"]
["NOTE:","*To account for calculations done outside of eQuest, you can add rows after your last eQUEST parametric row with appropriate savings."]
["NOTE:","**If building uses more than one fossil fuel or uses oil instead of gas for heating, adjustments to the performance rating calculation in the Reporting Summary are needed."]
[]
["Step 1:","Open Parms.csv file that corresponds to baseline and proposed eQuest models."]
[]
{"$rows_left_out":48}
{"sheet":"SG Appx Intro","index":14,"n_rows":37,"n_cols":3,"rows_kept":37,"cut":false,"hidden":false,"merged":[[6,1,6,2],[3,1,4,2]]}
[null,"Simulation Guidelines Appendix"]
[null,"BPP Version 1.1 - ASHRAE 2010 - March 2017"]
[]
[null,"The following worksheets assist in calculating inputs to eQUEST and similar simulation tools.  The Interior Lighting, In-Unit Lighting and Exterior Lighting tabs are required for all projects, including Passive House projects."]
[]
[]
{"$rows_left_out":32}
{"sheet":"Windows eQuest","index":15,"n_rows":33,"n_cols":8,"rows_kept":33,"cut":false,"hidden":false,"merged":[[32,1,32,6],[24,2,24,3],[24,4,24,5],[24,6,24,7],[7,2,7,3],[7,4,7,5],[16,2,16,3],[16,4,16,5],[16,6,16,7]]}
[null,"eQUEST Calculator - Windows"]
[]
[null,"Instructions: "]
[1,"Using ASHRAE 90.1-2010 Table 5.5, enter values for your Climate Zone (reference below). "]
[2,"Enter actual NFRC values in the Proposed column."]
[3,"Use calculated values as inputs into eQuest Glass Type Properties - Basic Specifications screen."]
{"$rows_left_out":28}
{"sheet":"DHW Demand","index":16,"n_rows":66,"n_cols":27,"rows_kept":66,"cut":false,"hidden":false,"merged":[[25,1,26,4],[65,1,65,6]]}
[null,"eQUEST Calculator - DHW Demand"]
[]
[null,"Instructions: "]
[1,"First fill in the Basic Info tabs.",null,null,null,null,null,null,null,null,null,null,null,null,null,null,null,null,null,null,null,null,null,null,null,null,"Low"]
[2,"Fill in all blue cells",null,null,null,null,null,null,null,null,null,null,null,null,null,null,null,null,null,null,null,null,null,null,null,null,"Medium"]
[3,"For proposed indirect DHW systems, refer to the Indirect DHW calculations box for further instructions.",null,null,null,null,null,null,null,null,null,null,null,null,null,null,null,null,null,null,null,null,null,null,null,null,"High"]
{"$rows_left_out":61}
{"sheet":"Water Savings","index":17,"n_rows":41,"n_cols":5,"rows_kept":41,"cut":false,"hidden":false,"merged":[[40,1,40,6],[4,1,4,4],[5,1,5,4],[6,1,6,4],[7,1,7,4]]}
[null,"Water Savings Calculator"]
[]
[null,"Instructions:"]
[1,"First, complete the DHW Demand tab."]
[2,"In the \"Baseline Fixture\" table, enter an estimated number of uses/day for urinals in the appropriate space.  Enter \"0\" if there are no urinals in building."]
[3,"In the \"Proposed Fixture\" table, enter the proposed toilet and urinal flow rates.  The proposed usage and pressures for the showerheads and faucets will autofill from the DHW Demand tab."]
{"$rows_left_out":36}
{"sheet":"Appliances","index":18,"n_rows":65,"n_cols":23,"rows_kept":65,"cut":false,"hidden":false,"merged":[[64,1,64,6]]}
[null,"eQUEST Calculator - Appliances"]
[]
[null,"Instructions: "]
[1,"First, fill out Basic Info and DHW tabs."]
[2,"Fill in cells highlighted with this color."]
[3,"Data to be entered in eQuest as Equipment or Internal Energy Sources."]
{"$rows_left_out":60}
{"sheet":"Lighting Schedule","index":19,"n_rows":44,"n_cols":4,"rows_kept":44,"cut":false,"hidden":false,"merged":[[43,1,43,6]]}
[null,"eQUEST Calculator - Lighting"]
[]
[null,"Instructions: "]
[1,"Use this worksheet to generate schedules for lighting inputs."]
[2,"Do not edit cells highlighted in this color. These calculated values are for editing or creating schedules."]
[3,"Elevator lighting should only be assigned to ONE elevator zone."]
{"$rows_left_out":39}
{"sheet":"Interior Lighting","index":20,"n_rows":366,"n_cols":28,"rows_kept":366,"cut":false,"hidden":false,"merged":[[3,7,3,8],[365,1,365,6]]}
[null,"Calculator - Interior Lighting"]
[null,null,null,null,null,null,null,null,null,null,null,null,null,"*Enter manufacturer/model only once fixtures are specified."]
["Instructions: ",null,null,null,null,null,null,null,null,"Fixture Code","Light Source & Distribution ","Watts/Fixture","Default Lumen/Watt","Manufacturer/Model*","General Location","ENERGY STAR? (Y/N)","Notes","Quantity","Apt Qty"]
["1. Fill in cells highlighted with this color, including the Watts/fixture and Light Source in Column K&L.",null,null,null,null,null,null,"MUST BE ALPHABETICAL",null,"A",null,null,{"$f":"INDEX(Lookup!$P$9:$P$24,MATCH(K4,Lookup!$K$9:$K$24,0))","v":{"$error":"#N/A"}},null,null,null,null,{"$f":"SUMIF($G$30:$G$361, J4, $K$30:$K$361)/L4","v":{"$error":"#DIV/0!"}},{"$f":"SUMIF('In-Unit Lighting'!$E$13:$E$64, J4, 'In-Unit Lighting'!$N$13:$N$64)/L4","v":{"$error":"#DIV/0!"}}]
["2. When available, provide manufacturer, model, location, and whether ENERGY STAR qualified.",null,null,null,null,null,null,null,null,"B",null,null,{"$f":"INDEX(Lookup!$P$9:$P$24,MATCH(K5,Lookup!$K$9:$K$24,0))","v":{"$error":"#N/A"}},null,null,null,null,{"$error":"#DIV/0!"},{"$f":"SUMIF('In-Unit Lighting'!$E$13:$E$64, J5, 'In-Unit Lighting'!$N$13:$N$64)/L5","v":{"$error":"#DIV/0!"}}]
["3. List NON-APARTMENT rooms in the building that have specified lighting by FLOOR. For typical floors, indicate the floor multiplier in Column J.",null,null,null,null,null,null,null,null,"C",null,null,{"$f":"INDEX(Lookup!$P$9:$P$24,MATCH(K6,Lookup!$K$9:$K$24,0))","v":{"$error":"#N/A"}},null,null,null,null,{"$error":"#DIV/0!"},{"$f":"SUMIF('In-Unit Lighting'!$E$13:$E$64, J6, 'In-Unit Lighting'!$N$13:$N$64)/L6","v":{"$error":"#DIV/0!"}}]
{"$rows_left_out":361}
{"sheet":"In-Unit Lighting","index":21,"n_rows":75,"n_cols":23,"rows_kept":75,"cut":false,"hidden":false,"merged":[[54,1,54,6],[50,1,50,4],[51,1,51,4],[4,1,4,15],[6,1,6,15],[46,1,46,5],[47,1,47,4],[48,1,48,4],[49,1,49,4]]}
[null,"Calculator - In-Unit Lighting"]
[]
[null,"Instructions:"]
[1,"Include all in-unit hard-wired lighting in this table. Rated wattage must include ballast (follow 90.1 User's manual or Appendix B of Performance Path Requirements)."]
[2,"Only the rooms for which there are specified hard-wired lighting fixtures should be entered in this table. Therefore, the total square feet that you list in this table might be smaller than the total square feet of the apartments. If there are multiple fixtures per room, distribute area accordingly."]
[3,"Rooms with more than one fixture type should be entered using multiple rows; square footage should be distributed between entries."]
{"$rows_left_out":70}
{"sheet":"Exterior Lighting","index":22,"n_rows":44,"n_cols":10,"rows_kept":44,"cut":false,"hidden":false,"merged":[[12,1,13,1],[43,1,43,6],[19,9,19,13],[12,2,12,4],[21,2,21,4]]}
[null,"Calculator - Exterior Lighting"]
[]
[null,"Instructions:"]
[1,"Select \"Exterior Lighting Zone\" from drop down list, based on exterior lighting zone type identified in 90.1-2010 Table 9.4.3A."]
[2,"Enter data in the cells highlighted with this color. "]
[3,"Use values from the cells highlighted in this color in the energy simulations. "]
{"$rows_left_out":39}
{"sheet":"Infiltration&Ventilation","index":23,"n_rows":77,"n_cols":10,"rows_kept":77,"cut":false,"hidden":false,"merged":[[18,2,18,3],[19,2,19,3],[54,2,54,3],[54,4,54,5],[54,6,54,7],[54,8,54,9],[62,4,62,5],[62,6,62,7],[62,8,62,9],[63,2,63,3],[63,4,63,5],[63,6,63,7],[63,8,63,9],[76,1,76,6],[65,2,65,3],[65,4,65,5],[65,6,65,7],[65,8,65,9],[68,2,68,3],[68,4,68,5],[68,6,68,7],[68,8,68,9]]}
[null,"Infiltration & Ventilation"]
[]
[null,"Instructions: "]
[1,"Fill in cells highlighted with this color."]
[2,"Data to be entered into simulation software."]
[3,"Supply and exhaust ventilation CFM and fan power must be modeled explicitly and cannot be combined with infiltration"]
{"$rows_left_out":72}
{"sheet":"EIR for PTAC and PTHP","index":24,"n_rows":39,"n_cols":16,"rows_kept":39,"cut":false,"hidden":false,"merged":[[38,1,38,6],[11,12,11,14],[10,2,10,3],[10,4,10,10],[23,2,23,3],[23,4,23,10]]}
[null,"eQUEST Calculator - EIR for PTAC and PTHP"]
[]
[null,"Instructions: "]
[1,"For gas heated buildings using System 1 - PTAC, use the top chart to calculate cooling-EIR"]
[2,"For electric heated buildings using System 2 - PTHP, use the bottom chart to calculate cooling-EIR"]
[3,"Baseline PTAC fan energy should be simulated as 0.3 W/CFM"]
{"$rows_left_out":33}