{"text_format":"1","workbook":"xlsx","n_sheets":6,"sheets":["ASHP Calculator","Help & Info","Web ProForma Inputs","TRM lookup tables","Fuel 1 - Savings Calculator","Drop-Down Lists"],"not_rendered":{"charts":0,"images":1,"macros":1,"external_links":4,"defined_names":99,"comments":3,"pivot_tables":0},"unopened":[],"bounds":{"document_bytes":16777216,"sheet_cells":100000,"rows_first":2000,"rows_last":500,"rows_between":2000,"halvings":0,"cell_chars":16384,"cell_head_chars":4096},"cells_cut":0,"cells_raw":0,"read":"whole","date_system":"1900"}

{"sheet":"ASHP Calculator","index":0,"n_rows":46,"n_cols":33,"rows_kept":46,"cut":false,"hidden":false,"merged":[[8,3,8,5],[8,1,19,1],[26,12,26,14],[42,18,42,21],[28,12,28,14],[30,12,30,14],[29,1,29,2],[9,12,9,14],[11,12,11,14],[13,12,13,14],[21,1,27,1],[15,12,15,14],[17,12,17,14],[19,12,19,14],[21,12,21,14]]}
[null,null,null,null,null,null,null,null,null,null,null,null,null,null,null,null,null,null,null,"Room AC","before 2006 (10)","2006 & after (13)","14.5 SEER",null,"Lookup by Fuel Type",null,null,"Unit","Cost per","MBtu per"]
[null,null,null,null,null,null,null,null,null,null,null,null,null,null,null,null,null,null,"Base Case Cooling Systems",null,"Unit","Unit","Const Spd",null,"Fuels",null,"eff","Name","Unit","Unit","Electric Utility/Data Source",null,"Fuel Type"]
[null,null,null,null,null,null,null,null,null,null,null,null,null,null,null,null,null,null,"Rated SEER (Btu/Wh)",11,10,13,14.5,null,"Elect Resist","per kWh",{"$f":"HLOOKUP($D$24,$Z$16:$AB$27,2)","v":{"$error":"#N/A"}},"(kWh)",{"$f":"'Fuel 1 - Savings Calculator'!H7","v":{"$error":"#N/A"}},3.4129999999999998,{"$f":"'Fuel 1 - Savings Calculator'!B5&\" - \"&'Fuel 1 - Savings Calculator'!F7","v":{"$error":"#N/A"}},null,"Electric"]
[null,null,null,null,null,null,"Values that \"Override\" default values",null,null,null,null,null,null,null,null,null,null,null,null,null,null,null,null,null,"Std ASHP","per kWh",{"$f":"HLOOKUP($D$24,$Z$16:$AB$27,3)","v":{"$error":"#N/A"}},{"$f":"AB3","v":"(kWh)"},{"$f":"AC3","v":{"$error":"#N/A"}},{"$f":"AD3","v":3.4129999999999998},{"$f":"AE3","v":{"$error":"#N/A"}},null,"Electric"]
[null,null,null,null,null,null,"Light grey values used in calculations/diagnostics",null,null,null,null,null,null,null,null,null,null,null,null,null,null,null,null,null,"Fuel Oil - Furnace","per gal",{"$f":"HLOOKUP($D$24,$Z$16:$AB$27,4)","v":{"$error":"#N/A"}},"(gal)",{"$f":"'Fuel 1 - Savings Calculator'!H3","v":""},139,{"$f":"'Fuel 1 - Savings Calculator'!F3&\" - \"&'Fuel 1 - Savings Calculator'!H77","v":" - 2017-2019 Avg"},null,"Fuel Oil"]
[null,null,null,null,null,null,null,null,null,null,null,null,null,null,null,null,null,null,null,null,null,null,null,null,"Fuel Oil - Boiler","per gal",{"$f":"HLOOKUP($D$24,$Z$16:$AB$27,5)","v":{"$error":"#N/A"}},{"$f":"AB5","v":"(gal)"},{"$f":"AC5","v":""},{"$f":"AD5","v":139},{"$f":"AE5","v":" - 2017-2019 Avg"},null,"Fuel Oil"]
[null,null,"Air Source Heat Pump",null,null,null,null,null,null,null,null,"Customer Information",null,null,null,null,null,null,null,null,null,null,null,null,"Natural Gas - Furnace","per therm",{"$f":"HLOOKUP($D$24,$Z$16:$AB$27,6)","v":{"$error":"#N/A"}},"(therms)",{"$f":"'Fuel 1 - Savings Calculator'!H4","v":""},100,{"$f":"'Fuel 1 - Savings Calculator'!B6","v":0},null,"Natural Gas"]
[null,null,"Building Heating Load (Manual J):",null,null,"Btu/h @ Des Tmp:",null,"F               ASHP Application:",null,{"$f":"IF(D16>=0.9,\"FULL-LOAD\",\"PARTIAL\")","v":{"$error":"#DIV/0!"}},null,null,null,null,null,null,null,null,null,null,null,null,null,null,"Natural Gas - Boiler","per therm",{"$f":"HLOOKUP($D$24,$Z$16:$AB$27,7)","v":{"$error":"#N/A"}},{"$f":"AB7","v":"(therms)"},{"$f":"AC7","v":""},{"$f":"AD7","v":100},{"$f":"AE7","v":0},null,"Natural Gas"]
[null,"ASHP System","ASHP Type/Scenario",null,null,null,{"$f":"E8*('TRM lookup tables'!A55-'TRM lookup tables'!I61)/(G8-'TRM lookup tables'!I61)","v":{"$error":"#N/A"}},{"$f":"VLOOKUP(D9,'TRM lookup tables'!$B$69:$G$75,5)","v":{"$error":"#N/A"}},{"$f":"VLOOKUP(D9,'TRM lookup tables'!$B$69:$G$75,6)","v":{"$error":"#N/A"}},null,null,null,null,null,null,null,null,null,null,"Base Calcs","HSPF Factor",null,null,null,"Propane - Furnace","per gal",{"$f":"HLOOKUP($D$24,$Z$16:$AB$27,8)","v":{"$error":"#N/A"}},"(gal)",{"$f":"'Fuel 1 - Savings Calculator'!H5","v":""},92,{"$f":"'Fuel 1 - Savings Calculator'!F5&\" - \"&'Fuel 1 - Savings Calculator'!H105","v":" - 2017-2019 Avg"},null,"Propane"]
[null,null,"ASHP Cooling Capacity at 95F",null,null,"Btu/h (all units)",null,null,"No. of Outdoor Units:",null,null,"Name:",null,null,null,null,null,null,null,"City",null,null,null,null,"Propane  - Boiler","per gal",{"$f":"HLOOKUP($D$24,$Z$16:$AB$27,9)","v":{"$error":"#N/A"}},{"$f":"AB9","v":"(gal)"},{"$f":"AC9","v":""},{"$f":"AD9","v":92},{"$f":"AE9","v":" - 2017-2019 Avg"},null,"Propane"]
[null,null,"Max ASHP Heating Capacity at 5F",null,null,"Btu/h (all units)","Weather City:",null,"Total Installed Cost:",null,null,null,null,null,null,null,null,null,"NYC","New York",0.8,null,null,null,"Wood","per cord",{"$f":"HLOOKUP($D$24,$Z$16:$AB$27,10)","v":{"$error":"#N/A"}},"(cord)",{"$f":"'Fuel 1 - Savings Calculator'!H8","v":225},24000,"Statewide Dec-18",null,"Wood"]
[null,null,{"$f":"\"Max ASHP Heating Capacity at \"&G8&\"F\"","v":"Max ASHP Heating Capacity at F"},null,null,null,{"$f":"'TRM lookup tables'!B2","v":{"$error":"#N/A"}},null,null,null,null,"Address:",null,null,null,null,null,null,"Western","Buffalo",0.73,null,null,null,"Wood Pellets","per ton",{"$f":"HLOOKUP($D$24,$Z$16:$AB$27,11)","v":{"$error":"#N/A"}},"(ton)",{"$f":"'Fuel 1 - Savings Calculator'!H9","v":{"$error":"#N/A"}},{"$f":"16500","v":16500},{"$f":"'Fuel 1 - Savings Calculator'!F9&\" - \"&'Fuel 1 - Savings Calculator'!H118","v":{"$error":"#N/A"}},null,"Wood"]
[null,null,"ASHP Rated HSPF",null,null,"Weather Region:",{"$f":"VLOOKUP(M16,'Fuel 1 - Savings Calculator'!L:V,11,)","v":{"$error":"#N/A"}},"Heating Load:",{"$f":"IF(G26>0,G26*G25*I25/1000,F15*G9*G14/1000000)","v":{"$error":"#N/A"}},"MMBtu/yr",null,null,null,null,null,null,null,null,"Central","Binghamton",0.68,null,null,null,"Coal","per ton",{"$f":"HLOOKUP($D$24,$Z$16:$AB$27,12)","v":{"$error":"#N/A"}},"(ton)",200,20150,"prelim costs",null,"Coal"]
[null,null,"ASHP Rated SEER",null,"Nearest HP_Siz",{"$f":"'TRM lookup tables'!C32","v":{"$error":"#N/A"}},{"$f":"'TRM lookup tables'!B32","v":{"$error":"#N/A"}},null,null,{"$f":"IF(G26,\"(Meas Fuel)\",\"(TRM)\")","v":"(TRM)"},null,"City, State:",null,null,null,null,null,null,"North Country","Massena",0.59]
[null,null,"TRM  Scenario",{"$f":"IF('TRM lookup tables'!AS4=\"\",\"invalid\",'TRM lookup tables'!AS4)","v":{"$error":"#N/A"}},"   BEFLH_h",{"$f":"'TRM lookup tables'!A54","v":{"$error":"#N/A"}},{"$f":"'TRM lookup tables'!B8","v":{"$error":"#N/A"}},{"$f":"'TRM lookup tables'!C8","v":{"$error":"#N/A"}},null,null,null,null,null,null,null,null,null,null,"Capital District","Albany",0.7,null,null,null,null,"Efficiency based on Equipment Life"]
{"$rows_left_out":32}
{"sheet":"Help & Info","index":1,"n_rows":42,"n_cols":11,"rows_kept":42,"cut":false,"hidden":false,"merged":[[3,2,6,2],[3,3,6,3],[3,4,6,4],[3,6,5,6],[7,2,14,2],[7,3,14,3],[7,4,12,4],[7,5,9,5],[10,5,12,5],[13,4,14,4],[20,5,21,5],[10,7,12,7],[13,5,14,5],[15,2,17,2],[15,3,17,3],[16,4,17,4],[16,5,17,5],[18,2,21,2],[18,3,21,3],[18,4,19,4],[18,5,19,5],[20,4,21,4]]}
[null,"Scenario Table from Technical Resource Manual (TRM) (some Scenarios are currently disabled in this tool, shown as strike-thru, grey)",null,null,null,null,null,null,"Guidance & Common Issues"]
[]
[null,"Scenario","Description","ASHP Type","Application","Controls","HP Sizing Ratio",null,"ERRORS"]
[null,"1a","Central Ducted ASHP","Central, Ducted","Whole","Integrated/ Modulating",0.9,null,"Scenario is \"Invalid\":",null,"You must choose a ASHP Type/Scenario that is "]
[null,"1b",null,null,null,"Integrated/ Fixed capacity",null,null,null,null,"compatible with the HP Sizing fraction (cell D15)"]
[null,"1c",null,null,null,"DF/Either HP or Furnace",null,null,null,null,"If scenario is FULL-LOAD then HP sizing greater than or equal to 0.9.  PARTIAL then HP sizing less than 0.9"]
[null,"1d",null,null,null,"Integrated/ Modulating  ",1,null,"WARNINGS"]
[null,"2a","Ductless Mini-spilt sized at 30%, 50%, 70% and 90/100%","Single-zone Ductless","Displace","Separate",0.3,null,"ASHP Rated Data is Orange",null,"If you have multiple ASHPs use the calculator starting in Cell L34.  Enter Rated/NEEP values for all units."]
[null,"2b",null,null,null,null,0.5,null,null,null,"Then Enter the Capacities, HSPF and SEER in Cells E10:E11 and D12:13"]
[null,"2c",null,null,null,null,0.7,null,null,null,"If the entered values are different from the \"calculator\" values,  the Text turns Orange"]
[null,"2d",null,null,null,"Integrated/ Fixed Capacity",0.3,"Enhanced Control Option for ASHP (FUTURE USE)"]
[null,"2e",null,null,null,null,0.5]
[null,"2f",null,null,null,null,0.7]
[null,"2g",null,null,"Whole","Integrated/ Modulating ",0.9]
[null,"2h",null,null,null,null,1]
{"$rows_left_out":28}
{"sheet":"Web ProForma Inputs","index":2,"n_rows":19,"n_cols":2,"rows_kept":19,"cut":false,"hidden":false,"merged":[]}
["Web ProForma Inputs for Savings"]
[]
["Total Project Cost",{"$f":"'ASHP Calculator'!$J$11","v":0}]
["Installed Capacity"]
["MWh Generation"]
["MWH Savings",{"$f":"'ASHP Calculator'!D40/3.412","v":{"$error":"#N/A"}}]
["Natural Gas MMBTU Savings",{"$f":"'ASHP Calculator'!D41","v":0}]
["Propane MMBTU Savings",{"$f":"'ASHP Calculator'!D42","v":0}]
["#2/Distillate Oil MMBTU Savings",{"$f":"'ASHP Calculator'!D43","v":0}]
["#6/ Residual Oil MMBTU Savings"]
["Gasoline MMBTU Savings"]
["Wood MMBTU Savings",{"$f":"'ASHP Calculator'!D44","v":0}]
["Steam MMBTU Savings"]
["Kerosene MMBTU Savings"]
["Coal MMBTU Savings",{"$f":"'ASHP Calculator'!D45","v":0}]
{"$rows_left_out":5}
{"sheet":"TRM lookup tables","index":3,"n_rows":75,"n_cols":49,"rows_kept":75,"cut":false,"hidden":true,"merged":[[5,39,5,40],[29,24,29,30],[5,20,5,21],[29,5,29,11],[4,24,4,37],[5,24,5,25],[5,26,5,27],[5,28,5,29],[5,30,5,31],[5,32,5,33],[5,34,5,35],[5,36,5,37],[4,5,4,18],[5,5,5,6],[5,7,5,8],[5,9,5,10],[5,11,5,12],[5,13,5,14],[5,15,5,16],[5,17,5,18]]}
["INPUTS",{"$f":"'ASHP Calculator'!M16","v":0},"zip",null,null,null,"These coefficients are the orignal TRM values that use QH5_max to find the HP Sizing in NYC (not QH17_rated or QH17_max)",null,null,null,null,null,null,null,null,null,null,null,null,null,null,null,null,null,null,null,null,null,null,null,null,null,null,null,null,null,null,null,null,null,null,null,null,"Type",{"$f":"'ASHP Calculator'!H9","v":{"$error":"#N/A"}},{"$f":"'ASHP Calculator'!D9","v":0}]
["Location",{"$f":"VLOOKUP(B1,'Fuel 1 - Savings Calculator'!L:X,13,)","v":{"$error":"#N/A"}},null,{"$f":"VLOOKUP(B2,$R$32:$S$38,2,TRUE)","v":{"$error":"#N/A"}},null,null,null,null,null,null,null,null,null,null,null,null,null,null,null,null,null,null,null,null,null,null,null,null,null,null,null,null,null,null,null,null,null,null,null,null,null,null,null,"Control",{"$f":"'ASHP Calculator'!I9","v":{"$error":"#N/A"}},{"$f":"'ASHP Calculator'!G9","v":{"$error":"#N/A"}}]
["Vintage",{"$f":"'ASHP Calculator'!E21","v":0},null,{"$f":"VLOOKUP(B3,$R$40:$S$42,2,)","v":{"$error":"#N/A"}},null,null,null,null,null,null,null,null,null,null,null,null,null,null,null,null,null,null,null,null,null,null,null,null,null,null,null,null,null,null,null,null,null,null,null,null,null,null,null,"HP_siz",{"$f":"'ASHP Calculator'!F16","v":{"$error":"#N/A"}}]
["Scenario",{"$f":"'ASHP Calculator'!D15","v":{"$error":"#N/A"}},null,null,null,null,null,null,null,null,null,null,null,null,null,null,null,null,null,null,null,null,null,null,null,null,null,null,null,null,null,null,null,null,null,null,null,null,null,null,null,null,null,"Nearest Scenario",{"$f":"AW8&AW9&AW10&AW11&AW12&AW13&AW14&AW15&AW16&AW17&AW18&AW19&AW20&AW21&AW22&AW23&AW24&AW25&AW26","v":{"$error":"#N/A"}}]
[null,null,null,null,null,"Coefficients of Best Fit Linear Model:  COP = a + b x HSPF/3.412",null,null,null,null,null,null,null,null,null,null,null,null,null,null,null,null,null,null,"Coefficients of Best Fit Linear Model:  EER = c + d x SEER"]
[{"$f":"B2","v":{"$error":"#N/A"}},null,null,null,null,"Albany",null,"Binghamton",null,"Buffalo",null,"Massena",null,"New York",null,"Poughkeepsie",null,"Syracuse",null,null,{"$f":"B2","v":{"$error":"#N/A"}},null,null,null,"Albany",null,"Binghamton",null,"Buffalo",null,"Massena",null,"New York",null,"Poughkeepsie",null,"Syracuse",null,null,{"$f":"B2","v":{"$error":"#N/A"}}]
["Scenario","a","b",null,"Scenario","a","b","a","b","a","b","a","b","a","b","a","b","a","b",null,"a","b",null,"Scenario","c","d","c","d","c","d","c","d","c","d","c","d","c","d",null,"a","b",null,"Scenario","Type","Control","HP_siz","min","max"]
[{"$f":"B4","v":{"$error":"#N/A"}},{"$f":"VLOOKUP($B$4,$T$8:$V$26,2,)","v":{"$error":"#N/A"}},{"$f":"VLOOKUP($B$4,$T$8:$V$26,3,)","v":{"$error":"#N/A"}},null,"1a",-1.04268E-2,0.88006300000000004,0.112596,0.85402900000000004,0.21875600000000001,0.84176799999999996,-0.18515999999999999,0.83758100000000002,0.91902300000000003,0.73754299999999995,0.33333299999999999,0.79571400000000003,0.124039,0.85965899999999995,{"$f":"E8","v":"1a"},{"$f":"OFFSET(E8,0,($D$2-1)*2+1)","v":{"$error":"#N/A"}},{"$f":"OFFSET(E8,0,($D$2-1)*2+2)","v":{"$error":"#N/A"}},null,"1a",-0.54250799999999999,0.96057499999999996,0.918188,0.91367600000000004,-1.3710100000000001,1.0349200000000001,-0.39118700000000001,0.93649800000000005,0.96611800000000003,0.88889300000000004,-0.50685800000000003,0.96547099999999997,-0.81234399999999996,0.98781600000000003,{"$f":"X8","v":"1a"},{"$f":"OFFSET(X8,0,($D$2-1)*2+1)","v":{"$error":"#N/A"}},{"$f":"OFFSET(X8,0,($D$2-1)*2+2)","v":{"$error":"#N/A"}},null,{"$f":"AM8","v":"1a"},1,4,0.9,0.6,1,{"$f":"IF($AS$1=AR8,IF($AS$2=AS8,IF($AS$3>=AU8,IF($AS$3<AV8,AQ8,\"\"),\"\"),\"\"),\"\")","v":{"$error":"#N/A"}}]
[null,null,null,null,"1b",-3.96361E-2,0.89089399999999996,9.18297E-2,0.86287800000000003,0.19714400000000001,0.85059200000000001,-0.16777900000000001,0.82991300000000001,0.88789600000000002,0.74974300000000005,0.30078199999999999,0.81271499999999997,9.3425400000000006E-2,0.87115799999999999,{"$f":"E9","v":"1b"},{"$error":"#N/A"},{"$error":"#N/A"},null,"1b",-0.54250799999999999,0.96057499999999996,0.918188,0.91367600000000004,-1.3710100000000001,1.0349200000000001,-0.39118700000000001,0.93649800000000005,0.96611800000000003,0.88889300000000004,-0.50685800000000003,0.96547099999999997,-0.81234399999999996,0.98781600000000003,{"$f":"X9","v":"1b"},{"$error":"#N/A"},{"$error":"#N/A"},null,{"$f":"AM9","v":"1b"},1,2,0.9,0.6,1.8,{"$f":"IF($AS$1=AR9,IF($AS$2=AS9,IF($AS$3>=AU9,IF($AS$3<AV9,AQ9,\"\"),\"\"),\"\"),\"\")","v":{"$error":"#N/A"}}]
[null,"c","d",null,"1c",5.6263100000000003E-2,0.90624199999999999,0.22012499999999999,0.86966299999999996,0.31021700000000002,0.84904900000000005,-5.6628999999999999E-2,0.92161899999999997,0.94481000000000004,0.74054200000000003,0.57921400000000001,0.80195300000000003,0.18295600000000001,0.87536199999999997,"1c",{"$error":"#N/A"},{"$error":"#N/A"},null,"1c",-0.54250799999999999,0.96057499999999996,0.918188,0.91367600000000004,-1.3710100000000001,1.0349200000000001,-0.39118700000000001,0.93649800000000005,0.96611800000000003,0.88889300000000004,-0.50685800000000003,0.96547099999999997,-0.81234399999999996,0.98781600000000003,"1c",{"$error":"#N/A"},{"$error":"#N/A"},null,"1c",1,3,0.9,0.6,1.8,{"$error":"#N/A"}]
[{"$f":"B4","v":{"$error":"#N/A"}},{"$f":"VLOOKUP($B$4,$AM$8:$AO$26,2,)","v":{"$error":"#N/A"}},{"$f":"VLOOKUP($B$4,$AM$8:$AO$26,3,)","v":{"$error":"#N/A"}},null,"1d",-0.116548,0.90195899999999996,-3.33541E-3,0.87920500000000001,8.0877900000000003E-2,0.87559699999999996,-0.25917600000000002,0.84718000000000004,0.84366300000000005,0.75169799999999998,0.23741200000000001,0.81540500000000005,-7.2356599999999997E-3,0.88977899999999999,"1d",{"$error":"#N/A"},{"$error":"#N/A"},null,"1d",-0.46004499999999998,0.94626299999999997,-0.13969200000000001,0.96554300000000004,-1.6720900000000001,1.0408200000000001,-0.21340100000000001,0.91580300000000003,0.46476400000000001,0.91123600000000005,-0.58849499999999999,0.96053200000000005,-0.88736899999999996,0.98235600000000001,"1d",{"$error":"#N/A"},{"$error":"#N/A"},null,"1d",1,4,1,1,1.8,{"$error":"#N/A"}]
[null,null,null,null,"2a",2.5517300000000001,0.19697700000000001,2.5324900000000001,0.20233100000000001,2.6448999999999998,0.181307,2.3035299999999999,0.20405100000000001,2.4572600000000002,0.30346600000000001,2.6196299999999999,0.17718700000000001,2.56528,0.19474900000000001,"2a",{"$error":"#N/A"},{"$error":"#N/A"},null,"2a",12.3316,0.11848400000000001,11.9535,0.115618,12.244400000000001,0.130049,12.3612,0.135458,11.9689,0.109085,12.1044,0.11114300000000001,12.1782,0.122544,"2a",{"$error":"#N/A"},{"$error":"#N/A"},null,"2a",2,1,0.3,0,0.3,{"$error":"#N/A"}]
[null,null,null,null,"2b",2.3506100000000001,0.25554900000000003,2.41886,0.24255399999999999,2.6438899999999999,0.18779899999999999,2.01064,0.29049000000000003,2.4532500000000002,0.314633,2.4699800000000001,0.228466,2.5002,0.217112,"2b",{"$error":"#N/A"},{"$error":"#N/A"},null,"2b",11.4399,0.20794399999999999,12.209300000000001,0.145533,11.0082,0.228714,10.3293,0.27255600000000002,12.2719,0.14027500000000001,12.129,0.166713,11.333500000000001,0.20985500000000001,"2b",{"$error":"#N/A"},{"$error":"#N/A"},null,"2b",2,1,0.5,0.3,0.5,{"$error":"#N/A"}]
[null,null,null,null,"2c",2.4412799999999999,0.227774,2.4803299999999999,0.22357199999999999,2.6186699999999998,0.19772300000000001,2.3584800000000001,0.20286100000000001,2.6169799999999999,0.27066899999999999,2.45886,0.238566,2.5503,0.20566899999999999,"2c",{"$error":"#N/A"},{"$error":"#N/A"},null,"2c",9.8067899999999995,0.30627599999999999,10.9414,0.23219100000000001,9.5909800000000001,0.30165199999999998,9.1570699999999992,0.32120199999999999,11.246600000000001,0.21984999999999999,10.305300000000001,0.28214899999999998,9.7423800000000007,0.307813,"2c",{"$error":"#N/A"},{"$error":"#N/A"},null,"2c",2,1,0.7,0.5,0.9,{"$error":"#N/A"}]
[null,null,null,null,"2d",2.6152199999999999,0.113486,2.63679,0.11269999999999999,2.7015500000000001,0.107511,2.3119499999999999,0.14986099999999999,2.9977200000000002,0.10546899999999999,2.7249099999999999,0.103502,2.6551399999999998,0.10696799999999999,"2d",{"$error":"#N/A"},{"$error":"#N/A"},null,"2d",12.3316,0.11848400000000001,11.9535,0.115618,12.244400000000001,0.130049,12.3612,0.135458,11.9689,0.109085,12.1044,0.11114300000000001,12.1782,0.122544,"2d",{"$error":"#N/A"},{"$error":"#N/A"},null,"2d",2,2,0.3,0,0.3,{"$error":"#N/A"}]
{"$rows_left_out":61}
{"sheet":"Fuel 1 - Savings Calculator","index":4,"n_rows":2158,"n_cols":24,"rows_kept":2158,"cut":false,"hidden":true,"merged":[]}
["Inputs",null,"          ","          ","Project Fuel Costs"]
["Zip",{"$f":"'ASHP Calculator'!M16","v":0},null,null,"Price",null,null,"Final","  ","Unique ID for Zip/County Combo","ZIP Code","ZIP Code","NYISO Zone","Utility","County","Electric REDC Name - Region","Heating Oil Region-County Mapping","KEROSENSE REGION_COUNTY MAPPING","PROPANE REGION_COUNTY MAPPING","Consolidated Edison Region","NYISO Zone","Mmbtu/kBtu - Added KWh/kbtu/h","Pellets","Weather City"]
["County",{"$f":"'ASHP Calculator'!M18","v":0},null,null,"Oil",{"$f":"IF(ISERROR($H$90),\"\",OFFSET(F90,-2,0))","v":""},null,{"$f":"IF(ISERROR($H$90),\"\",H90)","v":""},null,"12009Albany","12009",12009,"Zone F - Capital","National Grid","Albany","Capital Region","Capital District","Capital District","Capital District",null,"Zone F - Capital","Capital District","Capital District","Albany"]
["Fuel",{"$f":"VLOOKUP('ASHP Calculator'!C23,'ASHP Calculator'!$Y$3:$AG$12,9,)","v":{"$error":"#N/A"}},null,null,"Natural Gas",null,null,{"$f":"IF(ISERROR(VLOOKUP($B$6,$E$65:$H$75,4,)),\"\",VLOOKUP($B$6,$E$65:$H$75,4,))","v":""},null,"12023Albany","12023",12023,"Zone F - Capital","National Grid","Albany","Capital Region","Capital District","Capital District","Capital District",null,"Zone F - Capital","Capital District","Capital District","Albany"]
["Electric Utility",{"$f":"'ASHP Calculator'!M20","v":0},null,null,"Propane",{"$f":"IF(ISERROR($H$116),\"\",OFFSET(F116,-2,0))","v":""},null,{"$f":"IF(ISERROR($H$116),\"\",H116)","v":""},null,"12041Albany","12041",12041,"Zone F - Capital","National Grid","Albany","Capital Region","Capital District","Capital District","Capital District",null,"Zone F - Capital","Capital District","Capital District","Albany"]
["Natural Gas Utility",{"$f":"'ASHP Calculator'!M22","v":0},null,null,"Kerosene",{"$f":"IF(ISERROR(F$101),\"\",F$101)","v":""},null,{"$f":"IF(ISERROR(H$101),\"\",H$101)","v":""},null,"12047Albany","12047",12047,"Zone F - Capital","National Grid","Albany","Capital Region","Capital District","Capital District","Capital District",null,"Zone F - Capital","Capital District","Capital District","Albany"]
["Price per Unit of Energy",{"$f":"IF(ISERROR(VLOOKUP(B4,E3:H10,4,)),\"\",VLOOKUP(B4,E3:H10,4,))","v":""},null,null,"Electric",{"$f":"F22","v":{"$error":"#N/A"}},null,{"$f":"H22","v":{"$error":"#N/A"}},null,"12054Albany","12054",12054,"Zone F - Capital","National Grid","Albany","Capital Region","Capital District","Capital District","Capital District",null,"Zone F - Capital","Capital District","Capital District","Albany"]
[null,null,null,null,"Cord Wood",225,null,225,null,"12059Albany","12059",12059,"Zone F - Capital","National Grid","Albany","Capital Region","Capital District","Capital District","Capital District",null,"Zone F - Capital","Capital District","Capital District","Albany"]
[null,null,null,null,"Wood Pellets",{"$f":"F127","v":{"$error":"#N/A"}},null,{"$f":"H129","v":{"$error":"#N/A"}},null,"12067Albany","12067",12067,"Zone F - Capital","National Grid","Albany","Capital Region","Capital District","Capital District","Capital District",null,"Zone F - Capital","Capital District","Capital District","Albany"]
[null,null,null,null,null,null,null,null,null,"12077Albany","12077",12077,"Zone F - Capital","National Grid","Albany","Capital Region","Capital District","Capital District","Capital District",null,"Zone F - Capital","Capital District","Capital District","Albany"]
[null,null,null,null,null,null,null,null,null,"12084Albany","12084",12084,"Zone F - Capital","National Grid","Albany","Capital Region","Capital District","Capital District","Capital District",null,"Zone F - Capital","Capital District","Capital District","Albany"]
[null,null,null,null,"Residential Electric Rates",null,null,"2017-2019 Avg",null,"12085Albany","12085",12085,"Zone F - Capital","National Grid","Albany","Capital Region","Capital District","Capital District","Capital District",null,"Zone F - Capital","Capital District","Capital District","Albany"]
[null,null,null,null,"Electric Utility Company",null,null,"$ / kWh",null,"12107Albany","12107",12107,"Zone F - Capital","National Grid","Albany","Capital Region","Capital District","Capital District","Capital District",null,"Zone F - Capital","Capital District","Capital District","Albany"]
[null,null,null,null,"Central Hudson Gas and Electric",null,null,0.14000000000000001,null,"12110Albany","12110",12110,"Zone F - Capital","National Grid","Albany","Capital Region","Capital District","Capital District","Capital District",null,"Zone F - Capital","Capital District","Capital District","Albany"]
[null,null,null,null,"Consolidated Edison",{"$f":"F61","v":{"$error":"#N/A"}},null,{"$f":"H61","v":""},null,"12128Albany","12128",12128,"Zone F - Capital","National Grid","Albany","Capital Region","Capital District","Capital District","Capital District",null,"Zone F - Capital","Capital District","Capital District","Albany"]
{"$rows_left_out":2144}
{"sheet":"Drop-Down Lists","index":5,"n_rows":2158,"n_cols":10,"rows_kept":2158,"cut":false,"hidden":true,"merged":[]}
[]
["Electric Utility Name Lookup",null," ","Natural Gas List"," ","ZIP Code List"," ","County List"," ","Whole House?"]
["Central Hudson Gas and Electric","Central Hudson Gas and Electric",null,"Central Hudson Gas and Electric",null,"00501",null,"Albany",null,"Yes"]
["Consolidated Edison","Consolidated Edison",null,"Consolidated Edison",null,"00544",null,"Allegany",null,"No"]
["National Grid","National Grid",null,"National Fuel Gas Distribution",null,"06390",null,"Bronx"]
["New York State Electric and Gas","New York State Electric and Gas",null,"National Grid - Upstate",null,10001,null,"Broome"]
["Orange and Rockland","Orange and Rockland",null,"National Grid - Long Island",null,10002,null,"Cattaraugus"]
["Rochester Gas and Electric","Rochester Gas and Electric",null,"National Grid - NYC",null,10003,null,"Cayuga"]
["PSEG Long Island","PSEG Long Island",null,"New York State Electric and Gas",null,10004,null,"Chautauqua"]
["PSEG Long Island","PSEG Long Island",null,"Orange and Rockland",null,10005,null,"Chemung"]
["Other","Other",null,"Rochester Gas and Electric",null,10006,null,"Chenango"]
[null,null,null,"Corning Natural Gas",null,10007,null,"Clinton"]
[null,null,null,"St. Lawrence",null,10008,null,"Columbia"]
[null,null,null,null,null,10009,null,"Cortland"]
[null,null,null,null,null,10010,null,"Delaware"]
{"$rows_left_out":2143}