{"text_format":"1","workbook":"xlsx","n_sheets":4,"sheets":["Project Summary Sheet","Notes List","References","Savings Check"],"not_rendered":{"charts":0,"images":3,"macros":1,"external_links":0,"defined_names":4,"comments":3,"pivot_tables":0},"unopened":[],"bounds":{"document_bytes":16777216,"sheet_cells":100000,"rows_first":2000,"rows_last":500,"rows_between":2000,"halvings":0,"cell_chars":16384,"cell_head_chars":4096},"cells_cut":0,"cells_raw":0,"read":"whole","date_system":"1900"}

{"sheet":"Project Summary Sheet","index":0,"n_rows":77,"n_cols":28,"rows_kept":77,"cut":false,"hidden":false,"merged":[[15,24,15,27],[73,2,73,4],[74,2,74,4],[75,2,75,5],[76,2,76,5],[67,2,67,4],[68,2,68,4],[69,2,69,4],[70,2,70,4],[71,2,71,4],[72,2,72,4],[61,2,61,4],[62,2,62,4],[63,2,63,4],[64,1,64,4],[65,2,65,4],[66,2,66,4],[55,2,55,4],[56,2,56,4],[57,2,57,4],[58,2,58,4],[59,2,59,4],[60,2,60,4],[49,2,49,4],[50,2,50,4],[51,2,51,4],[52,2,52,4],[53,2,53,4],[54,2,54,4],[43,2,43,4],[44,2,44,4],[45,2,45,4],[46,2,46,4],[47,2,47,4],[48,2,48,4],[37,2,37,4],[38,2,38,4],[39,2,39,4],[40,2,40,4],[41,2,41,4],[42,2,42,4],[31,2,31,4],[32,2,32,4],[33,2,33,4],[34,2,34,4],[35,2,35,4],[36,2,36,4],[25,2,25,4],[26,2,26,4],[27,2,27,4],[28,2,28,4],[29,2,29,4],[30,2,30,4],[22,19,23,19],[22,21,23,21],[22,22,22,23],[17,11,17,12],[17,13,17,14],[17,15,17,16],[17,17,17,18],[22,24,22,25],[22,26,22,27],[24,1,24,4],[22,13,23,13],[22,14,23,14],[22,15,23,15],[22,16,23,16],[22,17,23,17],[22,18,23,18],[22,1,23,1],[22,2,23,4],[22,5,23,5],[22,6,22,7],[22,8,22,9],[22,10,22,12],[16,11,16,12],[16,13,16,14],[16,15,16,16],[16,17,16,18],[18,19,18,21],[20,1,20,19],[21,1,21,5],[21,6,21,12],[21,13,21,14],[21,18,21,19],[21,21,21,27],[17,19,17,21],[18,1,18,2],[18,3,18,4],[18,5,18,6],[18,7,18,8],[18,9,18,10],[18,11,18,12],[18,13,18,14],[18,15,18,16],[18,17,18,18],[17,5,17,6],[17,7,17,8],[17,9,17,10],[16,19,16,21],[17,1,17,2],[1,2,1,6],[12,1,12,18],[14,1,14,21],[15,3,15,4],[15,5,15,6],[15,7,15,8],[15,9,15,10],[15,11,15,12],[15,13,15,14],[15,15,15,16],[15,17,15,18],[15,19,15,21],[2,2,2,6],[1,8,2,14],[1,21,1,22],[1,15,2,18],[6,1,6,18],[16,1,16,2],[16,3,16,4],[16,5,16,6],[16,7,16,8],[16,9,16,10]]}
[]
[null,"PROJECT: ",null,null,null,null,null,null,"List any local laws or executive orders relevant to the project: \n(ex. LL87, LL97, EO88, EO166, etc.)",null,null,null,null,null,null,null,null,null,null,null,null,"v. May 2024"]
[null,"BUILDING: "]
[]
[null,"Instructions:"]
[null,"∙ Complete one (1) Project Summary Sheet per building. Consult with your NYSERDA PM if baseline use cannot be broken out per building. "]
[null,"∙ Include each measure that was evaluated in the study as a separate line item within the Itemized Measures section, including measures not recommended for implementation. If the study includes measure packages, list each individual measure within the Itemized Measures section AND include a line item for each measure package evaluated within the Measure Packages section. Additional guidance on itemized and packaged measures is procided in cells B25 & B65, respectively."]
[null,"∙ Refer to the guidance notes provided throughout the spreadsheet in cells that contain red triangles in the upper right corner of the cell. "]
[null,"∙ Fill in the light blue cells, as appropriate. White cells auto-calculate."]
[null,"∙ Present energy savings as annual savings at the system’s utility meter(s) or at the source of generation for fuels."]
[null,"∙ Update the baseline energy use conversion factors in the 'References' tab, as necessary."]
[null,"∙ Unhide rows to enter more measures, as necessary. If measures are packaged in the study, report package savings starting at row 66. Refer to the note in cell B65 for additional guidance."]
[null,"∙ The Other Cost Savings in columns S & T are supplemental to the FlexTech program. These cost savings were not technically reviewed under FlexTech and are subject to change depending on factors external to NYSERDA, such as NYC Local Laws and Utility Incentive Programs. "]
[]
[null,"ANNUALIZED BASELINE ENERGY SUMMARY"]
{"$rows_left_out":63}
{"sheet":"Notes List","index":1,"n_rows":39,"n_cols":3,"rows_kept":39,"cut":false,"hidden":false,"merged":[]}
["Cell #","Cell Contents","Note"]
["B23","Measure/ Package ID","Assign a reference ID"]
["B25","Itemized Measures","∙ Enter each measure that was evaluated in the study, including measures not recommended for implementation\n∙ If additional rows are needed, click the + symbol next to row 64 below\n∙ If the study includes packaged measures, \n          ∙ list each individual measure here AND\n           ∙ unhide the Packaged Measures section below (at row 76) and include a line item for each package option. Additional packaged measure guidance is in a note in cell A65"]
["B65","Measure Packages","∙ If applicable, list each package of measures that were evaluated in the study as separate line items, including packages not recommended for implementation \n∙ Include interactive savings effects of the measures within each packaged line item\n∙ Also list all individual measures that were evaluated in the study in the Itemized Measures section above. Exclude interactive savings from the individual measures \n\nMeasure Status designation guidance for studies that include packaged measures: \n∙ Mark the recommended package as RME (recommended mutually exclusive)\n∙ Mark the not recommended package or packages as NR (not recommended)\n∙ In the Itemized Measures section above, mark the measures that are included in the recommended package(s) as ME (mutually exclusive)\n∙ In the Itemized Measures section above, mark the measures that are not included in the recommended package(s) with the most appropriate measure status  from these options: I, R, NR, RNE, or RS (see the note in cell F23)"]
["C2","PROJECT:","Enter project identifier (NYSERDA Project Number, Project Name, Address, Client, ETC.)"]
["C3","BUILDING:","Enter building identifier (Building Name, Address, ETC.)"]
["C23","Measure/Package Name","Provide a concise description of the measure. For measure packages, summarize the measures within the package"]
["D17","Electric (kWh) Baseline Energy Use","∙ Report value in kWh"]
["D18","Electric (kWh) Rate Type","∙ Use the dropdown to select the rate type used in the analysis\n\nMarginal/Itemized Rate Analysis:\nTotal electric cost savings = kWh cost savings + kW cost savings\n• Measure cost savings are isolated by kWh and kW and then added together\n• kWh cost savings = kWh rate * kWh savings\n• kW cost savings = kW rate * kW savings\n• kWh rate = kWh cost (including kWh associated taxes, fees, etc.) / kWh consumption\n• kW rate = kW cost (including kW associated taxes, fees, etc.) / kW consumption\n• Use case: preferred for all energy studies, required for studies other than Level 1+\n\nBlended Rate Analysis: \nTotal electric cost savings = kWh rate * kWh savings\n• Measure cost savings are not isolated by kWh and kW\n• kWh rate = Total electric cost / kWh consumption\n• This method implies that any measure with kWh energy impacts will also have a direct impact on utility demand charges (kW).\n• Use case: acceptable for Level I studies or when there are no demand charges on an electric utility bill"]
["E18","Electric (kWh) Average Utility Rate","∙ Enter the electric rate used in the calculations"]
["F17","Electric Demand (kW) Baseline Energy Use","∙ Report value in kW"]
["F18","Electric Demand (kW) Average Utility Rate","∙ Report as the rate per kW"]
["F23","Measure/Package Status","I: Installed\nNR: Not Recommended \nR: Recommended \nRNE: Recommended Non-Energy is for measure(s) that are recommended for a justifiable reason other than energy savings and/or a favorable financial payback (ex. equipment end of life, compliance/code requirement, comfort, measures without energy savings, etc.) \nRME: Recommended Mutually Exclusive is a recommended measure that is mutually exclusive to an alternative analyzed option(s) that directly impacts the same system(s)/equipment (i.e. the RME measure is the best option compared to the other analyzed option(s). A RME measure must be accompanied by one or more mutually exclusive (ME) measures. \nME: Mutually Exclusive is a not recommended measure(s) that has a corresponding alternative option that was analyzed and recommended over the mutually exclusive option(s). ME measure(s) must be accompanied by a RME measure.\nRS: Recommended for Further Study is a measure that requires additional analysis beyond the project's approved scope of work in order to fully evaluate the merits of the measure.  "]
["G22","Energy Savings","All savings should be reported as ANNUAL savings, including kW."]
["G24","Supply Savings (kWh)","Report any and all electric savings in kWh"]
{"$rows_left_out":25}
{"sheet":"References","index":2,"n_rows":27,"n_cols":17,"rows_kept":27,"cut":false,"hidden":false,"merged":[[8,3,8,8],[9,0,9,2],[10,0,10,2],[11,0,11,2],[0,1,0,2],[25,14,25,16],[12,9,12,12],[18,1,18,2],[19,1,19,2],[20,1,20,2],[21,1,21,2]]}
[null,"Measure Status",null,null,"Y"]
[null,"I","Implemented"]
[null,"R","Recommended"]
[null,"NR","Not Recommended"]
[null,"RME","Recommeded Mutually Exclusive"]
[null,"ME","Mutually Exclusive to Recommended Option"]
[null,"RNE","Recommended Non-Energy"]
[null,"RS","Recommended for Further Study"]
[null,null,null,"MMBtu Conversion Factors"]
[null,null,null,"Btu",1000000,"#2 gallon",0.13900000000000001,"Steam Mlbs.",1.194]
[null,null,null,"kWh",3.4120000000000001E-3,"#4 gallon",0.1467,"LPG gallon",9.1499999999999998E-2]
[null,null,null,"therms",0.1,"#6 gallon",0.15,"Coal tons",24]
[null,null,null,null,null,null,null,null,null,"Oil Types"]
[null,null,null,null,null,null,null,null,null,"Oil\n[Select Type]","#2 Oil\n(MMBtu)","#4 Oil\n(MMBtu)","#6 Oil\n(MMBtu)"]
[null,null,null,null,null,null,null,null,null,null,null,null,null,"Fuel Type"]
{"$rows_left_out":13}
{"sheet":"Savings Check","index":3,"n_rows":66,"n_cols":20,"rows_kept":66,"cut":false,"hidden":true,"merged":[[6,17,6,18],[7,3,7,4],[7,5,7,6],[7,7,7,8],[7,9,7,10],[7,11,7,12],[7,13,7,14],[7,15,7,16],[7,17,7,18],[6,7,6,8],[6,9,6,10],[6,11,6,12],[6,13,6,14],[6,15,6,16],[5,11,5,12],[5,13,5,14],[5,15,5,16],[5,17,5,18],[5,19,5,20],[65,1,65,2],[12,3,12,5],[12,6,12,15],[1,2,1,19],[3,3,4,4],[3,5,4,6],[3,7,4,8],[3,9,4,10],[3,11,4,12],[3,13,4,14],[3,15,4,16],[3,17,4,18],[3,19,4,20],[5,3,5,4],[5,7,5,8],[5,9,5,10]]}
[]
[null,null,"BASELINE ENERGY - \nMMBTU CONVERSIONS & RATE CHECK"]
[]
[null,null,null,"Electric \n(MMBtu)",null,"Electric Demand\n(MMBtu)",null,"Natural Gas \n(MMBtu)",null,"Oil\n(MMBtu)",null,"Purchased Steam \n(MMBtu.)",null,"Propane \n(MMBtu)",null,"Coal \n(MMBtu)",null,"Other \n(MMBtu)",null,"Total Fuel\n(MMBtu)"]
[]
[null,null,"Baseline Energy Use (MMBtu)",{"$f":"'Project Summary Sheet'!$D$17*References!$E$11","v":0},null,null,null,{"$f":"'Project Summary Sheet'!$H$17","v":0},null,{"$f":"'Project Summary Sheet'!$J$17","v":0},null,{"$f":"'Project Summary Sheet'!$L$17","v":0},null,{"$f":"'Project Summary Sheet'!$N$17","v":0},null,{"$f":"'Project Summary Sheet'!$P$17","v":0},null,{"$f":"'Project Summary Sheet'!$R$17","v":0},null,{"$f":"SUM(H6:S6)","v":0}]
[null,null,"Utility Rate ($/MMBtu)",null,null,null,null,{"$f":"'Project Summary Sheet'!$H$18","v":0},null,{"$f":"'Project Summary Sheet'!$J$18","v":0},null,{"$f":"'Project Summary Sheet'!$L$18","v":0},null,{"$f":"'Project Summary Sheet'!$N$18","v":0},null,{"$f":"'Project Summary Sheet'!$P$18","v":0},null,{"$f":"'Project Summary Sheet'!$R$18","v":0}]
[null,null,"Baseline Utility Cost Check",{"$f":"IF(ROUND('Project Summary Sheet'!$D$17*'Project Summary Sheet'!$E$18,0)=ROUND('Project Summary Sheet'!$D$19,0),\"OK\",\"Check Use, Rate & Cost\")","v":"OK"},null,{"$f":"IF(ROUND('Project Summary Sheet'!$F$17*'Project Summary Sheet'!$F$18,0)=ROUND('Project Summary Sheet'!$F$19,0),\"OK\",\"Check Use, Rate & Cost\")","v":"OK"},null,{"$f":"IF(ROUND('Project Summary Sheet'!$H$17*'Project Summary Sheet'!$H$18,0)=ROUND('Project Summary Sheet'!$H$19,0),\"OK\",\"Check Use, Rate & Cost\")","v":"OK"},null,{"$f":"IF(ROUND('Project Summary Sheet'!$J$17*'Project Summary Sheet'!$J$18,0)=ROUND('Project Summary Sheet'!$J$19,0),\"OK\",\"Check Use, Rate & Cost\")","v":"OK"},null,{"$f":"IF(ROUND('Project Summary Sheet'!$L$17*'Project Summary Sheet'!$L$18,0)=ROUND('Project Summary Sheet'!$L$19,0),\"OK\",\"Check Use, Rate & Cost\")","v":"OK"},null,{"$f":"IF(ROUND('Project Summary Sheet'!$N$17*'Project Summary Sheet'!$N$18,0)=ROUND('Project Summary Sheet'!$N$19,0),\"OK\",\"Check Use, Rate & Cost\")","v":"OK"},null,{"$f":"IF(ROUND('Project Summary Sheet'!$P$17*'Project Summary Sheet'!$P$18,0)=ROUND('Project Summary Sheet'!$P$19,0),\"OK\",\"Check Use, Rate & Cost\")","v":"OK"},null,{"$f":"IF(ROUND('Project Summary Sheet'!$R$17*'Project Summary Sheet'!$R$18,0)=ROUND('Project Summary Sheet'!$R$19,0),\"OK\",\"Check Use, Rate & Cost\")","v":"OK"}]
[]
[]
[]
[]
[null,null,null,"ENERGY SAVINGS",null,null,"COST SAVINGS"]
[null,"Measure/\nPackage ID","Measure","Electric (kWh) \nsavings over \nElectric (kWh) baseline","Fuel (MMBtu) \nsavings over \nFuel (MMBtu) baseline","Total Project Energy savings\n(all energy sources)","Utility Rate Check","kWh","kW","MMBtu (Total)","MMBtu (Breakout 1)","MMBtu (Breakout 2)","MMBtu (Breakout 3)","Total Calculated Cost Savings","PSS Reported Cost Savings","% Difference - Calculated vs. Reported"]
[null,"Itemized Measures"]
{"$rows_left_out":51}