{"text_format":"1","workbook":"xlsx","n_sheets":33,"sheets":["INSTRUCTIONS","PROJECT DATA","Site 1 PSS","Site 2 PSS","Site 3 PSS","Site 4 PSS","Site 5 PSS","Site 6 PSS","Site 7 PSS","Site 8 PSS","Site 9 PSS","Site 10 PSS","Site 11 PSS","Site 12 PSS","Site 13 PSS","Site 14 PSS","Site 15 PSS","Site 16 PSS","Site 17 PSS","Site 18 PSS","Site 19 PSS","Site 20 PSS","1st Quarter PSS","1st Quarter Payment","2nd Quarter PSS","2nd Quarter Payment","3rd Quarter PSS","3rd Quarter Payment","4th Quarter PSS","4th Quarter Payment","Total Aggregated Savings","15% Withheld Payment","References"],"not_rendered":{"charts":0,"images":0,"macros":1,"external_links":0,"defined_names":32,"comments":0,"pivot_tables":0},"unopened":[],"bounds":{"document_bytes":16777216,"sheet_cells":100000,"rows_first":2000,"rows_last":500,"rows_between":2000,"halvings":0,"cell_chars":16384,"cell_head_chars":4096},"cells_cut":0,"cells_raw":0,"read":"whole","date_system":"1900"}

{"sheet":"INSTRUCTIONS","index":0,"n_rows":35,"n_cols":2,"rows_kept":35,"cut":false,"hidden":false,"merged":[[0,0,0,1]]}
["Project Summary Sheet Template Instructions"]
[]
["Project Data Tab"]
[null,"» This tab collects basic project data and populates this information in the subsequent tabs"]
[null,"» This tab also collects baseline energy use to enable the \"Percent of Savings to Total Energy Consumption (%)\" fields to auto calculate in the site specific PSS tabs and the Total Aggregated Savings tab"]
[null,"» Insert the information required in the Project Information box"]
{"$rows_left_out":30}
{"sheet":"PROJECT DATA","index":1,"n_rows":39,"n_cols":20,"rows_kept":39,"cut":false,"hidden":false,"merged":[[19,2,19,4],[7,2,7,4],[9,2,9,4],[10,2,10,4],[3,7,3,16],[9,5,9,6],[10,5,10,6],[11,5,11,6],[12,5,12,6],[13,5,13,6],[14,5,14,6],[15,5,15,6],[16,2,16,4],[19,5,19,6],[0,0,0,16],[5,7,5,16],[17,2,17,4],[18,2,18,4],[11,2,11,4],[12,2,12,4],[13,2,13,4],[14,2,14,4],[15,2,15,4],[16,5,16,6],[17,5,17,6],[18,5,18,6],[27,0,27,6],[8,2,8,4],[1,1,1,2],[2,1,2,2],[3,1,3,2],[25,2,25,4],[26,2,26,4],[21,2,21,4],[22,2,22,4],[23,2,23,4],[24,2,24,4],[6,2,6,4],[7,5,7,6],[6,5,6,6],[8,5,8,6],[20,2,20,4],[20,5,20,6],[26,5,26,6],[21,5,21,6],[22,5,22,6],[23,5,23,6],[24,5,24,6],[25,5,25,6]]}
["PROJECT INFORMATION"]
["AGG #:",null,null,null,"NYSERDA PO #:"]
["Consultant: ",null,null,null,"FT Consultant #: "]
["Portfolio #:",null,null,null,null,null,null,"BASELINE ENERGY CONVERSION TABLE"]
[]
[null,null,null,null,null,null,null,"Baseline Consumption"]
{"$rows_left_out":34}
{"sheet":"Site 1 PSS","index":2,"n_rows":34,"n_cols":10,"rows_kept":34,"cut":false,"hidden":false,"merged":[[2,1,2,4],[2,7,2,9],[29,0,29,9],[32,0,32,9],[6,6,7,6],[6,9,7,9],[26,0,26,2],[27,0,27,2],[6,0,7,0],[6,1,7,1],[6,2,7,2],[6,3,6,4],[6,5,7,5],[6,7,7,7],[6,8,7,8]]}
[]
[]
["Participant Site: ",{"$f":"IF(OR('PROJECT DATA'!F8=\"\",'PROJECT DATA'!C8=\"\"),\"\",CONCATENATE('PROJECT DATA'!C8,\" - \",'PROJECT DATA'!F8))","v":""},null,null,null,null,"AGG Project: ",{"$f":"IF('PROJECT DATA'!$B$2=\"\",\"\",CONCATENATE(\"AGG \",'PROJECT DATA'!$B$2,\" - \",'PROJECT DATA'!$B$3,\" - Portfolio #\",'PROJECT DATA'!$B$4))","v":""}]
[]
[]
["ENERGY SAVINGS SUMMARY"]
{"$rows_left_out":29}
{"sheet":"Site 2 PSS","index":3,"n_rows":34,"n_cols":10,"rows_kept":34,"cut":false,"hidden":false,"merged":[[6,6,7,6],[2,1,2,4],[2,7,2,9],[32,0,32,9],[6,7,7,7],[6,8,7,8],[6,9,7,9],[26,0,26,2],[27,0,27,2],[29,0,29,9],[6,0,7,0],[6,1,7,1],[6,2,7,2],[6,3,6,4],[6,5,7,5]]}
[]
[]
["Participant Site: ",{"$f":"IF(OR('PROJECT DATA'!F9=\"\",'PROJECT DATA'!C9=\"\"),\"\",CONCATENATE('PROJECT DATA'!C9,\" - \",'PROJECT DATA'!F9))","v":""},null,null,null,null,"AGG Project: ",{"$f":"IF('PROJECT DATA'!$B$2=\"\",\"\",CONCATENATE(\"AGG \",'PROJECT DATA'!$B$2,\" - \",'PROJECT DATA'!$B$3,\" - Portfolio #\",'PROJECT DATA'!$B$4))","v":""}]
[]
[]
["ENERGY SAVINGS SUMMARY"]
{"$rows_left_out":29}
{"sheet":"Site 3 PSS","index":4,"n_rows":33,"n_cols":10,"rows_kept":33,"cut":false,"hidden":true,"merged":[[2,1,2,4],[2,7,2,9],[6,0,7,0],[6,1,7,1],[6,2,7,2],[6,3,6,4],[6,5,7,5],[6,6,7,6],[31,0,31,9],[6,7,7,7],[6,8,7,8],[6,9,7,9],[26,0,26,2],[27,0,27,2],[29,0,29,9]]}
[]
[]
["Participant Site: ",{"$f":"IF(OR('PROJECT DATA'!F10=\"\",'PROJECT DATA'!C10=\"\"),\"\",CONCATENATE('PROJECT DATA'!C10,\" - \",'PROJECT DATA'!F10))","v":""},null,null,null,null,"AGG Project: ",{"$f":"IF('PROJECT DATA'!$B$2=\"\",\"\",CONCATENATE(\"AGG \",'PROJECT DATA'!$B$2,\" - \",'PROJECT DATA'!$B$3,\" - Portfolio #\",'PROJECT DATA'!$B$4))","v":""}]
[]
[]
["ENERGY SAVINGS SUMMARY"]
{"$rows_left_out":28}
{"sheet":"Site 4 PSS","index":5,"n_rows":33,"n_cols":10,"rows_kept":33,"cut":false,"hidden":true,"merged":[[2,1,2,4],[2,7,2,9],[6,0,7,0],[6,1,7,1],[6,2,7,2],[6,3,6,4],[6,5,7,5],[6,6,7,6],[31,0,31,9],[6,7,7,7],[6,8,7,8],[6,9,7,9],[26,0,26,2],[27,0,27,2],[29,0,29,9]]}
[]
[]
["Participant Site: ",{"$f":"IF(OR('PROJECT DATA'!F11=\"\",'PROJECT DATA'!C11=\"\"),\"\",CONCATENATE('PROJECT DATA'!C11,\" - \",'PROJECT DATA'!F11))","v":""},null,null,null,null,"AGG Project: ",{"$f":"IF('PROJECT DATA'!$B$2=\"\",\"\",CONCATENATE(\"AGG \",'PROJECT DATA'!$B$2,\" - \",'PROJECT DATA'!$B$3,\" - Portfolio #\",'PROJECT DATA'!$B$4))","v":""}]
[]
[]
["ENERGY SAVINGS SUMMARY"]
{"$rows_left_out":28}
{"sheet":"Site 5 PSS","index":6,"n_rows":33,"n_cols":10,"rows_kept":33,"cut":false,"hidden":true,"merged":[[2,1,2,4],[2,7,2,9],[6,0,7,0],[6,1,7,1],[6,2,7,2],[6,3,6,4],[6,5,7,5],[6,6,7,6],[31,0,31,9],[6,7,7,7],[6,8,7,8],[6,9,7,9],[26,0,26,2],[27,0,27,2],[29,0,29,9]]}
[]
[]
["Participant Site: ",{"$f":"IF(OR('PROJECT DATA'!F12=\"\",'PROJECT DATA'!C12=\"\"),\"\",CONCATENATE('PROJECT DATA'!C12,\" - \",'PROJECT DATA'!F12))","v":""},null,null,null,null,"AGG Project: ",{"$f":"IF('PROJECT DATA'!$B$2=\"\",\"\",CONCATENATE(\"AGG \",'PROJECT DATA'!$B$2,\" - \",'PROJECT DATA'!$B$3,\" - Portfolio #\",'PROJECT DATA'!$B$4))","v":""}]
[]
[]
["ENERGY SAVINGS SUMMARY"]
{"$rows_left_out":28}
{"sheet":"Site 6 PSS","index":7,"n_rows":33,"n_cols":10,"rows_kept":33,"cut":false,"hidden":true,"merged":[[2,1,2,4],[2,7,2,9],[6,0,7,0],[6,1,7,1],[6,2,7,2],[6,3,6,4],[6,5,7,5],[6,6,7,6],[31,0,31,9],[6,7,7,7],[6,8,7,8],[6,9,7,9],[26,0,26,2],[27,0,27,2],[29,0,29,9]]}
[]
[]
["Participant Site: ",{"$f":"IF(OR('PROJECT DATA'!F13=\"\",'PROJECT DATA'!C13=\"\"),\"\",CONCATENATE('PROJECT DATA'!C13,\" - \",'PROJECT DATA'!F13))","v":""},null,null,null,null,"AGG Project: ",{"$f":"IF('PROJECT DATA'!$B$2=\"\",\"\",CONCATENATE(\"AGG \",'PROJECT DATA'!$B$2,\" - \",'PROJECT DATA'!$B$3,\" - Portfolio #\",'PROJECT DATA'!$B$4))","v":""}]
[]
[]
["ENERGY SAVINGS SUMMARY"]
{"$rows_left_out":28}
{"sheet":"Site 7 PSS","index":8,"n_rows":33,"n_cols":10,"rows_kept":33,"cut":false,"hidden":true,"merged":[[2,1,2,4],[2,7,2,9],[6,0,7,0],[6,1,7,1],[6,2,7,2],[6,3,6,4],[6,5,7,5],[6,6,7,6],[31,0,31,9],[6,7,7,7],[6,8,7,8],[6,9,7,9],[26,0,26,2],[27,0,27,2],[29,0,29,9]]}
[]
[]
["Participant Site: ",{"$f":"IF(OR('PROJECT DATA'!F14=\"\",'PROJECT DATA'!C14=\"\"),\"\",CONCATENATE('PROJECT DATA'!C14,\" - \",'PROJECT DATA'!F14))","v":""},null,null,null,null,"AGG Project: ",{"$f":"IF('PROJECT DATA'!$B$2=\"\",\"\",CONCATENATE(\"AGG \",'PROJECT DATA'!$B$2,\" - \",'PROJECT DATA'!$B$3,\" - Portfolio #\",'PROJECT DATA'!$B$4))","v":""}]
[]
[]
["ENERGY SAVINGS SUMMARY"]
{"$rows_left_out":28}
{"sheet":"Site 8 PSS","index":9,"n_rows":33,"n_cols":10,"rows_kept":33,"cut":false,"hidden":true,"merged":[[2,1,2,4],[2,7,2,9],[6,0,7,0],[6,1,7,1],[6,2,7,2],[6,3,6,4],[6,5,7,5],[6,6,7,6],[31,0,31,9],[6,7,7,7],[6,8,7,8],[6,9,7,9],[26,0,26,2],[27,0,27,2],[29,0,29,9]]}
[]
[]
["Participant Site: ",{"$f":"IF(OR('PROJECT DATA'!F15=\"\",'PROJECT DATA'!C15=\"\"),\"\",CONCATENATE('PROJECT DATA'!C15,\" - \",'PROJECT DATA'!F15))","v":""},null,null,null,null,"AGG Project: ",{"$f":"IF('PROJECT DATA'!$B$2=\"\",\"\",CONCATENATE(\"AGG \",'PROJECT DATA'!$B$2,\" - \",'PROJECT DATA'!$B$3,\" - Portfolio #\",'PROJECT DATA'!$B$4))","v":""}]
[]
[]
["ENERGY SAVINGS SUMMARY"]
{"$rows_left_out":28}
{"sheet":"Site 9 PSS","index":10,"n_rows":33,"n_cols":10,"rows_kept":33,"cut":false,"hidden":true,"merged":[[2,1,2,4],[2,7,2,9],[6,0,7,0],[6,1,7,1],[6,2,7,2],[6,3,6,4],[6,5,7,5],[6,6,7,6],[31,0,31,9],[6,7,7,7],[6,8,7,8],[6,9,7,9],[26,0,26,2],[27,0,27,2],[29,0,29,9]]}
[]
[]
["Participant Site: ",{"$f":"IF(OR('PROJECT DATA'!F16=\"\",'PROJECT DATA'!C16=\"\"),\"\",CONCATENATE('PROJECT DATA'!C16,\" - \",'PROJECT DATA'!F16))","v":""},null,null,null,null,"AGG Project: ",{"$f":"IF('PROJECT DATA'!$B$2=\"\",\"\",CONCATENATE(\"AGG \",'PROJECT DATA'!$B$2,\" - \",'PROJECT DATA'!$B$3,\" - Portfolio #\",'PROJECT DATA'!$B$4))","v":""}]
[]
[]
["ENERGY SAVINGS SUMMARY"]
{"$rows_left_out":28}
{"sheet":"Site 10 PSS","index":11,"n_rows":33,"n_cols":10,"rows_kept":33,"cut":false,"hidden":true,"merged":[[2,1,2,4],[2,7,2,9],[6,0,7,0],[6,1,7,1],[6,2,7,2],[6,3,6,4],[6,5,7,5],[6,6,7,6],[31,0,31,9],[6,7,7,7],[6,8,7,8],[6,9,7,9],[26,0,26,2],[27,0,27,2],[29,0,29,9]]}
[]
[]
["Participant Site: ",{"$f":"IF(OR('PROJECT DATA'!F17=\"\",'PROJECT DATA'!C17=\"\"),\"\",CONCATENATE('PROJECT DATA'!C17,\" - \",'PROJECT DATA'!F17))","v":""},null,null,null,null,"AGG Project: ",{"$f":"IF('PROJECT DATA'!$B$2=\"\",\"\",CONCATENATE(\"AGG \",'PROJECT DATA'!$B$2,\" - \",'PROJECT DATA'!$B$3,\" - Portfolio #\",'PROJECT DATA'!$B$4))","v":""}]
[]
[]
["ENERGY SAVINGS SUMMARY"]
{"$rows_left_out":28}
{"sheet":"Site 11 PSS","index":12,"n_rows":33,"n_cols":10,"rows_kept":33,"cut":false,"hidden":true,"merged":[[2,1,2,4],[2,7,2,9],[6,0,7,0],[6,1,7,1],[6,2,7,2],[6,3,6,4],[6,5,7,5],[6,6,7,6],[31,0,31,9],[6,7,7,7],[6,8,7,8],[6,9,7,9],[26,0,26,2],[27,0,27,2],[29,0,29,9]]}
[]
[]
["Participant Site: ",{"$f":"IF(OR('PROJECT DATA'!F18=\"\",'PROJECT DATA'!C18=\"\"),\"\",CONCATENATE('PROJECT DATA'!C18,\" - \",'PROJECT DATA'!F18))","v":""},null,null,null,null,"AGG Project: ",{"$f":"IF('PROJECT DATA'!$B$2=\"\",\"\",CONCATENATE(\"AGG \",'PROJECT DATA'!$B$2,\" - \",'PROJECT DATA'!$B$3,\" - Portfolio #\",'PROJECT DATA'!$B$4))","v":""}]
[]
[]
["ENERGY SAVINGS SUMMARY"]
{"$rows_left_out":28}
{"sheet":"Site 12 PSS","index":13,"n_rows":33,"n_cols":10,"rows_kept":33,"cut":false,"hidden":true,"merged":[[2,1,2,4],[2,7,2,9],[6,0,7,0],[6,1,7,1],[6,2,7,2],[6,3,6,4],[6,5,7,5],[6,6,7,6],[31,0,31,9],[6,7,7,7],[6,8,7,8],[6,9,7,9],[26,0,26,2],[27,0,27,2],[29,0,29,9]]}
[]
[]
["Participant Site: ",{"$f":"IF(OR('PROJECT DATA'!F19=\"\",'PROJECT DATA'!C19=\"\"),\"\",CONCATENATE('PROJECT DATA'!C19,\" - \",'PROJECT DATA'!F19))","v":""},null,null,null,null,"AGG Project: ",{"$f":"IF('PROJECT DATA'!$B$2=\"\",\"\",CONCATENATE(\"AGG \",'PROJECT DATA'!$B$2,\" - \",'PROJECT DATA'!$B$3,\" - Portfolio #\",'PROJECT DATA'!$B$4))","v":""}]
[]
[]
["ENERGY SAVINGS SUMMARY"]
{"$rows_left_out":28}
{"sheet":"Site 13 PSS","index":14,"n_rows":33,"n_cols":10,"rows_kept":33,"cut":false,"hidden":true,"merged":[[2,1,2,4],[2,7,2,9],[6,0,7,0],[6,1,7,1],[6,2,7,2],[6,3,6,4],[6,5,7,5],[6,6,7,6],[31,0,31,9],[6,7,7,7],[6,8,7,8],[6,9,7,9],[26,0,26,2],[27,0,27,2],[29,0,29,9]]}
[]
[]
["Participant Site: ",{"$f":"IF(OR('PROJECT DATA'!F20=\"\",'PROJECT DATA'!C20=\"\"),\"\",CONCATENATE('PROJECT DATA'!C20,\" - \",'PROJECT DATA'!F20))","v":""},null,null,null,null,"AGG Project: ",{"$f":"IF('PROJECT DATA'!$B$2=\"\",\"\",CONCATENATE(\"AGG \",'PROJECT DATA'!$B$2,\" - \",'PROJECT DATA'!$B$3,\" - Portfolio #\",'PROJECT DATA'!$B$4))","v":""}]
[]
[]
["ENERGY SAVINGS SUMMARY"]
{"$rows_left_out":28}
{"sheet":"Site 14 PSS","index":15,"n_rows":33,"n_cols":10,"rows_kept":33,"cut":false,"hidden":true,"merged":[[2,1,2,4],[2,7,2,9],[6,0,7,0],[6,1,7,1],[6,2,7,2],[6,3,6,4],[6,5,7,5],[6,6,7,6],[31,0,31,9],[6,7,7,7],[6,8,7,8],[6,9,7,9],[26,0,26,2],[27,0,27,2],[29,0,29,9]]}
[]
[]
["Participant Site: ",{"$f":"IF(OR('PROJECT DATA'!F21=\"\",'PROJECT DATA'!C21=\"\"),\"\",CONCATENATE('PROJECT DATA'!C21,\" - \",'PROJECT DATA'!F21))","v":""},null,null,null,null,"AGG Project: ",{"$f":"IF('PROJECT DATA'!$B$2=\"\",\"\",CONCATENATE(\"AGG \",'PROJECT DATA'!$B$2,\" - \",'PROJECT DATA'!$B$3,\" - Portfolio #\",'PROJECT DATA'!$B$4))","v":""}]
[]
[]
["ENERGY SAVINGS SUMMARY"]
{"$rows_left_out":28}
{"sheet":"Site 15 PSS","index":16,"n_rows":33,"n_cols":10,"rows_kept":33,"cut":false,"hidden":true,"merged":[[2,1,2,4],[2,7,2,9],[6,0,7,0],[6,1,7,1],[6,2,7,2],[6,3,6,4],[6,5,7,5],[6,6,7,6],[31,0,31,9],[6,7,7,7],[6,8,7,8],[6,9,7,9],[26,0,26,2],[27,0,27,2],[29,0,29,9]]}
[]
[]
["Participant Site: ",{"$f":"IF(OR('PROJECT DATA'!F22=\"\",'PROJECT DATA'!C22=\"\"),\"\",CONCATENATE('PROJECT DATA'!C22,\" - \",'PROJECT DATA'!F22))","v":""},null,null,null,null,"AGG Project: ",{"$f":"IF('PROJECT DATA'!$B$2=\"\",\"\",CONCATENATE(\"AGG \",'PROJECT DATA'!$B$2,\" - \",'PROJECT DATA'!$B$3,\" - Portfolio #\",'PROJECT DATA'!$B$4))","v":""}]
[]
[]
["ENERGY SAVINGS SUMMARY"]
{"$rows_left_out":28}
{"sheet":"Site 16 PSS","index":17,"n_rows":33,"n_cols":10,"rows_kept":33,"cut":false,"hidden":true,"merged":[[2,1,2,4],[2,7,2,9],[6,0,7,0],[6,1,7,1],[6,2,7,2],[6,3,6,4],[6,5,7,5],[6,6,7,6],[31,0,31,9],[6,7,7,7],[6,8,7,8],[6,9,7,9],[26,0,26,2],[27,0,27,2],[29,0,29,9]]}
[]
[]
["Participant Site: ",{"$f":"IF(OR('PROJECT DATA'!F23=\"\",'PROJECT DATA'!C23=\"\"),\"\",CONCATENATE('PROJECT DATA'!C23,\" - \",'PROJECT DATA'!F23))","v":""},null,null,null,null,"AGG Project: ",{"$f":"IF('PROJECT DATA'!$B$2=\"\",\"\",CONCATENATE(\"AGG \",'PROJECT DATA'!$B$2,\" - \",'PROJECT DATA'!$B$3,\" - Portfolio #\",'PROJECT DATA'!$B$4))","v":""}]
[]
[]
["ENERGY SAVINGS SUMMARY"]
{"$rows_left_out":28}
{"sheet":"Site 17 PSS","index":18,"n_rows":33,"n_cols":10,"rows_kept":33,"cut":false,"hidden":true,"merged":[[2,1,2,4],[2,7,2,9],[6,0,7,0],[6,1,7,1],[6,2,7,2],[6,3,6,4],[6,5,7,5],[6,6,7,6],[31,0,31,9],[6,7,7,7],[6,8,7,8],[6,9,7,9],[26,0,26,2],[27,0,27,2],[29,0,29,9]]}
[]
[]
["Participant Site: ",{"$f":"IF(OR('PROJECT DATA'!F24=\"\",'PROJECT DATA'!C24=\"\"),\"\",CONCATENATE('PROJECT DATA'!C24,\" - \",'PROJECT DATA'!F24))","v":""},null,null,null,null,"AGG Project: ",{"$f":"IF('PROJECT DATA'!$B$2=\"\",\"\",CONCATENATE(\"AGG \",'PROJECT DATA'!$B$2,\" - \",'PROJECT DATA'!$B$3,\" - Portfolio #\",'PROJECT DATA'!$B$4))","v":""}]
[]
[]
["ENERGY SAVINGS SUMMARY"]
{"$rows_left_out":28}
{"sheet":"Site 18 PSS","index":19,"n_rows":33,"n_cols":10,"rows_kept":33,"cut":false,"hidden":true,"merged":[[2,1,2,4],[2,7,2,9],[6,0,7,0],[6,1,7,1],[6,2,7,2],[6,3,6,4],[6,5,7,5],[6,6,7,6],[31,0,31,9],[6,7,7,7],[6,8,7,8],[6,9,7,9],[26,0,26,2],[27,0,27,2],[29,0,29,9]]}
[]
[]
["Participant Site: ",{"$f":"IF(OR('PROJECT DATA'!F25=\"\",'PROJECT DATA'!C25=\"\"),\"\",CONCATENATE('PROJECT DATA'!C25,\" - \",'PROJECT DATA'!F25))","v":""},null,null,null,null,"AGG Project: ",{"$f":"IF('PROJECT DATA'!$B$2=\"\",\"\",CONCATENATE(\"AGG \",'PROJECT DATA'!$B$2,\" - \",'PROJECT DATA'!$B$3,\" - Portfolio #\",'PROJECT DATA'!$B$4))","v":""}]
[]
[]
["ENERGY SAVINGS SUMMARY"]
{"$rows_left_out":28}
{"sheet":"Site 19 PSS","index":20,"n_rows":33,"n_cols":10,"rows_kept":33,"cut":false,"hidden":true,"merged":[[2,1,2,4],[2,7,2,9],[6,0,7,0],[6,1,7,1],[6,2,7,2],[6,3,6,4],[6,5,7,5],[6,6,7,6],[31,0,31,9],[6,7,7,7],[6,8,7,8],[6,9,7,9],[26,0,26,2],[27,0,27,2],[29,0,29,9]]}
[]
[]
["Participant Site: ",{"$f":"IF(OR('PROJECT DATA'!F26=\"\",'PROJECT DATA'!C26=\"\"),\"\",CONCATENATE('PROJECT DATA'!C26,\" - \",'PROJECT DATA'!F26))","v":""},null,null,null,null,"AGG Project: ",{"$f":"IF('PROJECT DATA'!$B$2=\"\",\"\",CONCATENATE(\"AGG \",'PROJECT DATA'!$B$2,\" - \",'PROJECT DATA'!$B$3,\" - Portfolio #\",'PROJECT DATA'!$B$4))","v":""}]
[]
[]
["ENERGY SAVINGS SUMMARY"]
{"$rows_left_out":28}
{"sheet":"Site 20 PSS","index":21,"n_rows":33,"n_cols":10,"rows_kept":33,"cut":false,"hidden":true,"merged":[[2,1,2,4],[2,7,2,9],[6,0,7,0],[6,1,7,1],[6,2,7,2],[6,3,6,4],[6,5,7,5],[6,6,7,6],[31,0,31,9],[6,7,7,7],[6,8,7,8],[6,9,7,9],[26,0,26,2],[27,0,27,2],[29,0,29,9]]}
[]
[]
["Participant Site: ",{"$f":"IF(OR('PROJECT DATA'!F27=\"\",'PROJECT DATA'!C27=\"\"),\"\",CONCATENATE('PROJECT DATA'!C27,\" - \",'PROJECT DATA'!F27))","v":""},null,null,null,null,"AGG Project: ",{"$f":"IF('PROJECT DATA'!$B$2=\"\",\"\",CONCATENATE(\"AGG \",'PROJECT DATA'!$B$2,\" - \",'PROJECT DATA'!$B$3,\" - Portfolio #\",'PROJECT DATA'!$B$4))","v":""}]
[]
[]
["ENERGY SAVINGS SUMMARY"]
{"$rows_left_out":28}
{"sheet":"1st Quarter PSS","index":22,"n_rows":32,"n_cols":11,"rows_kept":32,"cut":false,"hidden":false,"merged":[[0,0,0,10],[28,0,28,10],[4,4,4,5],[4,3,5,3],[4,2,5,2],[4,1,5,1],[4,6,5,6],[4,8,5,8],[4,9,5,9],[31,0,31,9],[30,0,30,9],[25,0,25,3],[26,0,26,3],[4,10,5,10],[4,0,5,0],[4,7,5,7]]}
["First Quarterly Report"]
[]
["ENERGY SAVINGS SUMMARY for: ",null,{"$f":"IF('PROJECT DATA'!$B$2=\"\",\"\",CONCATENATE(\"AGG \",'PROJECT DATA'!$B$2,\" - \",'PROJECT DATA'!$B$3,\" - Portfolio #\",'PROJECT DATA'!$B$4))","v":""}]
[]
["Participant Site","Measure Description","Measure Status\n(see notes)","Fuel Type Saved\n(see notes)","Electric",null,"Fuel Savings\n(MMBtu)","Percent of Savings to Total Energy Consumption\n(%)","Annual Cost Savings","Implemen-tation Cost","Simple Payback\n(Years)"]
[null,null,null,null,"Supply Savings\n(kWh)","Demand Savings\n(kW)"]
{"$rows_left_out":27}
{"sheet":"1st Quarter Payment","index":23,"n_rows":37,"n_cols":5,"rows_kept":37,"cut":false,"hidden":false,"merged":[[33,1,33,6],[37,3,37,4],[36,3,36,4],[35,3,35,4],[2,0,2,7],[3,0,3,7],[14,2,14,4],[8,2,8,4],[10,2,10,4],[12,2,12,6],[6,2,6,3]]}
[]
[]
["1st Quarter Performance Incentive"]
["Payment Request"]
[]
[]
{"$rows_left_out":32}
{"sheet":"2nd Quarter PSS","index":24,"n_rows":32,"n_cols":11,"rows_kept":32,"cut":false,"hidden":false,"merged":[[0,0,0,10],[28,0,28,10],[4,0,5,0],[4,1,5,1],[4,2,5,2],[4,3,5,3],[4,4,4,5],[4,6,5,6],[4,8,5,8],[4,9,5,9],[31,0,31,9],[25,0,25,3],[26,0,26,3],[30,0,30,9],[4,10,5,10],[4,7,5,7]]}
["Second Quarterly Report"]
[]
["ENERGY SAVINGS SUMMARY for: ",null,{"$f":"IF('PROJECT DATA'!$B$2=\"\",\"\",CONCATENATE(\"AGG \",'PROJECT DATA'!$B$2,\" - \",'PROJECT DATA'!$B$3,\" - Portfolio #\",'PROJECT DATA'!$B$4))","v":""}]
[]
["Participant Site","Measure Description","Measure Status\n(see notes)","Fuel Type Saved\n(see notes)","Electric",null,"Fuel Savings\n(MMBtu)","Percent of Savings to Total Energy Consumption\n(%)","Annual Cost Savings","Implemen-tation Cost","Simple Payback\n(Years)"]
[null,null,null,null,"Supply Savings\n(kWh)","Demand Savings\n(kW)"]
{"$rows_left_out":27}
{"sheet":"2nd Quarter Payment","index":25,"n_rows":39,"n_cols":5,"rows_kept":39,"cut":false,"hidden":false,"merged":[[35,1,35,6],[37,3,37,4],[38,3,38,4],[14,2,14,4],[2,0,2,7],[3,0,3,7],[6,2,6,3],[8,2,8,4],[10,2,10,4],[12,2,12,6]]}
[]
[]
["2nd Quarter Performance Incentive"]
["Payment Request"]
[]
[]
{"$rows_left_out":34}
{"sheet":"3rd Quarter PSS","index":26,"n_rows":32,"n_cols":11,"rows_kept":32,"cut":false,"hidden":false,"merged":[[0,0,0,10],[4,0,5,0],[4,1,5,1],[4,2,5,2],[4,3,5,3],[4,4,4,5],[4,6,5,6],[4,8,5,8],[4,9,5,9],[4,10,5,10],[4,7,5,7],[31,0,31,10],[25,0,25,3],[26,0,26,3],[28,0,28,10],[30,0,30,10]]}
["Third Quarterly Report"]
[]
["ENERGY SAVINGS SUMMARY for: ",null,{"$f":"IF('PROJECT DATA'!$B$2=\"\",\"\",CONCATENATE(\"AGG \",'PROJECT DATA'!$B$2,\" - \",'PROJECT DATA'!$B$3,\" - Portfolio #\",'PROJECT DATA'!$B$4))","v":""}]
[]
["Participant Site","Measure Description","Measure Status\n(see notes)","Fuel Type Saved\n(see notes)","Electric",null,"Fuel Savings\n(MMBtu)","Percent of Savings to Total Energy Consumption\n(%)","Annual Cost Savings","Implemen-tation Cost","Simple Payback\n(Years)"]
[null,null,null,null,"Supply Savings\n(kWh)","Demand Savings\n(kW)"]
{"$rows_left_out":27}
{"sheet":"3rd Quarter Payment","index":27,"n_rows":38,"n_cols":5,"rows_kept":38,"cut":false,"hidden":false,"merged":[[34,1,34,6],[36,3,36,4],[37,3,37,4],[14,2,14,4],[2,0,2,7],[3,0,3,7],[6,2,6,3],[8,2,8,4],[10,2,10,4],[12,2,12,6]]}
[]
[]
["3rd Quarter Performance Incentive"]
["Payment Request"]
[]
[]
{"$rows_left_out":33}
{"sheet":"4th Quarter PSS","index":28,"n_rows":32,"n_cols":11,"rows_kept":32,"cut":false,"hidden":false,"merged":[[0,0,0,10],[28,0,28,10],[4,0,5,0],[4,1,5,1],[4,2,5,2],[4,3,5,3],[4,4,4,5],[4,6,5,6],[4,7,5,7],[4,8,5,8],[4,9,5,9],[31,0,31,9],[25,0,25,3],[26,0,26,3],[30,0,30,9],[4,10,5,10]]}
["Fourth Quarterly Report"]
[]
["ENERGY SAVINGS SUMMARY for: ",null,{"$f":"IF('PROJECT DATA'!$B$2=\"\",\"\",CONCATENATE(\"AGG \",'PROJECT DATA'!$B$2,\" - \",'PROJECT DATA'!$B$3,\" - Portfolio #\",'PROJECT DATA'!$B$4))","v":""}]
[]
["Participant Site","Measure Description","Measure Status\n(see notes)","Fuel Type Saved\n(see notes)","Electric",null,"Fuel Savings\n(MMBtu)","Percent of Savings to Total Energy Consumption\n(%)","Annual Cost Savings","Implemen-tation Cost","Simple Payback\n(Years)"]
[null,null,null,null,"Supply Savings\n(kWh)","Demand Savings\n(kW)"]
{"$rows_left_out":27}
{"sheet":"4th Quarter Payment","index":29,"n_rows":39,"n_cols":5,"rows_kept":39,"cut":false,"hidden":false,"merged":[[35,1,35,6],[37,3,37,4],[38,3,38,4],[14,2,14,4],[2,0,2,7],[3,0,3,7],[6,2,6,3],[8,2,8,4],[10,2,10,4],[12,2,12,6]]}
[]
[]
["4th Quarter Performance Incentive"]
["Payment Request"]
[]
[]
{"$rows_left_out":34}
{"sheet":"Total Aggregated Savings","index":30,"n_rows":18,"n_cols":11,"rows_kept":18,"cut":false,"hidden":false,"merged":[[13,0,13,10],[11,0,11,1],[7,3,8,3],[7,4,7,5],[7,6,8,6],[7,8,8,8],[7,0,8,1],[7,2,8,2],[0,0,0,10],[7,7,8,7],[9,0,9,1],[10,0,10,1],[7,9,8,9],[7,10,8,10]]}
["Total Aggregation Portfolio Savings"]
[]
["ENERGY SAVINGS SUMMARY for: ",null,{"$f":"IF('PROJECT DATA'!$B$2=\"\",\"\",CONCATENATE(\"AGG \",'PROJECT DATA'!$B$2,\" - \",'PROJECT DATA'!$B$3,\" - Portfolio #\",'PROJECT DATA'!$B$4))","v":""}]
[]
["# of customers in the aggregation portfolio:"]
["# of participant sites in the aggregation portfolio:"]
{"$rows_left_out":13}
{"sheet":"15% Withheld Payment","index":31,"n_rows":31,"n_cols":4,"rows_kept":31,"cut":false,"hidden":true,"merged":[[27,1,27,6],[29,3,29,4],[30,3,30,4],[14,2,14,4],[2,0,2,7],[3,0,3,7],[6,2,6,3],[8,2,8,4],[10,2,10,4],[12,2,12,6]]}
[]
[]
["Withheld Performance Incentive"]
["Payment Request"]
[]
[]
{"$rows_left_out":26}
{"sheet":"References","index":32,"n_rows":25,"n_cols":2,"rows_kept":25,"cut":false,"hidden":true,"merged":[]}
["Measure Status"]
["I","Implemented"]
["R","Recommended"]
["RS","Further Study Recommended"]
["NR","Not Recommended"]
["RME","Recommeded Mutually Exclusive"]
{"$rows_left_out":19}