{"text_format":"1","workbook":"xlsx","n_sheets":5,"sheets":["Calculator","INTERNAL Funding Distrubution","Support - Drop Downs","Support - Estimated Savings","Support - Funding Distrubution "],"not_rendered":{"charts":0,"images":3,"macros":0,"external_links":0,"defined_names":20,"comments":0,"pivot_tables":0},"unopened":[],"bounds":{"document_bytes":16777216,"sheet_cells":100000,"rows_first":2000,"rows_last":500,"rows_between":2000,"halvings":0,"cell_chars":16384,"cell_head_chars":4096},"cells_cut":0,"cells_raw":0,"read":"whole","date_system":"1900"}

{"sheet":"Calculator","index":0,"n_rows":70,"n_cols":13,"rows_kept":70,"cut":false,"hidden":false,"merged":[[30,2,30,4],[31,2,31,4],[57,8,58,8],[50,2,50,4],[51,2,51,4],[48,2,48,4],[46,2,46,4],[47,2,47,4],[66,1,66,2],[67,1,67,2],[49,2,49,4],[44,2,44,4],[45,2,45,4],[57,1,57,2],[65,1,65,2],[54,2,54,4],[60,1,60,2],[53,2,53,4],[66,10,69,15],[25,1,25,5],[69,1,69,2],[62,1,62,2],[63,1,63,2],[61,1,61,2],[55,2,55,4],[27,2,27,4],[65,9,66,9],[68,1,68,2],[28,2,28,4],[29,2,29,4],[42,2,42,4],[43,2,43,4],[34,2,34,4],[32,2,32,4],[64,2,64,8],[17,1,17,5],[12,6,13,7],[11,1,11,5],[18,6,18,7],[35,2,35,4],[59,1,59,2],[26,2,26,4],[37,2,37,4],[38,2,38,4],[39,2,39,4],[40,2,40,4],[41,2,41,4],[33,2,33,4],[58,1,58,2],[52,2,52,4],[0,1,0,5],[2,1,2,5],[1,1,1,5],[24,1,24,6],[56,2,56,6],[3,1,3,5],[5,1,5,5],[6,1,6,5],[12,1,12,2],[18,1,18,4],[19,1,19,2],[20,1,20,2],[21,1,21,2],[22,1,22,2],[23,1,23,2],[36,2,36,4]]}
[null,"INCENTIVE CALCULATOR"]
[null,"Affordable Multifamily "]
[null,"Program Upstate"]
[null,"This is a tool to estimate potential maximum incentives for projects participating in AMP Up. All costs and fees are subject to NYSERDA review and approval. Approved incentives will be provided in the program’s Incentive Offer Letter. Incentive estimates from this tool are not guaranteed."]
[null,"Instructions"]
[null,"1) Enter Total number of units for the project, across all buildings on site."]
[null,"2) Use the dropdown options to select incentive category and measure classification, and enter total construction cost per measure."]
[null,"  Note: Resilience requires the Measure Classification selection to calculate incentives. "]
[null,"  If required, use the + icon on the far left to add more measure rows."]
[null,"3) If applicable, select the Non End-Use support and enter cost."]
[null,"4) If applicable, enter previously received End-Use incentives."]
[]
[null,"Total Estimated Incentive ",null,null,"Project Name (Optional)",null,{"$f":"IF(F14<5,\"A minimum of 5 dwelling units are required to participate in AMP Up. Please including the total number of units in your project.\",\"\")","v":"A minimum of 5 dwelling units are required to participate in AMP Up. Please including the total number of units in your project."}]
[null,"Non End-Use Incentive",{"$f":"E24","v":0},null,"# of Dwelling Units"]
[null,"End-Use Incentive",{"$f":"I63","v":0}]
[null,"Resilience Incentive",{"$f":"J70","v":""}]
[null,"Total",{"$f":"SUM(C14:C16)","v":0}]
[]
[null,"Estimated Non End-Use Incentives ",null,null,null,null,"Previously Received Incentives (for Phased Scopes)"]
[null,"Select Support Type",null,"Total Support Cost ($)","Totals",null,"Appliance"]
{"$rows_left_out":51}
{"sheet":"INTERNAL Funding Distrubution","index":1,"n_rows":50,"n_cols":14,"rows_kept":50,"cut":false,"hidden":true,"merged":[[4,1,4,5],[5,1,5,5],[12,1,12,5],[3,1,3,5],[42,1,42,8],[34,1,34,7],[18,1,18,2],[19,1,21,1],[22,1,26,1],[27,1,32,1],[35,1,35,7]]}
[null,"Amp Up Incentive Calculator"]
[]
[null,"Instructions"]
[null,"In the Calculator tab,"]
[null,"1) Enter total number of units for the project, across all buildings on site."]
[null,"2) Use the dropdown options to select incentive category and total construction cost per measure. "]
[null,"If the incentive category is Resilience, then also enter the measure classification."]
[null,"If required, use the + icon on the far left to add more measure rows."]
[null,"3) If applicable, select the Non End-Use support and enter cost."]
[null,"4) If applicable, enter previously received End-Use incentives."]
[null,"In the INTERNAL Funding Distribution tab,"]
[null,"5) Select the project stage."]
[null,"6) Update Salesforce and NEIS with the updated project funding and route the contract accordingly. "]
[]
[null,null,{"$f":"Calculator!E13","v":"Project Name (Optional)"},{"$f":"IF(Calculator!F13=\"\",\"\",Calculator!F13)","v":""}]
[null,null,{"$f":"Calculator!E14","v":"# of Dwelling Units"},{"$f":"Calculator!F14","v":0}]
[null,null,"Select Stage ","Initial Application"]
[]
[null,"For Salesforce",null,"Stage 1","Stage 2","Stage 3","Stage 4","Total ","Account","Dept","Fund","NEIS Project ID","Activity","Concate"]
[null,"Non End-Use","Technical Assistance",{"$f":"_xlfn.IFNA(IF($D$16<21,VLOOKUP(C20,Calculator!$B$20:$E$23,3,FALSE)*'Support - Funding Distrubution '!C2,VLOOKUP(C20,Calculator!$B$20:$E$23,3,FALSE)*'Support - Funding Distrubution '!J2),0)","v":0},{"$f":"_xlfn.IFNA(IF($D$16<21,VLOOKUP(C20,Calculator!$B$20:$E$23,3,FALSE)*'Support - Funding Distrubution '!D2,VLOOKUP(C20,Calculator!$B$20:$E$23,3,FALSE)*'Support - Funding Distrubution '!K2),0)","v":0},{"$f":"_xlfn.IFNA(IF($D$16<21,VLOOKUP(C20,Calculator!$B$20:$E$23,3,FALSE)*'Support - Funding Distrubution '!E2,VLOOKUP(C20,Calculator!$B$20:$E$23,3,FALSE)*'Support - Funding Distrubution '!L2),0)","v":0},{"$f":"_xlfn.IFNA(IF($D$16<21,VLOOKUP(C20,Calculator!$B$20:$E$23,3,FALSE)*'Support - Funding Distrubution '!F2,VLOOKUP(C20,Calculator!$B$20:$E$23,3,FALSE)*'Support - Funding Distrubution '!M2),0)","v":0},{"$f":"SUM(D20:G20)","v":0},4210,5500,"EEBEL","EBL029","TECHASSISTUP",{"$f":"_xlfn.CONCAT(I20:M20)","v":"42105500EEBELEBL029TECHASSISTUP"}]
{"$rows_left_out":31}
{"sheet":"Support - Drop Downs","index":2,"n_rows":61,"n_cols":14,"rows_kept":61,"cut":false,"hidden":true,"merged":[]}
[]
[null,"Appliance and Plug-Load",{"$f":"SUBSTITUTE(SUBSTITUTE(SUBSTITUTE(B2,\" \",\"\"),\"-\",\"\"),\"/\",\"\")","v":"ApplianceandPlugLoad"},"Refrigerator (w. Freezer)",null,null,null,{"$f":"_xlfn._xlws.SORT(_xlfn.UNIQUE(B2:B20))","v":"Appliance and Plug-Load"},{"$f":"_xlfn._xlws.SORT(_xlfn.UNIQUE(C2:C20))","v":"ApplianceandPlugLoad"}]
[null,"Domestic Hot Water - Controls","DomesticHotWaterControls","Efficient-flow showerheads",null,null,null,"Domestic Hot Water - Controls","DomesticHotWaterControls"]
[null,"Domestic Hot Water - Controls","DomesticHotWaterControls","Faucet aerators",null,null,null,"Envelope/Shell","EnvelopeShell"]
[null,"Domestic Hot Water - Controls","DomesticHotWaterControls","Thermostatic Shower Restriction Valve",null,null,null,"Heating and Cooling","HeatingandCooling"]
[null,"Envelope/Shell","EnvelopeShell","Room (RAC) Cover and Gap Sealer",null,null,null,"Heating and Cooling - Controls","HeatingandCoolingControls"]
[null,"Envelope/Shell","EnvelopeShell","Heating/Cooling, Steam Pipe Insulation",null,null,null,"Lighting","Lighting"]
[null,"Heating and Cooling","HeatingandCooling","Primary HVAC combustion tune-up (Boiler/Furnace)"]
[null,"Heating and Cooling - Controls","HeatingandCoolingControls","Advanced Thermostat"]
[null,"Heating and Cooling - Controls","HeatingandCoolingControls","Install TRVs or radiator valves",null,null,null,"ApplianceandPlugLoad","DomesticHotWaterControls","EnvelopeShell","HeatingandCooling","HeatingandCoolingControls","Lighting"]
[null,"Heating and Cooling - Controls","HeatingandCoolingControls","Steam Trap - Low Pressure",null,null,null,"Refrigerator (w. Freezer)","Efficient-flow showerheads","Airsealing","Primary HVAC combustion tune-up (Boiler/Furnace)","Advanced Thermostat","Exterior Lighting"]
[null,"Lighting","Lighting","Exterior Lighting",null,null,null,null,"Faucet aerators","Duct Sealing and Insulation",null,"Install TRVs or radiator valves","Interior Lighting"]
[null,"Lighting","Lighting","Interior Lighting",null,null,null,null,"Thermostatic Shower Restriction Valve","Heating/Cooling, Steam Pipe Insulation",null,"Steam Trap - Low Pressure"]
[null,"Envelope/Shell","EnvelopeShell","Airsealing",null,null,null,null,null,"Insulation (Attic Access)"]
[null,"Envelope/Shell","EnvelopeShell","Duct Sealing and Insulation",null,"MeasureType1","Non End Use Incentive Category",null,null,"Insulation (basement)"]
[null,"Envelope/Shell","EnvelopeShell","Insulation (Attic Access)",null,"Deep Retrofit","Technical Assistance",null,null,"Insulation (roof)"]
[null,"Envelope/Shell","EnvelopeShell","Insulation (basement)",null,"Electrification - DHW","Concierge Services",null,null,"Insulation (Wall)"]
[null,"Envelope/Shell","EnvelopeShell","Insulation (roof)",null,"Electrification - H&C","Floodproofing Design",null,null,"Room (RAC) Cover and Gap Sealer"]
[null,"Envelope/Shell","EnvelopeShell","Insulation (Wall)",null,"Prescriptive",null,null,null,"Window Replacement"]
[null,"Envelope/Shell","EnvelopeShell","Window Replacement",null,"Resilience Enhancement"]
{"$rows_left_out":42}
{"sheet":"Support - Estimated Savings","index":3,"n_rows":37,"n_cols":29,"rows_kept":37,"cut":false,"hidden":true,"merged":[[2,4,2,12],[2,13,2,21],[3,4,3,6],[3,7,3,9],[3,10,3,12],[3,13,3,15],[3,16,3,18],[3,19,3,21]]}
["* Data from \"AMP Up Estimated Savings Calculator Rev0\" Excel sent to Pam Miller and Jackie Albanese from Eva Spazzarini on 4/2/2026. Email titled \"AMP Up - Estimated Savings\""]
[]
[null,null,null,null,"Salesforce Estimated Savings Inputs (per unit per year)",null,null,null,null,null,null,null,null,"Salesforce Estimated Savings Inputs per year"]
[null,null,null,null,"MMBtu",null,null,"kWh",null,null,"Demand kW",null,null,"MMBtu",null,null,"kWh",null,null,"Demand kW"]
["Measure #","Incentive Category","Measure Category","Measure Classification","Low","Mid","High","Low","Mid","High","Low","Mid","High","Low","Mid","High","Low","Mid","High","Low","Mid","High","Low Total MMBtu","Mid Total MMBtu","High Total MMBtu","Included in Results table above?","Total MMBtu Savings Low","Total MMBtu Savings Mid","Total MMBtu Savings Mid"]
[1,"Appliance","Appliances","Refrigerator (w. Freezer)","-","-","-",73.2072,73.2072,73.2072,1.5591900000000001E-2,1.5591900000000001E-2,1.5591900000000001E-2,{"$f":"IFERROR(ROUND('INTERNAL Funding Distrubution'!$D$16*E6,2),\"\")","v":""},{"$f":"IFERROR(ROUND('INTERNAL Funding Distrubution'!$D$16*F6,2),\"\")","v":""},{"$f":"IFERROR(ROUND('INTERNAL Funding Distrubution'!$D$16*G6,2),\"\")","v":""},{"$f":"IFERROR(ROUND('INTERNAL Funding Distrubution'!$D$16*H6,2),\"\")","v":0},{"$f":"IFERROR(ROUND('INTERNAL Funding Distrubution'!$D$16*I6,2),\"\")","v":0},{"$f":"IFERROR(ROUND('INTERNAL Funding Distrubution'!$D$16*J6,2),\"\")","v":0},{"$f":"IFERROR(ROUND('INTERNAL Funding Distrubution'!$D$16*K6,2),\"\")","v":0},{"$f":"IFERROR(ROUND('INTERNAL Funding Distrubution'!$D$16*L6,2),\"\")","v":0},{"$f":"IFERROR(ROUND('INTERNAL Funding Distrubution'!$D$16*M6,2),\"\")","v":0},{"$f":"IFERROR(VALUE(Q6),0)*3412/1000000+IFERROR(VALUE(N6),0)","v":0},{"$f":"IFERROR(VALUE(R6),0)*3412/1000000+IFERROR(VALUE(O6),0)","v":0},{"$f":"IFERROR(VALUE(S6),0)*3412/1000000+IFERROR(VALUE(P6),0)","v":0},"Yes",{"$f":"SUM(IFERROR(Q6*3412/1000000,0),N6)","v":0},{"$f":"SUM(IFERROR(R6*3412/1000000,0),O6)","v":0},{"$f":"SUM(IFERROR(S6*3412/1000000,0),P6)","v":0}]
[2,"Prescriptive","Hot Water","Efficient-flow showerheads","-",1.3463100000000001,2.0053550000000002,346.38649500000002,"-","-","-","-","-",{"$f":"IFERROR(ROUND('INTERNAL Funding Distrubution'!$D$16*E7,2),\"\")","v":""},{"$f":"IFERROR(ROUND('INTERNAL Funding Distrubution'!$D$16*F7,2),\"\")","v":0},{"$f":"IFERROR(ROUND('INTERNAL Funding Distrubution'!$D$16*G7,2),\"\")","v":0},{"$f":"IFERROR(ROUND('INTERNAL Funding Distrubution'!$D$16*H7,2),\"\")","v":0},{"$f":"IFERROR(ROUND('INTERNAL Funding Distrubution'!$D$16*I7,2),\"\")","v":""},{"$f":"IFERROR(ROUND('INTERNAL Funding Distrubution'!$D$16*J7,2),\"\")","v":""},{"$f":"IFERROR(ROUND('INTERNAL Funding Distrubution'!$D$16*K7,2),\"\")","v":""},{"$f":"IFERROR(ROUND('INTERNAL Funding Distrubution'!$D$16*L7,2),\"\")","v":""},{"$f":"IFERROR(ROUND('INTERNAL Funding Distrubution'!$D$16*M7,2),\"\")","v":""},0,0,0,null,0,0,0]
[3,"Prescriptive","Hot Water","Faucet aerators","-",8.7645000000000001E-2,0.13055,22.550065,"-","-","-","-","-",{"$f":"IFERROR(ROUND('INTERNAL Funding Distrubution'!$D$16*E8,2),\"\")","v":""},{"$f":"IFERROR(ROUND('INTERNAL Funding Distrubution'!$D$16*F8,2),\"\")","v":0},{"$f":"IFERROR(ROUND('INTERNAL Funding Distrubution'!$D$16*G8,2),\"\")","v":0},{"$f":"IFERROR(ROUND('INTERNAL Funding Distrubution'!$D$16*H8,2),\"\")","v":0},{"$f":"IFERROR(ROUND('INTERNAL Funding Distrubution'!$D$16*I8,2),\"\")","v":""},{"$f":"IFERROR(ROUND('INTERNAL Funding Distrubution'!$D$16*J8,2),\"\")","v":""},{"$f":"IFERROR(ROUND('INTERNAL Funding Distrubution'!$D$16*K8,2),\"\")","v":""},{"$f":"IFERROR(ROUND('INTERNAL Funding Distrubution'!$D$16*L8,2),\"\")","v":""},{"$f":"IFERROR(ROUND('INTERNAL Funding Distrubution'!$D$16*M8,2),\"\")","v":""},0,0,0,"Yes",0,0,0]
[4,"Prescriptive","Hot Water","Thermostatic Shower Restriction Valve","-",0.31030999999999997,0.46220999999999995,79.837864999999994,"-","-","-","-","-",{"$f":"IFERROR(ROUND('INTERNAL Funding Distrubution'!$D$16*E9,2),\"\")","v":""},{"$f":"IFERROR(ROUND('INTERNAL Funding Distrubution'!$D$16*F9,2),\"\")","v":0},{"$f":"IFERROR(ROUND('INTERNAL Funding Distrubution'!$D$16*G9,2),\"\")","v":0},{"$f":"IFERROR(ROUND('INTERNAL Funding Distrubution'!$D$16*H9,2),\"\")","v":0},{"$f":"IFERROR(ROUND('INTERNAL Funding Distrubution'!$D$16*I9,2),\"\")","v":""},{"$f":"IFERROR(ROUND('INTERNAL Funding Distrubution'!$D$16*J9,2),\"\")","v":""},{"$f":"IFERROR(ROUND('INTERNAL Funding Distrubution'!$D$16*K9,2),\"\")","v":""},{"$f":"IFERROR(ROUND('INTERNAL Funding Distrubution'!$D$16*L9,2),\"\")","v":""},{"$f":"IFERROR(ROUND('INTERNAL Funding Distrubution'!$D$16*M9,2),\"\")","v":""},0,0,0,null,0,0,0]
[5,"Prescriptive","Envelope/Shell","Room (RAC) Cover and Gap Sealer","-",3.9343000000000004,3.9343000000000004,"-","-","-","-","-","-",{"$f":"IFERROR(ROUND('INTERNAL Funding Distrubution'!$D$16*E10,2),\"\")","v":""},{"$f":"IFERROR(ROUND('INTERNAL Funding Distrubution'!$D$16*F10,2),\"\")","v":0},{"$f":"IFERROR(ROUND('INTERNAL Funding Distrubution'!$D$16*G10,2),\"\")","v":0},{"$f":"IFERROR(ROUND('INTERNAL Funding Distrubution'!$D$16*H10,2),\"\")","v":""},{"$f":"IFERROR(ROUND('INTERNAL Funding Distrubution'!$D$16*I10,2),\"\")","v":""},{"$f":"IFERROR(ROUND('INTERNAL Funding Distrubution'!$D$16*J10,2),\"\")","v":""},{"$f":"IFERROR(ROUND('INTERNAL Funding Distrubution'!$D$16*K10,2),\"\")","v":""},{"$f":"IFERROR(ROUND('INTERNAL Funding Distrubution'!$D$16*L10,2),\"\")","v":""},{"$f":"IFERROR(ROUND('INTERNAL Funding Distrubution'!$D$16*M10,2),\"\")","v":""},0,0,0,null,0,0,0]
[6,"Prescriptive","HVAC","Heating/Cooling, Steam Pipe Insulation",3.68E-5,3.68E-5,3.68E-5,"-","-","-","-","-","-",{"$f":"IFERROR(ROUND('INTERNAL Funding Distrubution'!$D$16*E11,2),\"\")","v":0},{"$f":"IFERROR(ROUND('INTERNAL Funding Distrubution'!$D$16*F11,2),\"\")","v":0},{"$f":"IFERROR(ROUND('INTERNAL Funding Distrubution'!$D$16*G11,2),\"\")","v":0},{"$f":"IFERROR(ROUND('INTERNAL Funding Distrubution'!$D$16*H11,2),\"\")","v":""},{"$f":"IFERROR(ROUND('INTERNAL Funding Distrubution'!$D$16*I11,2),\"\")","v":""},{"$f":"IFERROR(ROUND('INTERNAL Funding Distrubution'!$D$16*J11,2),\"\")","v":""},{"$f":"IFERROR(ROUND('INTERNAL Funding Distrubution'!$D$16*K11,2),\"\")","v":""},{"$f":"IFERROR(ROUND('INTERNAL Funding Distrubution'!$D$16*L11,2),\"\")","v":""},{"$f":"IFERROR(ROUND('INTERNAL Funding Distrubution'!$D$16*M11,2),\"\")","v":""},0,0,0,null,0,0,0]
[7,"Prescriptive","HVAC","Primary HVAC combustion tune-up (Boiler/Furnace)","-",0.18036885714285716,0.18036885714285716,"-","-","-","-","-","-",{"$f":"IFERROR(ROUND('INTERNAL Funding Distrubution'!$D$16*E12,2),\"\")","v":""},{"$f":"IFERROR(ROUND('INTERNAL Funding Distrubution'!$D$16*F12,2),\"\")","v":0},{"$f":"IFERROR(ROUND('INTERNAL Funding Distrubution'!$D$16*G12,2),\"\")","v":0},{"$f":"IFERROR(ROUND('INTERNAL Funding Distrubution'!$D$16*H12,2),\"\")","v":""},{"$f":"IFERROR(ROUND('INTERNAL Funding Distrubution'!$D$16*I12,2),\"\")","v":""},{"$f":"IFERROR(ROUND('INTERNAL Funding Distrubution'!$D$16*J12,2),\"\")","v":""},{"$f":"IFERROR(ROUND('INTERNAL Funding Distrubution'!$D$16*K12,2),\"\")","v":""},{"$f":"IFERROR(ROUND('INTERNAL Funding Distrubution'!$D$16*L12,2),\"\")","v":""},{"$f":"IFERROR(ROUND('INTERNAL Funding Distrubution'!$D$16*M12,2),\"\")","v":""},0,0,0,null,0,0,0]
[8,"Prescriptive","Controls","Advanced Thermostat","-",3.6358347107438016,3.6358347107438016,"-",284.1229917355372,284.1229917355372,"-","-","-",{"$f":"IFERROR(ROUND('INTERNAL Funding Distrubution'!$D$16*E13,2),\"\")","v":""},{"$f":"IFERROR(ROUND('INTERNAL Funding Distrubution'!$D$16*F13,2),\"\")","v":0},{"$f":"IFERROR(ROUND('INTERNAL Funding Distrubution'!$D$16*G13,2),\"\")","v":0},{"$f":"IFERROR(ROUND('INTERNAL Funding Distrubution'!$D$16*H13,2),\"\")","v":""},{"$f":"IFERROR(ROUND('INTERNAL Funding Distrubution'!$D$16*I13,2),\"\")","v":0},{"$f":"IFERROR(ROUND('INTERNAL Funding Distrubution'!$D$16*J13,2),\"\")","v":0},{"$f":"IFERROR(ROUND('INTERNAL Funding Distrubution'!$D$16*K13,2),\"\")","v":""},{"$f":"IFERROR(ROUND('INTERNAL Funding Distrubution'!$D$16*L13,2),\"\")","v":""},{"$f":"IFERROR(ROUND('INTERNAL Funding Distrubution'!$D$16*M13,2),\"\")","v":""},0,0,0,null,0,0,0]
[9,"Prescriptive","Controls","Install TRVs or radiator valves",2.5990839694656489,2.5990839694656489,2.5990839694656489,"-","-","-","-","-","-",{"$f":"IFERROR(ROUND('INTERNAL Funding Distrubution'!$D$16*E14,2),\"\")","v":0},{"$f":"IFERROR(ROUND('INTERNAL Funding Distrubution'!$D$16*F14,2),\"\")","v":0},{"$f":"IFERROR(ROUND('INTERNAL Funding Distrubution'!$D$16*G14,2),\"\")","v":0},{"$f":"IFERROR(ROUND('INTERNAL Funding Distrubution'!$D$16*H14,2),\"\")","v":""},{"$f":"IFERROR(ROUND('INTERNAL Funding Distrubution'!$D$16*I14,2),\"\")","v":""},{"$f":"IFERROR(ROUND('INTERNAL Funding Distrubution'!$D$16*J14,2),\"\")","v":""},{"$f":"IFERROR(ROUND('INTERNAL Funding Distrubution'!$D$16*K14,2),\"\")","v":""},{"$f":"IFERROR(ROUND('INTERNAL Funding Distrubution'!$D$16*L14,2),\"\")","v":""},{"$f":"IFERROR(ROUND('INTERNAL Funding Distrubution'!$D$16*M14,2),\"\")","v":""},0,0,0,null,0,0,0]
[10,"Prescriptive","Controls","Steam Trap - Low Pressure",0.16033444999999999,0.16033444999999999,0.16033444999999999,"-","-","-","-","-","-",{"$f":"IFERROR(ROUND('INTERNAL Funding Distrubution'!$D$16*E15,2),\"\")","v":0},{"$f":"IFERROR(ROUND('INTERNAL Funding Distrubution'!$D$16*F15,2),\"\")","v":0},{"$f":"IFERROR(ROUND('INTERNAL Funding Distrubution'!$D$16*G15,2),\"\")","v":0},{"$f":"IFERROR(ROUND('INTERNAL Funding Distrubution'!$D$16*H15,2),\"\")","v":""},{"$f":"IFERROR(ROUND('INTERNAL Funding Distrubution'!$D$16*I15,2),\"\")","v":""},{"$f":"IFERROR(ROUND('INTERNAL Funding Distrubution'!$D$16*J15,2),\"\")","v":""},{"$f":"IFERROR(ROUND('INTERNAL Funding Distrubution'!$D$16*K15,2),\"\")","v":""},{"$f":"IFERROR(ROUND('INTERNAL Funding Distrubution'!$D$16*L15,2),\"\")","v":""},{"$f":"IFERROR(ROUND('INTERNAL Funding Distrubution'!$D$16*M15,2),\"\")","v":""},0,0,0,null,0,0,0]
[11,"Prescriptive","Lighting","Exterior Lighting","-","-","-",12.512865,45.354890173410404,64.94285714285715,5.5049999999999995E-3,1.9953757225433525E-2,2.8571428571428574E-2,{"$f":"IFERROR(ROUND('INTERNAL Funding Distrubution'!$D$16*E16,2),\"\")","v":""},{"$f":"IFERROR(ROUND('INTERNAL Funding Distrubution'!$D$16*F16,2),\"\")","v":""},{"$f":"IFERROR(ROUND('INTERNAL Funding Distrubution'!$D$16*G16,2),\"\")","v":""},{"$f":"IFERROR(ROUND('INTERNAL Funding Distrubution'!$D$16*H16,2),\"\")","v":0},{"$f":"IFERROR(ROUND('INTERNAL Funding Distrubution'!$D$16*I16,2),\"\")","v":0},{"$f":"IFERROR(ROUND('INTERNAL Funding Distrubution'!$D$16*J16,2),\"\")","v":0},{"$f":"IFERROR(ROUND('INTERNAL Funding Distrubution'!$D$16*K16,2),\"\")","v":0},{"$f":"IFERROR(ROUND('INTERNAL Funding Distrubution'!$D$16*L16,2),\"\")","v":0},{"$f":"IFERROR(ROUND('INTERNAL Funding Distrubution'!$D$16*M16,2),\"\")","v":0},0,0,0,"Yes",0,0,0]
[12,"Prescriptive","Lighting","Interior Lighting",-0.95808661849710985,"-","-",577.61351523121391,482.76293994219651,482.76293994219651,0.65299727167630062,0.65299727167630062,0.65299727167630062,{"$f":"IFERROR(ROUND('INTERNAL Funding Distrubution'!$D$16*E17,2),\"\")","v":0},{"$f":"IFERROR(ROUND('INTERNAL Funding Distrubution'!$D$16*F17,2),\"\")","v":""},{"$f":"IFERROR(ROUND('INTERNAL Funding Distrubution'!$D$16*G17,2),\"\")","v":""},{"$f":"IFERROR(ROUND('INTERNAL Funding Distrubution'!$D$16*H17,2),\"\")","v":0},{"$f":"IFERROR(ROUND('INTERNAL Funding Distrubution'!$D$16*I17,2),\"\")","v":0},{"$f":"IFERROR(ROUND('INTERNAL Funding Distrubution'!$D$16*J17,2),\"\")","v":0},{"$f":"IFERROR(ROUND('INTERNAL Funding Distrubution'!$D$16*K17,2),\"\")","v":0},{"$f":"IFERROR(ROUND('INTERNAL Funding Distrubution'!$D$16*L17,2),\"\")","v":0},{"$f":"IFERROR(ROUND('INTERNAL Funding Distrubution'!$D$16*M17,2),\"\")","v":0},0,0,0,null,0,0,0]
[13,"Weatherization","Envelope/Shell","Airsealing","-",5.2564892023121388,5.2564892023121388,733.71828439306364,32.853057225433531,32.853057225433531,6.0449624277456641E-2,6.0449624277456641E-2,6.0449624277456641E-2,{"$f":"IFERROR(ROUND('INTERNAL Funding Distrubution'!$D$16*E18,2),\"\")","v":""},{"$f":"IFERROR(ROUND('INTERNAL Funding Distrubution'!$D$16*F18,2),\"\")","v":0},{"$f":"IFERROR(ROUND('INTERNAL Funding Distrubution'!$D$16*G18,2),\"\")","v":0},{"$f":"IFERROR(ROUND('INTERNAL Funding Distrubution'!$D$16*H18,2),\"\")","v":0},{"$f":"IFERROR(ROUND('INTERNAL Funding Distrubution'!$D$16*I18,2),\"\")","v":0},{"$f":"IFERROR(ROUND('INTERNAL Funding Distrubution'!$D$16*J18,2),\"\")","v":0},{"$f":"IFERROR(ROUND('INTERNAL Funding Distrubution'!$D$16*K18,2),\"\")","v":0},{"$f":"IFERROR(ROUND('INTERNAL Funding Distrubution'!$D$16*L18,2),\"\")","v":0},{"$f":"IFERROR(ROUND('INTERNAL Funding Distrubution'!$D$16*M18,2),\"\")","v":0},0,0,0,null,0,0,0]
[14,"Weatherization","HVAC","Duct Sealing and Insulation","-",0.70500924277456645,0.70500924277456645,7.1262011560693637,7.1262011560693637,7.1262011560693637,1.7880289017341042E-2,1.7880289017341042E-2,1.7880289017341042E-2,{"$f":"IFERROR(ROUND('INTERNAL Funding Distrubution'!$D$16*E19,2),\"\")","v":""},{"$f":"IFERROR(ROUND('INTERNAL Funding Distrubution'!$D$16*F19,2),\"\")","v":0},{"$f":"IFERROR(ROUND('INTERNAL Funding Distrubution'!$D$16*G19,2),\"\")","v":0},{"$f":"IFERROR(ROUND('INTERNAL Funding Distrubution'!$D$16*H19,2),\"\")","v":0},{"$f":"IFERROR(ROUND('INTERNAL Funding Distrubution'!$D$16*I19,2),\"\")","v":0},{"$f":"IFERROR(ROUND('INTERNAL Funding Distrubution'!$D$16*J19,2),\"\")","v":0},{"$f":"IFERROR(ROUND('INTERNAL Funding Distrubution'!$D$16*K19,2),\"\")","v":0},{"$f":"IFERROR(ROUND('INTERNAL Funding Distrubution'!$D$16*L19,2),\"\")","v":0},{"$f":"IFERROR(ROUND('INTERNAL Funding Distrubution'!$D$16*M19,2),\"\")","v":0},0,0,0,null,0,0,0]
[15,"Weatherization","Envelope/Shell","Insulation (Attic Access)","-",2.3355924855491327E-2,2.3355924855491327E-2,1.0893549132947977,2.7784393063583816E-2,2.7784393063583816E-2,1.2601156069364162E-6,1.2601156069364162E-6,1.2601156069364162E-6,{"$f":"IFERROR(ROUND('INTERNAL Funding Distrubution'!$D$16*E20,2),\"\")","v":""},{"$f":"IFERROR(ROUND('INTERNAL Funding Distrubution'!$D$16*F20,2),\"\")","v":0},{"$f":"IFERROR(ROUND('INTERNAL Funding Distrubution'!$D$16*G20,2),\"\")","v":0},{"$f":"IFERROR(ROUND('INTERNAL Funding Distrubution'!$D$16*H20,2),\"\")","v":0},{"$f":"IFERROR(ROUND('INTERNAL Funding Distrubution'!$D$16*I20,2),\"\")","v":0},{"$f":"IFERROR(ROUND('INTERNAL Funding Distrubution'!$D$16*J20,2),\"\")","v":0},{"$f":"IFERROR(ROUND('INTERNAL Funding Distrubution'!$D$16*K20,2),\"\")","v":0},{"$f":"IFERROR(ROUND('INTERNAL Funding Distrubution'!$D$16*L20,2),\"\")","v":0},{"$f":"IFERROR(ROUND('INTERNAL Funding Distrubution'!$D$16*M20,2),\"\")","v":0},0,0,0,null,0,0,0]
{"$rows_left_out":18}
{"sheet":"Support - Funding Distrubution ","index":4,"n_rows":15,"n_cols":13,"rows_kept":15,"cut":false,"hidden":true,"merged":[[1,7,3,7],[4,7,8,7],[9,7,14,7],[0,7,0,8],[0,0,0,1],[1,0,3,0],[4,0,8,0],[9,0,14,0]]}
["Low-Rise (5-20 units)",null,"Stage 1","Stage 2","Stage 3","Stage 4",null,"Large Building (21+ units)",null,"Stage 1","Stage 2","Stage 3","Stage 4"]
["Non End-Use","Technical Assistance",0.75,0.25,0,0,null,"Non End-Use","Technical Assistance",0.75,0.25,0,0]
[null,"Concierge Services",0.75,0.25,0,0,null,null,"Concierge",0.75,0.25,0,0]
[null,"Floodproofing Design",1,0,0,0,null,null,"Floodproofing Design",1,0,0,0]
["End-Use ","Appliances ",0,0,1,0,null,"End-Use ","Appliances ",0,0,1,0]
[null,"Prescriptive",0.25,0.25,0.25,0.25,null,null,"Prescriptive",0.25,0,0.4,0.35]
[null,"Weatherization",0.25,0.25,0.25,0.25,null,null,"Weatherization",0.25,0,0.4,0.35]
[null,"Electrification",0.25,0.25,0.25,0.25,null,null,"Electrification",0.25,0,0.4,0.35]
[null,"Deep Retrofit",0.25,0.25,0.25,0.25,null,null,"Deep Retrofit",0.25,0,0.4,0.35]
["Resilience","Heat Pump Floodproofing",0.25,0.25,0.25,0.25,null,"Resilience","Heat Pump Floodproofing",0.25,0,0.4,0.35]
[null,"Heat Pump Water Heater Floodproofing",0.25,0.25,0.25,0.25,null,null,"Heat Pump Water Heater Floodproofing",0.25,0,0.4,0.35]
[null,"Advanced Ventilation Floodproofing",0.25,0.25,0.25,0.25,null,null,"Advanced Ventilation Floodproofing",0.25,0,0.4,0.35]
[null,"Electrical Panel Elevation",0.25,0.25,0.25,0.25,null,null,"Electrical Panel Elevation",0.25,0,0.4,0.35]
[null,"Electrification for Heat Vulnerable Populations",0,0,0,1,null,null,"Electrification for Heat Vulnerable Populations",0,0,0,1]
[null,"Hurricane Resistant Windows",0,0,0,1,null,null,"Hurricane Resistant Windows",0,0,0,1]